maven-notifications mailing list archives

Site index · List index
Message view « Date » · « Thread »
Top « Date » · « Thread »
From Apache Jenkins Server <jenk...@builds.apache.org>
Subject Build failed in Jenkins: Maven TLP » maven-site » MNG-5940 #23
Date Wed, 13 Feb 2019 07:13:14 GMT
See https://builds.apache.org/job/maven-box/job/maven-site/job/MNG-5940/23/

Changes:

* JDK 12 is now in the Release Candidate Phase
* [INFRA-17514] Jenkins invoker-plugin updated by INFRA

No tests ran.

Build log:
Branch indexing
Obtained Jenkinsfile from dc40536effb28dea0bb481850f29dc22a8e49549
Running in Durability level: MAX_SURVIVABILITY
Loading library jenkins-env@master
Attempting to resolve master from remote references...
 > git --version # timeout=10
 > git ls-remote -h https://gitbox.apache.org/repos/asf/maven-jenkins-env.git # timeout=10
Found match: refs/heads/master revision 301add823574336a6bc9f551351ac881b87e0d79
 > git rev-parse --is-inside-work-tree # timeout=10
Fetching changes from the remote Git repository
 > git config remote.origin.url https://gitbox.apache.org/repos/asf/maven-jenkins-env.git
# timeout=10
Fetching without tags
Fetching upstream changes from https://gitbox.apache.org/repos/asf/maven-jenkins-env.git
 > git --version # timeout=10
 > git fetch --no-tags --progress https://gitbox.apache.org/repos/asf/maven-jenkins-env.git
+refs/heads/*:refs/remotes/origin/*
Checking out Revision 301add823574336a6bc9f551351ac881b87e0d79 (master)
 > git config core.sparsecheckout # timeout=10
 > git checkout -f 301add823574336a6bc9f551351ac881b87e0d79
Commit message: "Add support for Maven 3.6.x/3.6.0"
 > git rev-list --no-walk 301add823574336a6bc9f551351ac881b87e0d79 # timeout=10
Loading library jenkins-lib@master
Attempting to resolve master from remote references...
 > git --version # timeout=10
 > git ls-remote -h https://gitbox.apache.org/repos/asf/maven-jenkins-lib.git # timeout=10
Found match: refs/heads/master revision d44ea6697c8090e41a63584e6e15cd8e9d903a1f
 > git rev-parse --is-inside-work-tree # timeout=10
Fetching changes from the remote Git repository
 > git config remote.origin.url https://gitbox.apache.org/repos/asf/maven-jenkins-lib.git
# timeout=10
Fetching without tags
Fetching upstream changes from https://gitbox.apache.org/repos/asf/maven-jenkins-lib.git
 > git --version # timeout=10
 > git fetch --no-tags --progress https://gitbox.apache.org/repos/asf/maven-jenkins-lib.git
+refs/heads/*:refs/remotes/origin/*
Checking out Revision d44ea6697c8090e41a63584e6e15cd8e9d903a1f (master)
 > git config core.sparsecheckout # timeout=10
 > git checkout -f d44ea6697c8090e41a63584e6e15cd8e9d903a1f
Commit message: "[INFRA-17514] Jenkins invoker-plugin updated by INFRA"
 > git rev-list --no-walk 758b9a7c6749fde348ad70a4505011eb978235ab # timeout=10
[Pipeline] node
Running on websites1 in /home/jenkins/jenkins-slave/workspace/ven-box_maven-site_MNG-5940-R7ZPTTNRDZNPHVI7PL4TMFQGIC5LFUCK5IWKE4AQAYNXVPJILVOQ
[Pipeline] {
[Pipeline] stage
[Pipeline] { (Declarative: Checkout SCM)
[Pipeline] checkout
Fetching changes from the remote Git repository
Fetching without tags
 > git rev-parse --is-inside-work-tree # timeout=10
 > git config remote.origin.url https://gitbox.apache.org/repos/asf/maven-site.git # timeout=10
Fetching upstream changes from https://gitbox.apache.org/repos/asf/maven-site.git
 > git --version # timeout=10
 > git fetch --no-tags --progress https://gitbox.apache.org/repos/asf/maven-site.git +refs/heads/*:refs/remotes/origin/*
Checking out Revision dc40536effb28dea0bb481850f29dc22a8e49549 (MNG-5940)
Commit message: "[MNG-5940] Change the maven-source-plugin jar goal into jar-no-fork in Maven
Super POM"
Cleaning workspace
[Pipeline] }
[Pipeline] // stage
[Pipeline] withEnv
[Pipeline] {
[Pipeline] timeout
Timeout set to expire in 10 min
[Pipeline] {
[Pipeline] timestamps
[Pipeline] {
[Pipeline] ansiColor
[Pipeline] {
[Pipeline] stage
[Pipeline] { (Build)
[Pipeline] withMaven
[withMaven] Options: [org.jenkinsci.plugins.pipeline.maven.publishers.GeneratedArtifactsPublisher[disabled=true],
JunitTestsPublisher[disabled=true,healthScaleFactor=,keepLongStdio=false,ignoreAttachments=false],
org.jenkinsci.plugins.pipeline.maven.publishers.FindbugsAnalysisPublisher[disabled='true',
healthy='', unHealthy='', thresholdLimit='low'], org.jenkinsci.plugins.pipeline.maven.publishers.TasksScannerPublisher[disabled='true',
healthy='', unHealthy='', thresholdLimit='low']]
[withMaven] Available options: 
[withMaven] using JDK installation JDK 1.8 (latest)
 > git config core.sparsecheckout # timeout=10
 > git checkout -f dc40536effb28dea0bb481850f29dc22a8e49549
 > git rev-list --no-walk dc40536effb28dea0bb481850f29dc22a8e49549 # timeout=10
 > git rev-parse --verify HEAD # timeout=10
Resetting working tree
 > git reset --hard # timeout=10
 > git clean -fdx # timeout=10
[withMaven] using Maven installation 'Maven 3 (latest)'
[Pipeline] {
[Pipeline] sh
+ mvn clean site
----- withMaven Wrapper script -----
Picked up JAVA_TOOL_OPTIONS: -Dmaven.ext.class.path="/home/jenkins/jenkins-slave/workspace/ven-box_maven-site_MNG-5940-R7ZPTTNRDZNPHVI7PL4TMFQGIC5LFUCK5IWKE4AQAYNXVPJILVOQ@tmp/withMaven1524fdb4/pipeline-maven-spy.jar"
-Dorg.jenkinsci.plugins.pipeline.maven.reportsFolder="/home/jenkins/jenkins-slave/workspace/ven-box_maven-site_MNG-5940-R7ZPTTNRDZNPHVI7PL4TMFQGIC5LFUCK5IWKE4AQAYNXVPJILVOQ@tmp/withMaven1524fdb4"

Apache Maven 3.6.0 (97c98ec64a1fdfee7767ce5ffb20918da4f719f3; 2018-10-24T18:41:47Z)
Maven home: /home/jenkins/tools/maven/latest3
Java version: 1.8.0_191, vendor: Oracle Corporation, runtime: /usr/local/asfpackages/java/jdk1.8.0_191/jre
Default locale: en_US, platform encoding: UTF-8
OS name: "linux", version: "4.4.0-116-generic", arch: "amd64", family: "unix"
[INFO] [jenkins-event-spy] Generate /home/jenkins/jenkins-slave/workspace/ven-box_maven-site_MNG-5940-R7ZPTTNRDZNPHVI7PL4TMFQGIC5LFUCK5IWKE4AQAYNXVPJILVOQ@tmp/withMaven1524fdb4/maven-spy-20190213-071312-6804787942962352632487.log.tmp
...
[INFO] Scanning for projects...
[INFO] Downloading from Nexus: http://repository.apache.org/snapshots/org/apache/maven/maven-parent/32-SNAPSHOT/maven-metadata.xml
[INFO] Downloading from Nexus: http://repository.apache.org/snapshots/org/apache/maven/maven-parent/32-SNAPSHOT/maven-parent-32-SNAPSHOT.pom
[ERROR] [ERROR] Some problems were encountered while processing the POMs:
[FATAL] Non-resolvable parent POM for org.apache.maven:maven-site:1.0: Could not find artifact
org.apache.maven:maven-parent:pom:32-SNAPSHOT in Nexus (http://repository.apache.org/snapshots)
and 'parent.relativePath' points at wrong local POM @ line 23, column 11
 @ 
[INFO] [jenkins-event-spy] Generated /home/jenkins/jenkins-slave/workspace/ven-box_maven-site_MNG-5940-R7ZPTTNRDZNPHVI7PL4TMFQGIC5LFUCK5IWKE4AQAYNXVPJILVOQ@tmp/withMaven1524fdb4/maven-spy-20190213-071312-6804787942962352632487.log
[ERROR] The build could not read 1 project -> [Help 1]
[ERROR]   
[ERROR]   The project org.apache.maven:maven-site:1.0 (/home/jenkins/jenkins-slave/workspace/ven-box_maven-site_MNG-5940-R7ZPTTNRDZNPHVI7PL4TMFQGIC5LFUCK5IWKE4AQAYNXVPJILVOQ/pom.xml)
has 1 error
[ERROR]     Non-resolvable parent POM for org.apache.maven:maven-site:1.0: Could not find
artifact org.apache.maven:maven-parent:pom:32-SNAPSHOT in Nexus (http://repository.apache.org/snapshots)
and 'parent.relativePath' points at wrong local POM @ line 23, column 11 -> [Help 2]
[ERROR] 
[ERROR] To see the full stack trace of the errors, re-run Maven with the -e switch.
[ERROR] Re-run Maven using the -X switch to enable full debug logging.
[ERROR] 
[ERROR] For more information about the errors and possible solutions, please read the following
articles:
[ERROR] [Help 1] http://cwiki.apache.org/confluence/display/MAVEN/ProjectBuildingException
[ERROR] [Help 2] http://cwiki.apache.org/confluence/display/MAVEN/UnresolvableModelException
[Pipeline] }
[withMaven] Publishers: 
[Pipeline] // withMaven
[Pipeline] }
[Pipeline] // stage
[Pipeline] stage
[Pipeline] { (Deploy)
Stage "Deploy" skipped due to earlier failure(s)
[Pipeline] }
[Pipeline] // stage
[Pipeline] stage
[Pipeline] { (Declarative: Post Actions)
[Pipeline] echo
Build result: FAILURE
[Pipeline] jiraIssueSelector
[Pipeline] emailext
Mime
  • Unnamed multipart/mixed (inline, None, 0 bytes)
View raw message