maven-notifications mailing list archives

Site index · List index
Message view « Date » · « Thread »
Top « Date » · « Thread »
From Apache Jenkins Server <jenk...@builds.apache.org>
Subject Build unstable in Jenkins: Maven TLP » maven-scm » SCM-877 #22
Date Wed, 13 Feb 2019 10:06:04 GMT
See https://builds.apache.org/job/maven-box/job/maven-scm/job/SCM-877/22/

Changes:

* JDK 12 is now in the Release Candidate Phase
* [INFRA-17514] Jenkins invoker-plugin updated by INFRA

15 tests failed.
FAILED:  org.apache.maven.scm.plugin.CheckoutMojoTest.windows-jdk7 / Build windows-jdk7 /
testExcludeInclude

Error Message:
Cannot run checkout command : 

Stack Trace:
org.apache.maven.plugin.MojoExecutionException: Cannot run checkout command : 
	at org.apache.maven.scm.plugin.CheckoutMojoTest.testExcludeInclude(CheckoutMojoTest.java:153)
Caused by: org.apache.maven.scm.ScmException: Can't load the scm provider.
	at org.apache.maven.scm.plugin.CheckoutMojoTest.testExcludeInclude(CheckoutMojoTest.java:153)
Caused by: org.apache.maven.scm.repository.ScmRepositoryException: The scm url is invalid.
	at org.apache.maven.scm.plugin.CheckoutMojoTest.testExcludeInclude(CheckoutMojoTest.java:153)


FAILED:  org.apache.maven.scm.plugin.CheckoutMojoTest.windows-jdk7 / Build windows-jdk7 /
testUseExport

Error Message:
Cannot run checkout command : 

Stack Trace:
org.apache.maven.plugin.MojoExecutionException: Cannot run checkout command : 
	at org.apache.maven.scm.plugin.CheckoutMojoTest.testUseExport(CheckoutMojoTest.java:132)
Caused by: org.apache.maven.scm.ScmException: Can't load the scm provider.
	at org.apache.maven.scm.plugin.CheckoutMojoTest.testUseExport(CheckoutMojoTest.java:132)
Caused by: org.apache.maven.scm.repository.ScmRepositoryException: The scm url is invalid.
	at org.apache.maven.scm.plugin.CheckoutMojoTest.testUseExport(CheckoutMojoTest.java:132)


FAILED:  org.apache.maven.scm.plugin.CheckoutMojoTest.windows-jdk8 / Build windows-jdk8 /
testExcludeInclude

Error Message:
Cannot run checkout command : 

Stack Trace:
org.apache.maven.plugin.MojoExecutionException: Cannot run checkout command : 
	at org.apache.maven.scm.plugin.CheckoutMojoTest.testExcludeInclude(CheckoutMojoTest.java:153)
Caused by: org.apache.maven.scm.ScmException: Can't load the scm provider.
	at org.apache.maven.scm.plugin.CheckoutMojoTest.testExcludeInclude(CheckoutMojoTest.java:153)
Caused by: org.apache.maven.scm.repository.ScmRepositoryException: The scm url is invalid.
	at org.apache.maven.scm.plugin.CheckoutMojoTest.testExcludeInclude(CheckoutMojoTest.java:153)


FAILED:  org.apache.maven.scm.plugin.CheckoutMojoTest.windows-jdk8 / Build windows-jdk8 /
testUseExport

Error Message:
Cannot run checkout command : 

Stack Trace:
org.apache.maven.plugin.MojoExecutionException: Cannot run checkout command : 
	at org.apache.maven.scm.plugin.CheckoutMojoTest.testUseExport(CheckoutMojoTest.java:132)
Caused by: org.apache.maven.scm.ScmException: Can't load the scm provider.
	at org.apache.maven.scm.plugin.CheckoutMojoTest.testUseExport(CheckoutMojoTest.java:132)
Caused by: org.apache.maven.scm.repository.ScmRepositoryException: The scm url is invalid.
	at org.apache.maven.scm.plugin.CheckoutMojoTest.testUseExport(CheckoutMojoTest.java:132)


FAILED:  org.apache.maven.scm.plugin.CheckoutMojoTest.windows-jdk11 / Build windows-jdk11
/ testExcludeInclude

Error Message:
Cannot run checkout command : 

Stack Trace:
org.apache.maven.plugin.MojoExecutionException: Cannot run checkout command : 
	at org.apache.maven.scm.plugin.CheckoutMojoTest.testExcludeInclude(CheckoutMojoTest.java:153)
Caused by: org.apache.maven.scm.ScmException: Can't load the scm provider.
	at org.apache.maven.scm.plugin.CheckoutMojoTest.testExcludeInclude(CheckoutMojoTest.java:153)
Caused by: org.apache.maven.scm.repository.ScmRepositoryException: The scm url is invalid.
	at org.apache.maven.scm.plugin.CheckoutMojoTest.testExcludeInclude(CheckoutMojoTest.java:153)


FAILED:  org.apache.maven.scm.plugin.CheckoutMojoTest.windows-jdk11 / Build windows-jdk11
/ testUseExport

Error Message:
Cannot run checkout command : 

Stack Trace:
org.apache.maven.plugin.MojoExecutionException: Cannot run checkout command : 
	at org.apache.maven.scm.plugin.CheckoutMojoTest.testUseExport(CheckoutMojoTest.java:132)
Caused by: org.apache.maven.scm.ScmException: Can't load the scm provider.
	at org.apache.maven.scm.plugin.CheckoutMojoTest.testUseExport(CheckoutMojoTest.java:132)
Caused by: org.apache.maven.scm.repository.ScmRepositoryException: The scm url is invalid.
	at org.apache.maven.scm.plugin.CheckoutMojoTest.testUseExport(CheckoutMojoTest.java:132)


FAILED:  org.apache.maven.scm.plugin.ExportMojoTest.windows-jdk7 / Build windows-jdk7 / testExcludeInclude

Error Message:
Cannot run export command : 

Stack Trace:
org.apache.maven.plugin.MojoExecutionException: Cannot run export command : 
	at org.apache.maven.scm.plugin.ExportMojoTest.testExcludeInclude(ExportMojoTest.java:90)
Caused by: org.apache.maven.scm.ScmException: Can't load the scm provider.
	at org.apache.maven.scm.plugin.ExportMojoTest.testExcludeInclude(ExportMojoTest.java:90)
Caused by: org.apache.maven.scm.repository.ScmRepositoryException: The scm url is invalid.
	at org.apache.maven.scm.plugin.ExportMojoTest.testExcludeInclude(ExportMojoTest.java:90)


FAILED:  org.apache.maven.scm.plugin.ExportMojoTest.windows-jdk7 / Build windows-jdk7 / testExport

Error Message:
Cannot run export command : 

Stack Trace:
org.apache.maven.plugin.MojoExecutionException: Cannot run export command : 
	at org.apache.maven.scm.plugin.ExportMojoTest.testExport(ExportMojoTest.java:55)
Caused by: org.apache.maven.scm.ScmException: Can't load the scm provider.
	at org.apache.maven.scm.plugin.ExportMojoTest.testExport(ExportMojoTest.java:55)
Caused by: org.apache.maven.scm.repository.ScmRepositoryException: The scm url is invalid.
	at org.apache.maven.scm.plugin.ExportMojoTest.testExport(ExportMojoTest.java:55)


FAILED:  org.apache.maven.scm.plugin.ExportMojoTest.windows-jdk8 / Build windows-jdk8 / testExcludeInclude

Error Message:
Cannot run export command : 

Stack Trace:
org.apache.maven.plugin.MojoExecutionException: Cannot run export command : 
	at org.apache.maven.scm.plugin.ExportMojoTest.testExcludeInclude(ExportMojoTest.java:90)
Caused by: org.apache.maven.scm.ScmException: Can't load the scm provider.
	at org.apache.maven.scm.plugin.ExportMojoTest.testExcludeInclude(ExportMojoTest.java:90)
Caused by: org.apache.maven.scm.repository.ScmRepositoryException: The scm url is invalid.
	at org.apache.maven.scm.plugin.ExportMojoTest.testExcludeInclude(ExportMojoTest.java:90)


FAILED:  org.apache.maven.scm.plugin.ExportMojoTest.windows-jdk8 / Build windows-jdk8 / testExport

Error Message:
Cannot run export command : 

Stack Trace:
org.apache.maven.plugin.MojoExecutionException: Cannot run export command : 
	at org.apache.maven.scm.plugin.ExportMojoTest.testExport(ExportMojoTest.java:55)
Caused by: org.apache.maven.scm.ScmException: Can't load the scm provider.
	at org.apache.maven.scm.plugin.ExportMojoTest.testExport(ExportMojoTest.java:55)
Caused by: org.apache.maven.scm.repository.ScmRepositoryException: The scm url is invalid.
	at org.apache.maven.scm.plugin.ExportMojoTest.testExport(ExportMojoTest.java:55)


FAILED:  org.apache.maven.scm.plugin.ExportMojoTest.windows-jdk11 / Build windows-jdk11 /
testExcludeInclude

Error Message:
Cannot run export command : 

Stack Trace:
org.apache.maven.plugin.MojoExecutionException: Cannot run export command : 
	at org.apache.maven.scm.plugin.ExportMojoTest.testExcludeInclude(ExportMojoTest.java:90)
Caused by: org.apache.maven.scm.ScmException: Can't load the scm provider.
	at org.apache.maven.scm.plugin.ExportMojoTest.testExcludeInclude(ExportMojoTest.java:90)
Caused by: org.apache.maven.scm.repository.ScmRepositoryException: The scm url is invalid.
	at org.apache.maven.scm.plugin.ExportMojoTest.testExcludeInclude(ExportMojoTest.java:90)


FAILED:  org.apache.maven.scm.plugin.ExportMojoTest.windows-jdk11 / Build windows-jdk11 /
testExport

Error Message:
Cannot run export command : 

Stack Trace:
org.apache.maven.plugin.MojoExecutionException: Cannot run export command : 
	at org.apache.maven.scm.plugin.ExportMojoTest.testExport(ExportMojoTest.java:55)
Caused by: org.apache.maven.scm.ScmException: Can't load the scm provider.
	at org.apache.maven.scm.plugin.ExportMojoTest.testExport(ExportMojoTest.java:55)
Caused by: org.apache.maven.scm.repository.ScmRepositoryException: The scm url is invalid.
	at org.apache.maven.scm.plugin.ExportMojoTest.testExport(ExportMojoTest.java:55)


FAILED:  org.apache.maven.scm.plugin.StatusMojoTest.windows-jdk7 / Build windows-jdk7 / testStatusMojo

Error Message:
Cannot run status command : 

Stack Trace:
org.apache.maven.plugin.MojoExecutionException: Cannot run status command : 
	at org.apache.maven.scm.plugin.StatusMojoTest.testStatusMojo(StatusMojoTest.java:49)
Caused by: org.apache.maven.scm.ScmException: Can't load the scm provider.
	at org.apache.maven.scm.plugin.StatusMojoTest.testStatusMojo(StatusMojoTest.java:49)
Caused by: org.apache.maven.scm.repository.ScmRepositoryException: The scm url is invalid.
	at org.apache.maven.scm.plugin.StatusMojoTest.testStatusMojo(StatusMojoTest.java:49)


FAILED:  org.apache.maven.scm.plugin.StatusMojoTest.windows-jdk8 / Build windows-jdk8 / testStatusMojo

Error Message:
Cannot run status command : 

Stack Trace:
org.apache.maven.plugin.MojoExecutionException: Cannot run status command : 
	at org.apache.maven.scm.plugin.StatusMojoTest.testStatusMojo(StatusMojoTest.java:49)
Caused by: org.apache.maven.scm.ScmException: Can't load the scm provider.
	at org.apache.maven.scm.plugin.StatusMojoTest.testStatusMojo(StatusMojoTest.java:49)
Caused by: org.apache.maven.scm.repository.ScmRepositoryException: The scm url is invalid.
	at org.apache.maven.scm.plugin.StatusMojoTest.testStatusMojo(StatusMojoTest.java:49)


FAILED:  org.apache.maven.scm.plugin.StatusMojoTest.windows-jdk11 / Build windows-jdk11 /
testStatusMojo

Error Message:
Cannot run status command : 

Stack Trace:
org.apache.maven.plugin.MojoExecutionException: Cannot run status command : 
	at org.apache.maven.scm.plugin.StatusMojoTest.testStatusMojo(StatusMojoTest.java:49)
Caused by: org.apache.maven.scm.ScmException: Can't load the scm provider.
	at org.apache.maven.scm.plugin.StatusMojoTest.testStatusMojo(StatusMojoTest.java:49)
Caused by: org.apache.maven.scm.repository.ScmRepositoryException: The scm url is invalid.
	at org.apache.maven.scm.plugin.StatusMojoTest.testStatusMojo(StatusMojoTest.java:49)




Build log:
[...truncated 53351 lines...]
Recording test results
[withMaven] junitPublisher - Archive test results for Maven artifact org.apache.maven.scm:maven-scm-provider-cvstest:jar:1.11.1-SNAPSHOT
generated by maven-surefire-plugin:test (default-test): m\maven-scm-providers\maven-scm-providers-cvs\maven-scm-provider-cvstest\target\surefire-reports\*.xml
Recording test results
[withMaven] junitPublisher - Archive test results for Maven artifact org.apache.maven.scm:maven-scm-provider-svntest:jar:1.11.1-SNAPSHOT
generated by maven-surefire-plugin:test (default-test): m/maven-scm-providers/maven-scm-providers-svn/maven-scm-provider-svntest/target/surefire-reports/*.xml
Recording test results
None of the test reports contained any result
[withMaven] junitPublisher - Archive test results for Maven artifact org.apache.maven.scm:maven-scm-provider-cvs-commons:jar:1.11.1-SNAPSHOT
generated by maven-surefire-plugin:test (default-test): m\maven-scm-providers\maven-scm-providers-cvs\maven-scm-provider-cvs-commons\target\surefire-reports\*.xml
Recording test results
[withMaven] junitPublisher - Archive test results for Maven artifact org.apache.maven.scm:maven-scm-provider-accurev:jar:1.11.1-SNAPSHOT
generated by maven-surefire-plugin:test (default-test): m\maven-scm-providers\maven-scm-provider-accurev\target\surefire-reports\*.xml
Recording test results
[withMaven] junitPublisher - Archive test results for Maven artifact org.apache.maven.scm:maven-scm-provider-svntest:jar:1.11.1-SNAPSHOT
generated by maven-surefire-plugin:test (default-test): m\maven-scm-providers\maven-scm-providers-svn\maven-scm-provider-svntest\target\surefire-reports\*.xml
Recording test results
[withMaven] junitPublisher - Archive test results for Maven artifact org.apache.maven.scm:maven-scm-provider-bazaar:jar:1.11.1-SNAPSHOT
generated by maven-surefire-plugin:test (default-test): m\maven-scm-providers\maven-scm-provider-bazaar\target\surefire-reports\*.xml
Recording test results
None of the test reports contained any result
[withMaven] junitPublisher - Archive test results for Maven artifact org.apache.maven.scm:maven-scm-provider-svnexe:jar:1.11.1-SNAPSHOT
generated by maven-surefire-plugin:test (default-test): m/maven-scm-providers/maven-scm-providers-svn/maven-scm-provider-svnexe/target/surefire-reports/*.xml
Recording test results
[withMaven] junitPublisher - Archive test results for Maven artifact org.apache.maven.scm:maven-scm-provider-cvsexe:jar:1.11.1-SNAPSHOT
generated by maven-surefire-plugin:test (default-test): m\maven-scm-providers\maven-scm-providers-cvs\maven-scm-provider-cvsexe\target\surefire-reports\*.xml
Recording test results
[withMaven] Publishers: Pipeline Graph Publisher: 22 ms, Invoker Publisher: 560 ms, Junit
Publisher: 284564 ms, Concordion Publisher: 3 ms, Dependencies Fingerprint Publisher: 21462
ms, JGiven Publisher: 1 ms, Jacoco Publisher: 1 ms, SpotBugs Publisher: 1 ms
[Pipeline] // withMaven
[withMaven] junitPublisher - Archive test results for Maven artifact org.apache.maven.scm:maven-scm-provider-synergy:jar:1.11.1-SNAPSHOT
generated by maven-surefire-plugin:test (default-test): m/maven-scm-providers/maven-scm-provider-synergy/target/surefire-reports/*.xml
Recording test results
[withMaven] junitPublisher - Archive test results for Maven artifact org.apache.maven.scm:maven-scm-provider-clearcase:jar:1.11.1-SNAPSHOT
generated by maven-surefire-plugin:test (default-test): m\maven-scm-providers\maven-scm-provider-clearcase\target\surefire-reports\*.xml
Recording test results
None of the test reports contained any result
[withMaven] junitPublisher - Archive test results for Maven artifact org.apache.maven.scm:maven-scm-provider-svnexe:jar:1.11.1-SNAPSHOT
generated by maven-surefire-plugin:test (default-test): m\maven-scm-providers\maven-scm-providers-svn\maven-scm-provider-svnexe\target\surefire-reports\*.xml
Recording test results
[withMaven] junitPublisher - Archive test results for Maven artifact org.apache.maven.scm:maven-scm-provider-cvstest:jar:1.11.1-SNAPSHOT
generated by maven-surefire-plugin:test (default-test): m\maven-scm-providers\maven-scm-providers-cvs\maven-scm-provider-cvstest\target\surefire-reports\*.xml
Recording test results
[withMaven] junitPublisher - Archive test results for Maven artifact org.apache.maven.scm:maven-scm-provider-vss:jar:1.11.1-SNAPSHOT
generated by maven-surefire-plugin:test (default-test): m/maven-scm-providers/maven-scm-provider-vss/target/surefire-reports/*.xml
Recording test results
[Pipeline] cleanWs
[withMaven] junitPublisher - Archive test results for Maven artifact org.apache.maven.scm:maven-scm-provider-cvsjava:jar:1.11.1-SNAPSHOT
generated by maven-surefire-plugin:test (default-test): m\maven-scm-providers\maven-scm-providers-cvs\maven-scm-provider-cvsjava\target\surefire-reports\*.xml
Recording test results
[WS-CLEANUP] Deleting project workspace...
[WS-CLEANUP] Deferred wipeout is used...
[WS-CLEANUP] done
[withMaven] junitPublisher - Archive test results for Maven artifact org.apache.maven.scm:maven-scm-provider-tfs:jar:1.11.1-SNAPSHOT
generated by maven-surefire-plugin:test (default-test): m/maven-scm-providers/maven-scm-provider-tfs/target/surefire-reports/*.xml
Recording test results
[Pipeline] }
None of the test reports contained any result
[withMaven] junitPublisher - Archive test results for Maven artifact org.apache.maven.scm:maven-scm-provider-cvs-commons:jar:1.11.1-SNAPSHOT
generated by maven-surefire-plugin:test (default-test): m\maven-scm-providers\maven-scm-providers-cvs\maven-scm-provider-cvs-commons\target\surefire-reports\*.xml
Recording test results
[withMaven] junitPublisher - Archive test results for Maven artifact org.apache.maven.scm:maven-scm-provider-synergy:jar:1.11.1-SNAPSHOT
generated by maven-surefire-plugin:test (default-test): m\maven-scm-providers\maven-scm-provider-synergy\target\surefire-reports\*.xml
Recording test results
[withMaven] Publishers: Pipeline Graph Publisher: 19 ms, Invoker Publisher: 13148 ms, Junit
Publisher: 282309 ms, Concordion Publisher: 2 ms, Dependencies Fingerprint Publisher: 22046
ms, JGiven Publisher: 2 ms, Jacoco Publisher: 1 ms, SpotBugs Publisher: 1 ms
[withMaven] junitPublisher - Archive test results for Maven artifact org.apache.maven.scm:maven-scm-provider-integrity:jar:1.11.1-SNAPSHOT
generated by maven-surefire-plugin:test (default-test): m/maven-scm-providers/maven-scm-provider-integrity/target/surefire-reports/*.xml
Recording test results
[withMaven] junitPublisher - Archive test results for Maven artifact org.apache.maven.scm:maven-scm-provider-cvsexe:jar:1.11.1-SNAPSHOT
generated by maven-surefire-plugin:test (default-test): m\maven-scm-providers\maven-scm-providers-cvs\maven-scm-provider-cvsexe\target\surefire-reports\*.xml
Recording test results
[Pipeline] // stage
[Pipeline] // withMaven
[withMaven] junitPublisher - Archive test results for Maven artifact org.apache.maven.scm:maven-scm-provider-hg:jar:1.11.1-SNAPSHOT
generated by maven-surefire-plugin:test (default-test): m\maven-scm-providers\maven-scm-provider-hg\target\surefire-reports\*.xml
Recording test results
[withMaven] junitPublisher - Archive test results for Maven artifact org.apache.maven.scm:maven-scm-provider-cvsjava:jar:1.11.1-SNAPSHOT
generated by maven-surefire-plugin:test (default-test): m\maven-scm-providers\maven-scm-providers-cvs\maven-scm-provider-cvsjava\target\surefire-reports\*.xml
Recording test results
[Pipeline] }
[Pipeline] cleanWs
[WS-CLEANUP] Deleting project workspace...
[WS-CLEANUP] Deferred wipeout is used...
[withMaven] junitPublisher - Archive test results for Maven artifact org.apache.maven.scm:maven-scm-provider-jazz:jar:1.11.1-SNAPSHOT
generated by maven-surefire-plugin:test (default-test): m/maven-scm-providers/maven-scm-provider-jazz/target/surefire-reports/*.xml
Recording test results
[WS-CLEANUP] done
[withMaven] junitPublisher - Archive test results for Maven artifact org.apache.maven.scm:maven-scm-provider-vss:jar:1.11.1-SNAPSHOT
generated by maven-surefire-plugin:test (default-test): m\maven-scm-providers\maven-scm-provider-vss\target\surefire-reports\*.xml
Recording test results
[withMaven] junitPublisher - Archive test results for Maven artifact org.apache.maven.scm:maven-scm-client:jar:1.11.1-SNAPSHOT
generated by maven-surefire-plugin:test (default-test): m/maven-scm-client/target/surefire-reports/*.xml
Recording test results
[Pipeline] // node
[withMaven] junitPublisher - Archive test results for Maven artifact org.apache.maven.scm:maven-scm-provider-hg:jar:1.11.1-SNAPSHOT
generated by maven-surefire-plugin:test (default-test): m\maven-scm-providers\maven-scm-provider-hg\target\surefire-reports\*.xml
Recording test results
[withMaven] junitPublisher - Archive test results for Maven artifact org.apache.maven.scm:maven-scm-provider-git-commons:jar:1.11.1-SNAPSHOT
generated by maven-surefire-plugin:test (default-test): m\maven-scm-providers\maven-scm-providers-git\maven-scm-provider-git-commons\target\surefire-reports\*.xml
Recording test results
[withMaven] junitPublisher - Archive test results for Maven artifact org.apache.maven.scm:maven-scm-provider-git-commons:jar:1.11.1-SNAPSHOT
generated by maven-surefire-plugin:test (default-test): m\maven-scm-providers\maven-scm-providers-git\maven-scm-provider-git-commons\target\surefire-reports\*.xml
Recording test results
None of the test reports contained any result
[withMaven] junitPublisher - Archive test results for Maven artifact org.apache.maven.plugins:maven-scm-plugin:maven-plugin:1.11.1-SNAPSHOT
generated by maven-surefire-plugin:test (default-test): m/maven-scm-plugin/target/surefire-reports/*.xml
Recording test results
[Pipeline] }
[Pipeline] }
[withMaven] junitPublisher - Archive test results for Maven artifact org.apache.maven.scm:maven-scm-provider-tfs:jar:1.11.1-SNAPSHOT
generated by maven-surefire-plugin:test (default-test): m\maven-scm-providers\maven-scm-provider-tfs\target\surefire-reports\*.xml
Recording test results
[Pipeline] // stage
[withMaven] junitPublisher - Archive test results for Maven artifact org.apache.maven.scm:maven-scm-provider-gittest:jar:1.11.1-SNAPSHOT
generated by maven-surefire-plugin:test (default-test): m\maven-scm-providers\maven-scm-providers-git\maven-scm-provider-gittest\target\surefire-reports\*.xml
Recording test results
[withMaven] junitPublisher - Archive test results for Maven artifact org.apache.maven.scm:maven-scm-provider-gittest:jar:1.11.1-SNAPSHOT
generated by maven-surefire-plugin:test (default-test): m\maven-scm-providers\maven-scm-providers-git\maven-scm-provider-gittest\target\surefire-reports\*.xml
Recording test results
None of the test reports contained any result
[withMaven] junitPublisher - Archive test results for Maven artifact org.apache.maven.scm:maven-scm-provider-gitexe:jar:1.11.1-SNAPSHOT
generated by maven-surefire-plugin:test (default-test): m\maven-scm-providers\maven-scm-providers-git\maven-scm-provider-gitexe\target\surefire-reports\*.xml
Recording test results
[Pipeline] }
[withMaven] junitPublisher - Archive test results for Maven artifact org.apache.maven.scm:maven-scm-provider-integrity:jar:1.11.1-SNAPSHOT
generated by maven-surefire-plugin:test (default-test): m\maven-scm-providers\maven-scm-provider-integrity\target\surefire-reports\*.xml
Recording test results
[withMaven] junitPublisher - Archive test results for Maven artifact org.apache.maven.scm:maven-scm-provider-jgit:jar:1.11.1-SNAPSHOT
generated by maven-surefire-plugin:test (default-test): m\maven-scm-providers\maven-scm-providers-git\maven-scm-provider-jgit\target\surefire-reports\*.xml
Recording test results
[Pipeline] // node
None of the test reports contained any result
[withMaven] junitPublisher - Archive test results for Maven artifact org.apache.maven.scm:maven-scm-provider-gitexe:jar:1.11.1-SNAPSHOT
generated by maven-surefire-plugin:test (default-test): m\maven-scm-providers\maven-scm-providers-git\maven-scm-provider-gitexe\target\surefire-reports\*.xml
Recording test results
[withMaven] junitPublisher - Archive test results for Maven artifact org.apache.maven.scm:maven-scm-provider-local:jar:1.11.1-SNAPSHOT
generated by maven-surefire-plugin:test (default-test): m\maven-scm-providers\maven-scm-provider-local\target\surefire-reports\*.xml
Recording test results
[Pipeline] }
[withMaven] junitPublisher - Archive test results for Maven artifact org.apache.maven.scm:maven-scm-provider-jazz:jar:1.11.1-SNAPSHOT
generated by maven-surefire-plugin:test (default-test): m\maven-scm-providers\maven-scm-provider-jazz\target\surefire-reports\*.xml
Recording test results
[withMaven] junitPublisher - Archive test results for Maven artifact org.apache.maven.scm:maven-scm-provider-perforce:jar:1.11.1-SNAPSHOT
generated by maven-surefire-plugin:test (default-test): m\maven-scm-providers\maven-scm-provider-perforce\target\surefire-reports\*.xml
Recording test results
[withMaven] junitPublisher - Archive test results for Maven artifact org.apache.maven.scm:maven-scm-provider-jgit:jar:1.11.1-SNAPSHOT
generated by maven-surefire-plugin:test (default-test): m\maven-scm-providers\maven-scm-providers-git\maven-scm-provider-jgit\target\surefire-reports\*.xml
Recording test results
[withMaven] junitPublisher - Archive test results for Maven artifact org.apache.maven.scm:maven-scm-provider-starteam:jar:1.11.1-SNAPSHOT
generated by maven-surefire-plugin:test (default-test): m\maven-scm-providers\maven-scm-provider-starteam\target\surefire-reports\*.xml
Recording test results
[withMaven] junitPublisher - Archive test results for Maven artifact org.apache.maven.scm:maven-scm-client:jar:1.11.1-SNAPSHOT
generated by maven-surefire-plugin:test (default-test): m\maven-scm-client\target\surefire-reports\*.xml
Recording test results
[withMaven] junitPublisher - Archive test results for Maven artifact org.apache.maven.scm:maven-scm-provider-svn-commons:jar:1.11.1-SNAPSHOT
generated by maven-surefire-plugin:test (default-test): m\maven-scm-providers\maven-scm-providers-svn\maven-scm-provider-svn-commons\target\surefire-reports\*.xml
Recording test results
[withMaven] junitPublisher - Archive test results for Maven artifact org.apache.maven.scm:maven-scm-provider-local:jar:1.11.1-SNAPSHOT
generated by maven-surefire-plugin:test (default-test): m\maven-scm-providers\maven-scm-provider-local\target\surefire-reports\*.xml
Recording test results
[withMaven] junitPublisher - Archive test results for Maven artifact org.apache.maven.scm:maven-scm-provider-svntest:jar:1.11.1-SNAPSHOT
generated by maven-surefire-plugin:test (default-test): m\maven-scm-providers\maven-scm-providers-svn\maven-scm-provider-svntest\target\surefire-reports\*.xml
Recording test results
None of the test reports contained any result
[withMaven] junitPublisher - Archive test results for Maven artifact org.apache.maven.plugins:maven-scm-plugin:maven-plugin:1.11.1-SNAPSHOT
generated by maven-surefire-plugin:test (default-test): m\maven-scm-plugin\target\surefire-reports\*.xml
Recording test results
None of the test reports contained any result
[withMaven] junitPublisher - Archive test results for Maven artifact org.apache.maven.scm:maven-scm-provider-svnexe:jar:1.11.1-SNAPSHOT
generated by maven-surefire-plugin:test (default-test): m\maven-scm-providers\maven-scm-providers-svn\maven-scm-provider-svnexe\target\surefire-reports\*.xml
Recording test results
[withMaven] junitPublisher - Archive test results for Maven artifact org.apache.maven.scm:maven-scm-provider-perforce:jar:1.11.1-SNAPSHOT
generated by maven-surefire-plugin:test (default-test): m\maven-scm-providers\maven-scm-provider-perforce\target\surefire-reports\*.xml
Recording test results
[withMaven] junitPublisher - Archive test results for Maven artifact org.apache.maven.scm:maven-scm-provider-synergy:jar:1.11.1-SNAPSHOT
generated by maven-surefire-plugin:test (default-test): m\maven-scm-providers\maven-scm-provider-synergy\target\surefire-reports\*.xml
Recording test results
[withMaven] junitPublisher - Archive test results for Maven artifact org.apache.maven.scm:maven-scm-provider-vss:jar:1.11.1-SNAPSHOT
generated by maven-surefire-plugin:test (default-test): m\maven-scm-providers\maven-scm-provider-vss\target\surefire-reports\*.xml
Recording test results
[withMaven] junitPublisher - Archive test results for Maven artifact org.apache.maven.scm:maven-scm-provider-starteam:jar:1.11.1-SNAPSHOT
generated by maven-surefire-plugin:test (default-test): m\maven-scm-providers\maven-scm-provider-starteam\target\surefire-reports\*.xml
Recording test results
[withMaven] Publishers: Pipeline Graph Publisher: 21 ms, Invoker Publisher: 13901 ms, Junit
Publisher: 299714 ms, Concordion Publisher: 3 ms, Dependencies Fingerprint Publisher: 1981
ms, JGiven Publisher: 1 ms, Jacoco Publisher: 1 ms, SpotBugs Publisher: 1 ms
[Pipeline] // withMaven
[withMaven] junitPublisher - Archive test results for Maven artifact org.apache.maven.scm:maven-scm-provider-tfs:jar:1.11.1-SNAPSHOT
generated by maven-surefire-plugin:test (default-test): m\maven-scm-providers\maven-scm-provider-tfs\target\surefire-reports\*.xml
Recording test results
[Pipeline] cleanWs
[WS-CLEANUP] Deleting project workspace...
[WS-CLEANUP] Deferred wipeout is used...
[WS-CLEANUP] done
[withMaven] junitPublisher - Archive test results for Maven artifact org.apache.maven.scm:maven-scm-provider-svn-commons:jar:1.11.1-SNAPSHOT
generated by maven-surefire-plugin:test (default-test): m\maven-scm-providers\maven-scm-providers-svn\maven-scm-provider-svn-commons\target\surefire-reports\*.xml
Recording test results
[withMaven] junitPublisher - Archive test results for Maven artifact org.apache.maven.scm:maven-scm-provider-integrity:jar:1.11.1-SNAPSHOT
generated by maven-surefire-plugin:test (default-test): m\maven-scm-providers\maven-scm-provider-integrity\target\surefire-reports\*.xml
Recording test results
[Pipeline] }
[withMaven] junitPublisher - Archive test results for Maven artifact org.apache.maven.scm:maven-scm-provider-svntest:jar:1.11.1-SNAPSHOT
generated by maven-surefire-plugin:test (default-test): m\maven-scm-providers\maven-scm-providers-svn\maven-scm-provider-svntest\target\surefire-reports\*.xml
Recording test results
[withMaven] junitPublisher - Archive test results for Maven artifact org.apache.maven.scm:maven-scm-provider-jazz:jar:1.11.1-SNAPSHOT
generated by maven-surefire-plugin:test (default-test): m\maven-scm-providers\maven-scm-provider-jazz\target\surefire-reports\*.xml
Recording test results
[Pipeline] // stage
None of the test reports contained any result
[withMaven] junitPublisher - Archive test results for Maven artifact org.apache.maven.scm:maven-scm-provider-svnexe:jar:1.11.1-SNAPSHOT
generated by maven-surefire-plugin:test (default-test): m\maven-scm-providers\maven-scm-providers-svn\maven-scm-provider-svnexe\target\surefire-reports\*.xml
Recording test results
[withMaven] junitPublisher - Archive test results for Maven artifact org.apache.maven.scm:maven-scm-client:jar:1.11.1-SNAPSHOT
generated by maven-surefire-plugin:test (default-test): m\maven-scm-client\target\surefire-reports\*.xml
Recording test results
[Pipeline] }
[withMaven] junitPublisher - Archive test results for Maven artifact org.apache.maven.scm:maven-scm-provider-synergy:jar:1.11.1-SNAPSHOT
generated by maven-surefire-plugin:test (default-test): m\maven-scm-providers\maven-scm-provider-synergy\target\surefire-reports\*.xml
Recording test results
None of the test reports contained any result
[withMaven] junitPublisher - Archive test results for Maven artifact org.apache.maven.plugins:maven-scm-plugin:maven-plugin:1.11.1-SNAPSHOT
generated by maven-surefire-plugin:test (default-test): m\maven-scm-plugin\target\surefire-reports\*.xml
Recording test results
[Pipeline] // node
[withMaven] junitPublisher - Archive test results for Maven artifact org.apache.maven.scm:maven-scm-provider-vss:jar:1.11.1-SNAPSHOT
generated by maven-surefire-plugin:test (default-test): m\maven-scm-providers\maven-scm-provider-vss\target\surefire-reports\*.xml
Recording test results
[Pipeline] }
[withMaven] junitPublisher - Archive test results for Maven artifact org.apache.maven.scm:maven-scm-provider-tfs:jar:1.11.1-SNAPSHOT
generated by maven-surefire-plugin:test (default-test): m\maven-scm-providers\maven-scm-provider-tfs\target\surefire-reports\*.xml
Recording test results
[withMaven] junitPublisher - Archive test results for Maven artifact org.apache.maven.scm:maven-scm-provider-integrity:jar:1.11.1-SNAPSHOT
generated by maven-surefire-plugin:test (default-test): m\maven-scm-providers\maven-scm-provider-integrity\target\surefire-reports\*.xml
Recording test results
[withMaven] junitPublisher - Archive test results for Maven artifact org.apache.maven.scm:maven-scm-provider-jazz:jar:1.11.1-SNAPSHOT
generated by maven-surefire-plugin:test (default-test): m\maven-scm-providers\maven-scm-provider-jazz\target\surefire-reports\*.xml
Recording test results
[withMaven] Publishers: Pipeline Graph Publisher: 18 ms, Invoker Publisher: 1595 ms, Junit
Publisher: 104912 ms, Concordion Publisher: 13 ms, Dependencies Fingerprint Publisher: 2070
ms, JGiven Publisher: 1 ms, Jacoco Publisher: 1 ms, SpotBugs Publisher: 1 ms
[Pipeline] // withMaven
[withMaven] junitPublisher - Archive test results for Maven artifact org.apache.maven.scm:maven-scm-client:jar:1.11.1-SNAPSHOT
generated by maven-surefire-plugin:test (default-test): m\maven-scm-client\target\surefire-reports\*.xml
Recording test results
[Pipeline] cleanWs
[WS-CLEANUP] Deleting project workspace...
[WS-CLEANUP] Deferred wipeout is used...
[WS-CLEANUP] done
None of the test reports contained any result
[withMaven] junitPublisher - Archive test results for Maven artifact org.apache.maven.plugins:maven-scm-plugin:maven-plugin:1.11.1-SNAPSHOT
generated by maven-surefire-plugin:test (default-test): m\maven-scm-plugin\target\surefire-reports\*.xml
Recording test results
[Pipeline] }
[Pipeline] // stage
[Pipeline] }
[Pipeline] // node
[Pipeline] }
[withMaven] Publishers: Pipeline Graph Publisher: 15 ms, Invoker Publisher: 9213 ms, Junit
Publisher: 143372 ms, Concordion Publisher: 4 ms, Dependencies Fingerprint Publisher: 2065
ms, JGiven Publisher: 1 ms, Jacoco Publisher: 1 ms, SpotBugs Publisher: 1 ms
[withMaven] openTasksPublisher - Scan Tasks for Maven artifact org.apache.maven.scm:maven-scm-api:jar:1.11.1-SNAPSHOT
in source directory m/maven-scm-api/src/main/java
[withMaven] openTasksPublisher - Scan Tasks for Maven artifact org.apache.maven.scm:maven-scm-manager-plexus:jar:1.11.1-SNAPSHOT
in source directory m/maven-scm-managers/maven-scm-manager-plexus/src/main/java
[withMaven] openTasksPublisher - Scan Tasks for Maven artifact org.apache.maven.scm:maven-scm-test:jar:1.11.1-SNAPSHOT
in source directory m/maven-scm-test/src/main/java
[Pipeline] // withMaven
[Pipeline] cleanWs
[withMaven] openTasksPublisher - Scan Tasks for Maven artifact org.apache.maven.scm:maven-scm-provider-accurev:jar:1.11.1-SNAPSHOT
in source directory m/maven-scm-providers/maven-scm-provider-accurev/src/main/java
[WS-CLEANUP] Deleting project workspace...
[WS-CLEANUP] Deferred wipeout is used...
[WS-CLEANUP] done
[Pipeline] }
[Pipeline] // stage
[Pipeline] }
[Pipeline] // node
[Pipeline] }
[withMaven] openTasksPublisher - Scan Tasks for Maven artifact org.apache.maven.scm:maven-scm-provider-bazaar:jar:1.11.1-SNAPSHOT
in source directory m/maven-scm-providers/maven-scm-provider-bazaar/src/main/java
[withMaven] openTasksPublisher - Scan Tasks for Maven artifact org.apache.maven.scm:maven-scm-provider-clearcase:jar:1.11.1-SNAPSHOT
in source directory m/maven-scm-providers/maven-scm-provider-clearcase/src/main/java
[withMaven] openTasksPublisher - Scan Tasks for Maven artifact org.apache.maven.scm:maven-scm-provider-cvstest:jar:1.11.1-SNAPSHOT
in source directory m/maven-scm-providers/maven-scm-providers-cvs/maven-scm-provider-cvstest/src/main/java
[withMaven] openTasksPublisher - Scan Tasks for Maven artifact org.apache.maven.scm:maven-scm-provider-cvs-commons:jar:1.11.1-SNAPSHOT
in source directory m/maven-scm-providers/maven-scm-providers-cvs/maven-scm-provider-cvs-commons/src/main/java
[withMaven] openTasksPublisher - Scan Tasks for Maven artifact org.apache.maven.scm:maven-scm-provider-cvsexe:jar:1.11.1-SNAPSHOT
in source directory m/maven-scm-providers/maven-scm-providers-cvs/maven-scm-provider-cvsexe/src/main/java
[withMaven] openTasksPublisher - Scan Tasks for Maven artifact org.apache.maven.scm:maven-scm-provider-cvsjava:jar:1.11.1-SNAPSHOT
in source directory m/maven-scm-providers/maven-scm-providers-cvs/maven-scm-provider-cvsjava/src/main/java
[withMaven] openTasksPublisher - Scan Tasks for Maven artifact org.apache.maven.scm:maven-scm-provider-hg:jar:1.11.1-SNAPSHOT
in source directory m/maven-scm-providers/maven-scm-provider-hg/src/main/java
[withMaven] openTasksPublisher - Scan Tasks for Maven artifact org.apache.maven.scm:maven-scm-provider-git-commons:jar:1.11.1-SNAPSHOT
in source directory m/maven-scm-providers/maven-scm-providers-git/maven-scm-provider-git-commons/src/main/java
[withMaven] openTasksPublisher - Scan Tasks for Maven artifact org.apache.maven.scm:maven-scm-provider-gittest:jar:1.11.1-SNAPSHOT
in source directory m/maven-scm-providers/maven-scm-providers-git/maven-scm-provider-gittest/src/main/java
[withMaven] openTasksPublisher - Scan Tasks for Maven artifact org.apache.maven.scm:maven-scm-provider-gitexe:jar:1.11.1-SNAPSHOT
in source directory m/maven-scm-providers/maven-scm-providers-git/maven-scm-provider-gitexe/src/main/java
[withMaven] openTasksPublisher - Scan Tasks for Maven artifact org.apache.maven.scm:maven-scm-provider-jgit:jar:1.11.1-SNAPSHOT
in source directory m/maven-scm-providers/maven-scm-providers-git/maven-scm-provider-jgit/src/main/java
[withMaven] openTasksPublisher - Scan Tasks for Maven artifact org.apache.maven.scm:maven-scm-provider-local:jar:1.11.1-SNAPSHOT
in source directory m/maven-scm-providers/maven-scm-provider-local/src/main/java
[withMaven] openTasksPublisher - Scan Tasks for Maven artifact org.apache.maven.scm:maven-scm-provider-perforce:jar:1.11.1-SNAPSHOT
in source directory m/maven-scm-providers/maven-scm-provider-perforce/src/main/java
[withMaven] openTasksPublisher - Scan Tasks for Maven artifact org.apache.maven.scm:maven-scm-provider-starteam:jar:1.11.1-SNAPSHOT
in source directory m/maven-scm-providers/maven-scm-provider-starteam/src/main/java
[withMaven] openTasksPublisher - Scan Tasks for Maven artifact org.apache.maven.scm:maven-scm-provider-svn-commons:jar:1.11.1-SNAPSHOT
in source directory m/maven-scm-providers/maven-scm-providers-svn/maven-scm-provider-svn-commons/src/main/java
[withMaven] openTasksPublisher - Scan Tasks for Maven artifact org.apache.maven.scm:maven-scm-provider-svntest:jar:1.11.1-SNAPSHOT
in source directory m/maven-scm-providers/maven-scm-providers-svn/maven-scm-provider-svntest/src/main/java
[withMaven] openTasksPublisher - Scan Tasks for Maven artifact org.apache.maven.scm:maven-scm-provider-svnexe:jar:1.11.1-SNAPSHOT
in source directory m/maven-scm-providers/maven-scm-providers-svn/maven-scm-provider-svnexe/src/main/java
[withMaven] openTasksPublisher - Scan Tasks for Maven artifact org.apache.maven.scm:maven-scm-provider-synergy:jar:1.11.1-SNAPSHOT
in source directory m/maven-scm-providers/maven-scm-provider-synergy/src/main/java
[withMaven] openTasksPublisher - Scan Tasks for Maven artifact org.apache.maven.scm:maven-scm-provider-vss:jar:1.11.1-SNAPSHOT
in source directory m/maven-scm-providers/maven-scm-provider-vss/src/main/java
[withMaven] openTasksPublisher - Scan Tasks for Maven artifact org.apache.maven.scm:maven-scm-provider-tfs:jar:1.11.1-SNAPSHOT
in source directory m/maven-scm-providers/maven-scm-provider-tfs/src/main/java
[withMaven] openTasksPublisher - Scan Tasks for Maven artifact org.apache.maven.scm:maven-scm-provider-integrity:jar:1.11.1-SNAPSHOT
in source directory m/maven-scm-providers/maven-scm-provider-integrity/src/main/java
[withMaven] openTasksPublisher - Scan Tasks for Maven artifact org.apache.maven.scm:maven-scm-provider-jazz:jar:1.11.1-SNAPSHOT
in source directory m/maven-scm-providers/maven-scm-provider-jazz/src/main/java
[withMaven] openTasksPublisher - Scan Tasks for Maven artifact org.apache.maven.scm:maven-scm-client:jar:1.11.1-SNAPSHOT
in source directory m/maven-scm-client/src/main/java
[withMaven] openTasksPublisher - Scan Tasks for Maven artifact org.apache.maven.plugins:maven-scm-plugin:maven-plugin:1.11.1-SNAPSHOT
in source directory m/maven-scm-plugin/src/main/java
[TASKS] Scanning folder '/home/jenkins/jenkins-slave/workspace/maven-box_maven-scm_SCM-877'
for files matching the pattern 'm/maven-scm-api/src/main/java/**/*,m/maven-scm-managers/maven-scm-manager-plexus/src/main/java/**/*,m/maven-scm-test/src/main/java/**/*,m/maven-scm-providers/maven-scm-provider-accurev/src/main/java/**/*,m/maven-scm-providers/maven-scm-provider-bazaar/src/main/java/**/*,m/maven-scm-providers/maven-scm-provider-clearcase/src/main/java/**/*,m/maven-scm-providers/maven-scm-providers-cvs/maven-scm-provider-cvstest/src/main/java/**/*,m/maven-scm-providers/maven-scm-providers-cvs/maven-scm-provider-cvs-commons/src/main/java/**/*,m/maven-scm-providers/maven-scm-providers-cvs/maven-scm-provider-cvsexe/src/main/java/**/*,m/maven-scm-providers/maven-scm-providers-cvs/maven-scm-provider-cvsjava/src/main/java/**/*,m/maven-scm-providers/maven-scm-provider-hg/src/main/java/**/*,m/maven-scm-providers/maven-scm-providers-git/maven-scm-provider-git-commons/src/main/java/**/*,m/maven-scm-providers/maven-scm-providers-git/maven-scm-provider-gittest/src/main/java/**/*,m/maven-scm-providers/maven-scm-providers-git/maven-scm-provider-gitexe/src/main/java/**/*,m/maven-scm-providers/maven-scm-providers-git/maven-scm-provider-jgit/src/main/java/**/*,m/maven-scm-providers/maven-scm-provider-local/src/main/java/**/*,m/maven-scm-providers/maven-scm-provider-perforce/src/main/java/**/*,m/maven-scm-providers/maven-scm-provider-starteam/src/main/java/**/*,m/maven-scm-providers/maven-scm-providers-svn/maven-scm-provider-svn-commons/src/main/java/**/*,m/maven-scm-providers/maven-scm-providers-svn/maven-scm-provider-svntest/src/main/java/**/*,m/maven-scm-providers/maven-scm-providers-svn/maven-scm-provider-svnexe/src/main/java/**/*,m/maven-scm-providers/maven-scm-provider-synergy/src/main/java/**/*,m/maven-scm-providers/maven-scm-provider-vss/src/main/java/**/*,m/maven-scm-providers/maven-scm-provider-tfs/src/main/java/**/*,m/maven-scm-providers/maven-scm-provider-integrity/src/main/java/**/*,m/maven-scm-providers/maven-scm-provider-jazz/src/main/java/**/*,m/maven-scm-client/src/main/java/**/*,m/maven-scm-plugin/src/main/java/**/*'
- excludes: null
[TASKS] Found 656 files to scan for tasks
[TASKS] Found 90 open tasks.
Skipping warnings blame since pipelines do not have an SCM link.%n
[TASKS] Computing warning deltas based on reference build #21
[withMaven] Publishers: Pipeline Graph Publisher: 19 ms, Generated Artifacts Publisher: 36968
ms, Invoker Publisher: 3065 ms, Junit Publisher: 276498 ms, Concordion Publisher: 7 ms, Dependencies
Fingerprint Publisher: 21479 ms, Findbugs Publisher: 2 ms, JGiven Publisher: 2 ms, Jacoco
Publisher: 1 ms, SpotBugs Publisher: 1 ms, Open Task Scanner Publisher: 15958 ms
[Pipeline] // withMaven
[Pipeline] cleanWs
[WS-CLEANUP] Deleting project workspace...
[WS-CLEANUP] Deferred wipeout is used...
[WS-CLEANUP] done
[Pipeline] }
[Pipeline] // stage
[Pipeline] }
[Pipeline] // node
[Pipeline] }
[Pipeline] // parallel
[Pipeline] stage
[Pipeline] { (Notifications)
[Pipeline] echo
Build result: UNSTABLE
[Pipeline] jiraIssueSelector
[Pipeline] emailext
Mime
  • Unnamed multipart/mixed (inline, None, 0 bytes)
View raw message