maven-notifications mailing list archives

Site index · List index
Message view « Date » · « Thread »
Top « Date » · « Thread »
From Apache Jenkins Server <jenk...@builds.apache.org>
Subject Build unstable in Jenkins: Maven TLP » maven-plugin-testing » master #1
Date Fri, 01 Mar 2019 04:32:11 GMT
See https://builds.apache.org/job/maven-box/job/maven-plugin-testing/job/master/1/

No changes.

3 tests failed.
FAILED:  org.apache.maven.shared.test.plugin.ProjectToolTest.linux-jdk7 / Build linux-jdk7
/ testPackageProjectArtifact_ShouldPopulateWithCorrectArtifactAndMetadata

Error Message:
Missing target/unit/projects/basic/target/it-build-target/maven-it-plugin-test.jar

Stack Trace:
junit.framework.AssertionFailedError: Missing target/unit/projects/basic/target/it-build-target/maven-it-plugin-test.jar
	at junit.framework.Assert.fail(Assert.java:57)
	at junit.framework.Assert.assertTrue(Assert.java:22)
	at junit.framework.TestCase.assertTrue(TestCase.java:192)
	at org.apache.maven.shared.test.plugin.ProjectToolTest.testPackageProjectArtifact_ShouldPopulateWithCorrectArtifactAndMetadata(ProjectToolTest.java:99)


FAILED:  org.apache.maven.shared.test.plugin.ProjectToolTest.linux-jdk11 / Build linux-jdk11
/ testPackageProjectArtifact_ShouldPopulateWithCorrectArtifactAndMetadata

Error Message:
Missing target/unit/projects/basic/target/it-build-target/maven-it-plugin-test.jar

Stack Trace:
junit.framework.AssertionFailedError: Missing target/unit/projects/basic/target/it-build-target/maven-it-plugin-test.jar
	at junit.framework.Assert.fail(Assert.java:57)
	at junit.framework.Assert.assertTrue(Assert.java:22)
	at junit.framework.TestCase.assertTrue(TestCase.java:192)
	at org.apache.maven.shared.test.plugin.ProjectToolTest.testPackageProjectArtifact_ShouldPopulateWithCorrectArtifactAndMetadata(ProjectToolTest.java:99)


FAILED:  org.apache.maven.shared.test.plugin.ProjectToolTest.windows-jdk11 / Build windows-jdk11
/ testPackageProjectArtifact_ShouldPopulateWithCorrectArtifactAndMetadata

Error Message:
Missing target\unit\projects\basic\target\it-build-target\maven-it-plugin-test.jar

Stack Trace:
junit.framework.AssertionFailedError: Missing target\unit\projects\basic\target\it-build-target\maven-it-plugin-test.jar
	at junit.framework.Assert.fail(Assert.java:57)
	at junit.framework.Assert.assertTrue(Assert.java:22)
	at junit.framework.TestCase.assertTrue(TestCase.java:192)
	at org.apache.maven.shared.test.plugin.ProjectToolTest.testPackageProjectArtifact_ShouldPopulateWithCorrectArtifactAndMetadata(ProjectToolTest.java:99)




Build log:
[...truncated 9839 lines...]
[INFO] Downloading from central: https://repo.maven.apache.org/maven2/org/codehaus/plexus/plexus-utils/3.0.8/plexus-utils-3.0.8.jar
[withMaven] Publishers: Pipeline Graph Publisher: 4 ms, Junit Publisher: 905 ms
[withMaven] junitPublisher - Archive test results for Maven artifact org.apache.maven.its.plugins:maven-it-plugin:maven-plugin:test
generated by maven-surefire-plugin:test (default-test): m\maven-plugin-testing-tools\target\unit\projects\basic\target\it-build-target\surefire-reports\*.xml
Recording test results
None of the test reports contained any result
[withMaven] Publishers: Junit Publisher: 34 ms
[withMaven] junitPublisher - Archive test results for Maven artifact org.apache.maven.its.plugins:maven-it-plugin:maven-plugin:test
generated by maven-surefire-plugin:test (default-test): m\maven-plugin-testing-tools\target\unit\projects\basic\target\it-build-target\surefire-reports\*.xml
Recording test results
None of the test reports contained any result
[INFO] Downloaded from central: https://repo.maven.apache.org/maven2/org/codehaus/plexus/plexus-utils/3.0.8/plexus-utils-3.0.8.jar
(232 kB at 480 kB/s)
[withMaven] Publishers: Junit Publisher: 32 ms
[Pipeline] // withMaven
[Pipeline] cleanWs
[WS-CLEANUP] Deleting project workspace...
[WS-CLEANUP] Deferred wipeout is used...
[WS-CLEANUP] done
[Pipeline] }
[Pipeline] // stage
[Pipeline] }
[INFO] Building jar: F:\jenkins\jenkins-slave\workspace\-box_maven-plugin-testing_master\m\maven-plugin-testing-harness\target\maven-plugin-testing-harness-3.3.1-SNAPSHOT-sources.jar
[Pipeline] // node
[Pipeline] }
[INFO] 
[INFO] ------------------------------------------------------------------------
[INFO] Building Maven Testing Tools 3.3.1-SNAPSHOT
[INFO] ------------------------------------------------------------------------
[INFO] Downloading from central: https://repo.maven.apache.org/maven2/org/easymock/easymock/3.2/easymock-3.2.pom
[INFO] Downloaded from central: https://repo.maven.apache.org/maven2/org/easymock/easymock/3.2/easymock-3.2.pom
(4.8 kB at 210 kB/s)
[INFO] Downloading from central: https://repo.maven.apache.org/maven2/org/easymock/easymock-parent/3.2/easymock-parent-3.2.pom
[INFO] Downloaded from central: https://repo.maven.apache.org/maven2/org/easymock/easymock-parent/3.2/easymock-parent-3.2.pom
(16 kB at 565 kB/s)
[INFO] Downloading from central: https://repo.maven.apache.org/maven2/cglib/cglib-nodep/2.2.2/cglib-nodep-2.2.2.pom
[INFO] Downloaded from central: https://repo.maven.apache.org/maven2/cglib/cglib-nodep/2.2.2/cglib-nodep-2.2.2.pom
(1.2 kB at 67 kB/s)
[INFO] Downloading from central: https://repo.maven.apache.org/maven2/org/objenesis/objenesis/1.3/objenesis-1.3.pom
[INFO] Downloaded from central: https://repo.maven.apache.org/maven2/org/objenesis/objenesis/1.3/objenesis-1.3.pom
(2.5 kB at 110 kB/s)
[INFO] Downloading from central: https://repo.maven.apache.org/maven2/org/objenesis/objenesis-parent/1.3/objenesis-parent-1.3.pom
[INFO] Downloaded from central: https://repo.maven.apache.org/maven2/org/objenesis/objenesis-parent/1.3/objenesis-parent-1.3.pom
(14 kB at 526 kB/s)
[INFO] Downloading from central: https://repo.maven.apache.org/maven2/org/easymock/easymock/3.2/easymock-3.2.jar
[INFO] Downloading from central: https://repo.maven.apache.org/maven2/cglib/cglib-nodep/2.2.2/cglib-nodep-2.2.2.jar
[INFO] Downloading from central: https://repo.maven.apache.org/maven2/org/objenesis/objenesis/1.3/objenesis-1.3.jar
[INFO] Downloaded from central: https://repo.maven.apache.org/maven2/org/easymock/easymock/3.2/easymock-3.2.jar
(120 kB at 481 kB/s)
[INFO] Downloaded from central: https://repo.maven.apache.org/maven2/org/objenesis/objenesis/1.3/objenesis-1.3.jar
(41 kB at 153 kB/s)
[INFO] Downloaded from central: https://repo.maven.apache.org/maven2/cglib/cglib-nodep/2.2.2/cglib-nodep-2.2.2.jar
(327 kB at 495 kB/s)
[INFO] 
[INFO] --- maven-clean-plugin:2.5:clean (default-clean) @ maven-test-tools ---
[INFO] 
[INFO] --- maven-enforcer-plugin:1.3.1:enforce (enforce-bytecode-version) @ maven-test-tools
---
[INFO] 
[INFO] --- maven-enforcer-plugin:1.3.1:enforce (ban-known-bad-maven-versions) @ maven-test-tools
---
[INFO] 
[INFO] --- maven-remote-resources-plugin:1.5:process (default) @ maven-test-tools ---
[INFO] 
[INFO] --- maven-resources-plugin:2.6:resources (default-resources) @ maven-test-tools ---
[INFO] Using 'UTF-8' encoding to copy filtered resources.
[INFO] skip non existing resourceDirectory F:\jenkins\jenkins-slave\workspace\-box_maven-plugin-testing_master\m\maven-test-tools\src\main\resources
[INFO] Copying 3 resources
[INFO] 
[INFO] --- maven-compiler-plugin:3.1:compile (default-compile) @ maven-test-tools ---
[INFO] Changes detected - recompiling the module!
[INFO] Compiling 4 source files to F:\jenkins\jenkins-slave\workspace\-box_maven-plugin-testing_master\m\maven-test-tools\target\classes
[WARNING] /F:/jenkins/jenkins-slave/workspace/-box_maven-plugin-testing_master/m/maven-test-tools/src/main/java/org/apache/maven/shared/tools/easymock/TestFileManager.java:
Some input files use or override a deprecated API.
[WARNING] /F:/jenkins/jenkins-slave/workspace/-box_maven-plugin-testing_master/m/maven-test-tools/src/main/java/org/apache/maven/shared/tools/easymock/TestFileManager.java:
Recompile with -Xlint:deprecation for details.
[INFO] 
[INFO] --- maven-resources-plugin:2.6:testResources (default-testResources) @ maven-test-tools
---
[INFO] Using 'UTF-8' encoding to copy filtered resources.
[INFO] skip non existing resourceDirectory F:\jenkins\jenkins-slave\workspace\-box_maven-plugin-testing_master\m\maven-test-tools\src\test\resources
[INFO] Copying 3 resources
[INFO] 
[INFO] --- maven-compiler-plugin:3.1:testCompile (default-testCompile) @ maven-test-tools
---
[INFO] No sources to compile
[INFO] 
[INFO] --- maven-surefire-plugin:2.16:test (default-test) @ maven-test-tools ---
[INFO] 
[INFO] --- maven-jar-plugin:2.4:jar (default-jar) @ maven-test-tools ---
[INFO] Building jar: F:\jenkins\jenkins-slave\workspace\-box_maven-plugin-testing_master\m\maven-test-tools\target\maven-test-tools-3.3.1-SNAPSHOT.jar
[INFO] 
[INFO] ------------------------------------------------------------------------
[INFO] Building Maven Plugin Testing Tools 3.3.1-SNAPSHOT
[INFO] ------------------------------------------------------------------------
[INFO] Downloading from central: https://repo.maven.apache.org/maven2/org/codehaus/plexus/plexus-component-metadata/1.5.5/plexus-component-metadata-1.5.5.pom
[INFO] Downloaded from central: https://repo.maven.apache.org/maven2/org/codehaus/plexus/plexus-component-metadata/1.5.5/plexus-component-metadata-1.5.5.pom
(3.9 kB at 167 kB/s)
[INFO] Downloading from central: https://repo.maven.apache.org/maven2/org/codehaus/plexus/plexus-component-metadata/1.5.5/plexus-component-metadata-1.5.5.jar
[INFO] Downloaded from central: https://repo.maven.apache.org/maven2/org/codehaus/plexus/plexus-component-metadata/1.5.5/plexus-component-metadata-1.5.5.jar
(110 kB at 415 kB/s)
[INFO] Downloading from central: https://repo.maven.apache.org/maven2/org/apache/maven/shared/maven-invoker/2.2/maven-invoker-2.2.pom
[INFO] Downloaded from central: https://repo.maven.apache.org/maven2/org/apache/maven/shared/maven-invoker/2.2/maven-invoker-2.2.pom
(5.9 kB at 167 kB/s)
[INFO] Downloading from central: https://repo.maven.apache.org/maven2/org/apache/maven/shared/maven-shared-components/21/maven-shared-components-21.pom
[INFO] Downloaded from central: https://repo.maven.apache.org/maven2/org/apache/maven/shared/maven-shared-components/21/maven-shared-components-21.pom
(5.1 kB at 66 kB/s)
[INFO] Downloading from central: https://repo.maven.apache.org/maven2/org/apache/maven/wagon/wagon-file/2.1/wagon-file-2.1.pom
[INFO] Downloaded from central: https://repo.maven.apache.org/maven2/org/apache/maven/wagon/wagon-file/2.1/wagon-file-2.1.pom
(1.4 kB at 63 kB/s)
[INFO] Downloading from central: https://repo.maven.apache.org/maven2/org/apache/maven/wagon/wagon-providers/2.1/wagon-providers-2.1.pom
[INFO] Downloaded from central: https://repo.maven.apache.org/maven2/org/apache/maven/wagon/wagon-providers/2.1/wagon-providers-2.1.pom
(2.8 kB at 89 kB/s)
[INFO] Downloading from central: https://repo.maven.apache.org/maven2/org/apache/maven/wagon/wagon/2.1/wagon-2.1.pom
[INFO] Downloaded from central: https://repo.maven.apache.org/maven2/org/apache/maven/wagon/wagon/2.1/wagon-2.1.pom
(16 kB at 607 kB/s)
[INFO] Downloading from central: https://repo.maven.apache.org/maven2/org/apache/maven/wagon/wagon-provider-api/2.1/wagon-provider-api-2.1.pom
[INFO] Downloaded from central: https://repo.maven.apache.org/maven2/org/apache/maven/wagon/wagon-provider-api/2.1/wagon-provider-api-2.1.pom
(1.7 kB at 82 kB/s)
[INFO] Downloading from central: https://repo.maven.apache.org/maven2/org/apache/maven/shared/maven-invoker/2.2/maven-invoker-2.2.jar
[INFO] Downloading from central: https://repo.maven.apache.org/maven2/org/apache/maven/wagon/wagon-file/2.1/wagon-file-2.1.jar
[INFO] Downloaded from central: https://repo.maven.apache.org/maven2/org/apache/maven/wagon/wagon-file/2.1/wagon-file-2.1.jar
(11 kB at 122 kB/s)
[INFO] Downloaded from central: https://repo.maven.apache.org/maven2/org/apache/maven/shared/maven-invoker/2.2/maven-invoker-2.2.jar
(30 kB at 137 kB/s)
[INFO] 
[INFO] --- maven-clean-plugin:2.5:clean (default-clean) @ maven-plugin-testing-tools ---
[INFO] 
[INFO] --- maven-enforcer-plugin:1.3.1:enforce (enforce-bytecode-version) @ maven-plugin-testing-tools
---
[INFO] Downloading from central: https://repo.maven.apache.org/maven2/org/apache/maven/wagon/wagon-provider-api/2.1/wagon-provider-api-2.1.jar
[INFO] Downloaded from central: https://repo.maven.apache.org/maven2/org/apache/maven/wagon/wagon-provider-api/2.1/wagon-provider-api-2.1.jar
(52 kB at 280 kB/s)
[INFO] 
[INFO] --- maven-enforcer-plugin:1.3.1:enforce (ban-known-bad-maven-versions) @ maven-plugin-testing-tools
---
[INFO] 
[INFO] --- maven-remote-resources-plugin:1.5:process (default) @ maven-plugin-testing-tools
---
[INFO] 
[INFO] --- maven-resources-plugin:2.6:resources (default-resources) @ maven-plugin-testing-tools
---
[INFO] Using 'UTF-8' encoding to copy filtered resources.
[INFO] skip non existing resourceDirectory F:\jenkins\jenkins-slave\workspace\-box_maven-plugin-testing_master\m\maven-plugin-testing-tools\src\main\resources
[INFO] Copying 3 resources
[INFO] 
[INFO] --- maven-compiler-plugin:3.1:compile (default-compile) @ maven-plugin-testing-tools
---
[INFO] Changes detected - recompiling the module!
[INFO] Compiling 6 source files to F:\jenkins\jenkins-slave\workspace\-box_maven-plugin-testing_master\m\maven-plugin-testing-tools\target\classes
[WARNING] /F:/jenkins/jenkins-slave/workspace/-box_maven-plugin-testing_master/m/maven-plugin-testing-tools/src/main/java/org/apache/maven/shared/test/plugin/ProjectTool.java:
Some input files use or override a deprecated API.
[WARNING] /F:/jenkins/jenkins-slave/workspace/-box_maven-plugin-testing_master/m/maven-plugin-testing-tools/src/main/java/org/apache/maven/shared/test/plugin/ProjectTool.java:
Recompile with -Xlint:deprecation for details.
[INFO] 
[INFO] --- plexus-component-metadata:1.5.5:generate-metadata (default) @ maven-plugin-testing-tools
---
[INFO] Downloading from central: https://repo.maven.apache.org/maven2/com/thoughtworks/qdox/qdox/1.9.2/qdox-1.9.2.pom
[INFO] Downloaded from central: https://repo.maven.apache.org/maven2/com/thoughtworks/qdox/qdox/1.9.2/qdox-1.9.2.pom
(17 kB at 235 kB/s)
[INFO] Downloading from central: https://repo.maven.apache.org/maven2/jdom/jdom/1.0/jdom-1.0.pom
[INFO] Downloaded from central: https://repo.maven.apache.org/maven2/jdom/jdom/1.0/jdom-1.0.pom
(1.2 kB at 6.7 kB/s)
[INFO] Downloading from central: https://repo.maven.apache.org/maven2/org/codehaus/plexus/plexus-cli/1.2/plexus-cli-1.2.pom
[INFO] Downloaded from central: https://repo.maven.apache.org/maven2/org/codehaus/plexus/plexus-cli/1.2/plexus-cli-1.2.pom
(1.8 kB at 31 kB/s)
[INFO] Downloading from central: https://repo.maven.apache.org/maven2/org/codehaus/plexus/plexus-tools/1.0.8/plexus-tools-1.0.8.pom
[INFO] Downloaded from central: https://repo.maven.apache.org/maven2/org/codehaus/plexus/plexus-tools/1.0.8/plexus-tools-1.0.8.pom
(953 B at 64 kB/s)
[INFO] Downloading from central: https://repo.maven.apache.org/maven2/commons-lang/commons-lang/1.0/commons-lang-1.0.pom
[INFO] Downloaded from central: https://repo.maven.apache.org/maven2/commons-lang/commons-lang/1.0/commons-lang-1.0.pom
(2.5 kB at 107 kB/s)
[INFO] Downloading from central: https://repo.maven.apache.org/maven2/asm/asm/3.1/asm-3.1.pom
[INFO] Downloaded from central: https://repo.maven.apache.org/maven2/asm/asm/3.1/asm-3.1.pom
(278 B at 17 kB/s)
[INFO] Downloading from central: https://repo.maven.apache.org/maven2/asm/asm-parent/3.1/asm-parent-3.1.pom
[INFO] Downloaded from central: https://repo.maven.apache.org/maven2/asm/asm-parent/3.1/asm-parent-3.1.pom
(4.2 kB at 148 kB/s)
[INFO] Downloading from central: https://repo.maven.apache.org/maven2/org/codehaus/plexus/plexus-utils/1.4.5/plexus-utils-1.4.5.jar
[INFO] Downloading from central: https://repo.maven.apache.org/maven2/org/codehaus/plexus/plexus-cli/1.2/plexus-cli-1.2.jar
[INFO] Downloading from central: https://repo.maven.apache.org/maven2/jdom/jdom/1.0/jdom-1.0.jar
[INFO] Downloading from central: https://repo.maven.apache.org/maven2/com/thoughtworks/qdox/qdox/1.9.2/qdox-1.9.2.jar
[INFO] Downloading from central: https://repo.maven.apache.org/maven2/commons-logging/commons-logging/1.0/commons-logging-1.0.jar
[INFO] Downloaded from central: https://repo.maven.apache.org/maven2/org/codehaus/plexus/plexus-cli/1.2/plexus-cli-1.2.jar
(7.7 kB at 76 kB/s)
[INFO] Downloading from central: https://repo.maven.apache.org/maven2/commons-lang/commons-lang/1.0/commons-lang-1.0.jar
[INFO] Downloaded from central: https://repo.maven.apache.org/maven2/commons-lang/commons-lang/1.0/commons-lang-1.0.jar
(64 kB at 280 kB/s)
[INFO] Downloading from central: https://repo.maven.apache.org/maven2/asm/asm/3.1/asm-3.1.jar
[INFO] Downloaded from central: https://repo.maven.apache.org/maven2/asm/asm/3.1/asm-3.1.jar
(43 kB at 166 kB/s)
[INFO] Downloaded from central: https://repo.maven.apache.org/maven2/jdom/jdom/1.0/jdom-1.0.jar
(153 kB at 455 kB/s)
[INFO] Downloaded from central: https://repo.maven.apache.org/maven2/commons-logging/commons-logging/1.0/commons-logging-1.0.jar
(22 kB at 54 kB/s)
[INFO] Downloaded from central: https://repo.maven.apache.org/maven2/com/thoughtworks/qdox/qdox/1.9.2/qdox-1.9.2.jar
(170 kB at 330 kB/s)
[INFO] Downloaded from central: https://repo.maven.apache.org/maven2/org/codehaus/plexus/plexus-utils/1.4.5/plexus-utils-1.4.5.jar
(205 kB at 300 kB/s)
[INFO] Discovered 5 component descriptors(s)
[INFO] 
[INFO] --- maven-resources-plugin:2.6:testResources (default-testResources) @ maven-plugin-testing-tools
---
[INFO] Using 'UTF-8' encoding to copy filtered resources.
[INFO] Copying 2 resources
[INFO] Copying 3 resources
[INFO] 
[INFO] --- maven-compiler-plugin:3.1:testCompile (default-testCompile) @ maven-plugin-testing-tools
---
[INFO] Changes detected - recompiling the module!
[INFO] Compiling 2 source files to F:\jenkins\jenkins-slave\workspace\-box_maven-plugin-testing_master\m\maven-plugin-testing-tools\target\test-classes
[WARNING] /F:/jenkins/jenkins-slave/workspace/-box_maven-plugin-testing_master/m/maven-plugin-testing-tools/src/test/java/org/apache/maven/shared/test/plugin/ProjectToolTest.java:
Some input files use or override a deprecated API.
[WARNING] /F:/jenkins/jenkins-slave/workspace/-box_maven-plugin-testing_master/m/maven-plugin-testing-tools/src/test/java/org/apache/maven/shared/test/plugin/ProjectToolTest.java:
Recompile with -Xlint:deprecation for details.
[INFO] 
[INFO] --- maven-surefire-plugin:2.16:test (default-test) @ maven-plugin-testing-tools ---
[INFO] Surefire report directory: F:\jenkins\jenkins-slave\workspace\-box_maven-plugin-testing_master\m\maven-plugin-testing-tools\target\surefire-reports

-------------------------------------------------------
 T E S T S
-------------------------------------------------------
Picked up JAVA_TOOL_OPTIONS: -Dmaven.ext.class.path="f:\jenkins\jenkins-slave\workspace\-box_maven-plugin-testing_master@tmp\withMaven49b7ac8c\pipeline-maven-spy.jar"
-Dorg.jenkinsci.plugins.pipeline.maven.reportsFolder="f:\jenkins\jenkins-slave\workspace\-box_maven-plugin-testing_master@tmp\withMaven49b7ac8c"

Running org.apache.maven.shared.test.plugin.ProjectToolTest
Using target\it-build-target and target\it-build-target\classes to build IT version of plugin
Now Building test version of the plugin...
Using staged plugin-pom: F:\jenkins\jenkins-slave\workspace\-box_maven-plugin-testing_master\m\maven-plugin-testing-tools\target\unit\projects\basic\pom-test.xml
Using IT Plugin Jar: F:\jenkins\jenkins-slave\workspace\-box_maven-plugin-testing_master\m\maven-plugin-testing-tools\target\unit\projects\basic\target\it-build-target\maven-it-plugin-test.jar
Using target\it-build-target and target\it-build-target\classes to build IT version of plugin
Now Building test version of the plugin...
Using staged plugin-pom: F:\jenkins\jenkins-slave\workspace\-box_maven-plugin-testing_master\m\maven-plugin-testing-tools\target\unit\projects\basic\pom-test.xml
Using IT Plugin Jar: F:\jenkins\jenkins-slave\workspace\-box_maven-plugin-testing_master\m\maven-plugin-testing-tools\target\unit\projects\basic\target\it-build-target\maven-it-plugin-test.jar
Using target\it-build-target and target\it-build-target\classes to build IT version of plugin
Tests run: 3, Failures: 1, Errors: 0, Skipped: 0, Time elapsed: 20.505 sec <<< FAILURE!
- in org.apache.maven.shared.test.plugin.ProjectToolTest
testPackageProjectArtifact_ShouldPopulateWithCorrectArtifactAndMetadata(org.apache.maven.shared.test.plugin.ProjectToolTest)
 Time elapsed: 5.345 sec  <<< FAILURE!
junit.framework.AssertionFailedError: Missing target\unit\projects\basic\target\it-build-target\maven-it-plugin-test.jar
	at junit.framework.Assert.fail(Assert.java:57)
	at junit.framework.Assert.assertTrue(Assert.java:22)
	at junit.framework.TestCase.assertTrue(TestCase.java:192)
	at org.apache.maven.shared.test.plugin.ProjectToolTest.testPackageProjectArtifact_ShouldPopulateWithCorrectArtifactAndMetadata(ProjectToolTest.java:99)

Running org.apache.maven.shared.test.plugin.RepositoryToolTest
Tests run: 1, Failures: 0, Errors: 0, Skipped: 0, Time elapsed: 0.309 sec - in org.apache.maven.shared.test.plugin.RepositoryToolTest

Results :

Failed tests: 
  ProjectToolTest.testPackageProjectArtifact_ShouldPopulateWithCorrectArtifactAndMetadata:99
Missing target\unit\projects\basic\target\it-build-target\maven-it-plugin-test.jar

Tests run: 4, Failures: 1, Errors: 0, Skipped: 0

[ERROR] There are test failures.

Please refer to F:\jenkins\jenkins-slave\workspace\-box_maven-plugin-testing_master\m\maven-plugin-testing-tools\target\surefire-reports
for the individual test results.
[INFO] 
[INFO] --- maven-jar-plugin:2.4:jar (default-jar) @ maven-plugin-testing-tools ---
[INFO] Building jar: F:\jenkins\jenkins-slave\workspace\-box_maven-plugin-testing_master\m\maven-plugin-testing-tools\target\maven-plugin-testing-tools-3.3.1-SNAPSHOT.jar
[INFO] ------------------------------------------------------------------------
[INFO] Reactor Summary:
[INFO] 
[INFO] Maven Plugin Testing ............................... SUCCESS [ 31.917 s]
[INFO] Maven Plugin Testing Mechanism ..................... SUCCESS [ 27.543 s]
[INFO] Maven Testing Tools ................................ SUCCESS [  1.509 s]
[INFO] Maven Plugin Testing Tools ......................... SUCCESS [ 26.548 s]
[INFO] ------------------------------------------------------------------------
[INFO] BUILD SUCCESS
[INFO] ------------------------------------------------------------------------
[INFO] Total time: 01:29 min
[INFO] Finished at: 2019-02-28T20:32:08-08:00
[INFO] Final Memory: 29M/104M
[INFO] ------------------------------------------------------------------------
[WARNING] The requested profile "run-its" could not be activated because it does not exist.
[INFO] [jenkins-event-spy] Generated F:\jenkins\jenkins-slave\workspace\-box_maven-plugin-testing_master@tmp\withMaven49b7ac8c\maven-spy-20190228-203039-2049444434461201567044.log
[Pipeline] }
[Pipeline] // dir
[Pipeline] }
[withMaven] junitPublisher - Archive test results for Maven artifact org.apache.maven.plugin-testing:maven-plugin-testing-harness:jar:3.3.1-SNAPSHOT
generated by maven-surefire-plugin:test (default-test): m\maven-plugin-testing-harness\target\surefire-reports\*.xml
Recording test results
[withMaven] junitPublisher - Archive test results for Maven artifact org.apache.maven.plugin-testing:maven-test-tools:jar:3.3.1-SNAPSHOT
generated by maven-surefire-plugin:test (default-test): m\maven-test-tools\target\surefire-reports\*.xml
Recording test results
None of the test reports contained any result
[withMaven] junitPublisher - Archive test results for Maven artifact org.apache.maven.plugin-testing:maven-plugin-testing-tools:jar:3.3.1-SNAPSHOT
generated by maven-surefire-plugin:test (default-test): m\maven-plugin-testing-tools\target\surefire-reports\*.xml
Recording test results
[withMaven] Publishers: Pipeline Graph Publisher: 3 ms, Junit Publisher: 666 ms
[withMaven] Publishers: 
[withMaven] Publishers: 
[Pipeline] // withMaven
[Pipeline] cleanWs
[WS-CLEANUP] Deleting project workspace...
[WS-CLEANUP] Deferred wipeout is used...
[WS-CLEANUP] done
[Pipeline] }
[Pipeline] // stage
[Pipeline] }
[Pipeline] // node
[Pipeline] }
[Pipeline] // parallel
[Pipeline] stage
[Pipeline] { (Notifications)
[Pipeline] echo
Build result: UNSTABLE
[Pipeline] jiraIssueSelector
[Pipeline] emailext
Mime
  • Unnamed multipart/mixed (inline, None, 0 bytes)
View raw message