maven-notifications mailing list archives

Site index · List index
Message view « Date » · « Thread »
Top « Date » · « Thread »
From Apache Jenkins Server <jenk...@builds.apache.org>
Subject Build failed in Jenkins: Maven TLP » maven-scm-publish-plugin » MSCMPUB-38 #1
Date Fri, 01 Mar 2019 02:00:19 GMT
See https://builds.apache.org/job/maven-box/job/maven-scm-publish-plugin/job/MSCMPUB-38/1/

No changes.

No tests ran.

Build log:
[...truncated 79269 lines...]
[INFO] [DEBUG]   (f) localCheckout = false
[INFO] [DEBUG]   (f) project = MavenProject: org.apache.maven.plugins:maven-scm-publish-plugin-005-site-lifecycle:1.0-SNAPSHOT
@ F:\jenkins\jenkins-slave\workspace\en-scm-publish-plugin_MSCMPUB-38\m\target\it\site-deploy\pom.xml
[INFO] [DEBUG]   (s) pubScmUrl = scm:svn:file:/F:/jenkins/jenkins-slave/workspace/en-scm-publish-plugin_MSCMPUB-38/m/target/it/site-deploy//target/svn-root
[INFO] [DEBUG]   (f) settings = org.apache.maven.execution.SettingsAdapter@2897ac05
[INFO] [DEBUG]   (f) skipDeletedFiles = false
[INFO] [DEBUG]   (f) tryUpdate = false
[INFO] [DEBUG] -- end configuration --
[INFO] [WARNING] No output encoding, defaulting to UTF-8.
[INFO] [DEBUG] AbstractSvnScmProvider used, so we can check if remote url exists and eventually
create it.
[INFO] [INFO] Checking out the pub tree from scm:svn:file:///F:/jenkins/jenkins-slave/workspace/en-scm-publish-plugin_MSCMPUB-38/m/target/it/site-deploy//target/svn-root
into F:\jenkins\jenkins-slave\workspace\en-scm-publish-plugin_MSCMPUB-38\m\target\it\site-deploy\target\scmpublish-checkout
[INFO] [INFO] Executing: cmd.exe /X /C "svn --non-interactive checkout file:///F:/jenkins/jenkins-slave/workspace/en-scm-publish-plugin_MSCMPUB-38/m/target/it/site-deploy//target/svn-root
F:\jenkins\jenkins-slave\workspace\en-scm-publish-plugin_MSCMPUB-38\m\target\it\site-deploy\target\scmpublish-checkout"
[INFO] [INFO] Working directory: F:\jenkins\jenkins-slave\workspace\en-scm-publish-plugin_MSCMPUB-38\m\target\it\site-deploy\target
[INFO] [DEBUG] A    scmpublish-checkout\tags
[INFO] [DEBUG] A    scmpublish-checkout\trunk
[INFO] [DEBUG] A    scmpublish-checkout\trunk\src
[INFO] [DEBUG] A    scmpublish-checkout\trunk\src\test
[INFO] [DEBUG] A    scmpublish-checkout\trunk\src\test\java
[INFO] [DEBUG] A    scmpublish-checkout\trunk\src\test\java\Test.java
[INFO] [DEBUG] A    scmpublish-checkout\trunk\src\test\resources
[INFO] [DEBUG] A    scmpublish-checkout\trunk\src\main
[INFO] [DEBUG] A    scmpublish-checkout\trunk\src\main\java
[INFO] [DEBUG] A    scmpublish-checkout\trunk\src\main\java\Application.java
[INFO] [DEBUG] A    scmpublish-checkout\trunk\pom.xml
[INFO] [DEBUG] A    scmpublish-checkout\trunk\readme.txt
[INFO] [DEBUG] A    scmpublish-checkout\branches
[INFO] [DEBUG] Checked out revision 8.
[INFO] [INFO] Updating checkout directory with actual content in F:\jenkins\jenkins-slave\workspace\en-scm-publish-plugin_MSCMPUB-38\m\target\it\site-deploy\target\staging
[INFO] [DEBUG] file marked for deletion: tags
[INFO] [DEBUG] file marked for deletion: branches
[INFO] [DEBUG] file marked for deletion: pom.xml
[INFO] [DEBUG] file marked for deletion: src
[INFO] [DEBUG] file marked for deletion: test
[INFO] [DEBUG] file marked for deletion: resources
[INFO] [DEBUG] file marked for deletion: java
[INFO] [DEBUG] file marked for deletion: Test.java
[INFO] [DEBUG] file marked for deletion: main
[INFO] [DEBUG] file marked for deletion: java
[INFO] [DEBUG] file marked for deletion: Application.java
[INFO] [INFO] Content consists of 11 directories and 54 files = 182 KB
[INFO] [INFO] Publishing content to SCM will result in 63 addition(s), 1 update(s), 11 delete(s)
[INFO] [INFO] scm add directories: [apidocs, apidocs\org, apidocs\org\apache, apidocs\org\apache\maven,
apidocs\org\apache\maven\it, apidocs\org\apache\maven\it\class-use, apidocs\resources, css,
images, images\logos]
[INFO] [INFO] Executing: cmd.exe /X /C "svn add --non-recursive --targets C:\Users\jenkins\AppData\Local\Temp\2\maven-scm-3127719488854431357-targets"
[INFO] [INFO] Working directory: F:\jenkins\jenkins-slave\workspace\en-scm-publish-plugin_MSCMPUB-38\m\target\it\site-deploy\target\scmpublish-checkout
[INFO] [INFO] scm add files: [apidocs\allclasses-frame.html, apidocs\allclasses-noframe.html,
apidocs\constant-values.html, apidocs\deprecated-list.html, apidocs\help-doc.html, apidocs\index-all.html,
apidocs\index.html, apidocs\javadoc.bat, apidocs\options, apidocs\org\apache\maven\it\class-use\ThisHasJavadoc.html,
apidocs\org\apache\maven\it\package-frame.html, apidocs\org\apache\maven\it\package-summary.html,
apidocs\org\apache\maven\it\package-tree.html, apidocs\org\apache\maven\it\package-use.html,
apidocs\org\apache\maven\it\ThisHasJavadoc.html, apidocs\overview-tree.html, apidocs\package-list,
apidocs\packages, apidocs\resources\background.gif, apidocs\resources\tab.gif, apidocs\resources\titlebar.gif,
apidocs\resources\titlebar_end.gif, apidocs\stylesheet.css, css\maven-base.css, css\maven-theme.css,
css\print.css, css\site.css, dependencies.html, distribution-management.html, images\close.gif,
images\collapsed.gif, images\expanded.gif, images\external.png, images\icon_error_sml.gif,
images\icon_info_sml.gif, images\icon_success_sml.gif, images\icon_warning_sml.gif, images\logos\build-by-maven-black.png,
images\logos\build-by-maven-white.png, images\logos\maven-feather.png, images\newwindow.png,
index.html, integration.html, issue-tracking.html, license.html, mail-lists.html, plugin-management.html,
plugins.html, project-info.html, project-reports.html, project-summary.html, source-repository.html,
team-list.html]
[INFO] [INFO] Executing: cmd.exe /X /C "svn add --non-recursive --targets C:\Users\jenkins\AppData\Local\Temp\2\maven-scm-2441011235533030167-targets"
[INFO] [INFO] Working directory: F:\jenkins\jenkins-slave\workspace\en-scm-publish-plugin_MSCMPUB-38\m\target\it\site-deploy\target\scmpublish-checkout
[INFO] [INFO] Deleting files: [tags, branches, trunk\pom.xml, trunk\src\test\resources, trunk\src\test\java\Test.java,
trunk\src\test\java, trunk\src\test, trunk\src\main\java\Application.java, trunk\src\main\java,
trunk\src\main, trunk\src]
[INFO] [INFO] Executing: cmd.exe /X /C "svn remove --targets C:\Users\jenkins\AppData\Local\Temp\2\maven-scm-5350454147832129035-targets"
[INFO] [INFO] Working directory: F:\jenkins\jenkins-slave\workspace\en-scm-publish-plugin_MSCMPUB-38\m\target\it\site-deploy\target\scmpublish-checkout
[INFO] [INFO] Checking in SCM, starting at Thu Feb 28 18:00:03 PST 2019...
[INFO] [INFO] Executing: cmd.exe /X /C "svn --non-interactive commit --file C:\Users\jenkins\AppData\Local\Temp\2\maven-scm-1345468498.commit"
[INFO] [INFO] Working directory: F:\jenkins\jenkins-slave\workspace\en-scm-publish-plugin_MSCMPUB-38\m\target\it\site-deploy\target\scmpublish-checkout
[INFO] [DEBUG] Adding         apidocs
[INFO] [DEBUG] Adding         apidocs\allclasses-frame.html
[INFO] [DEBUG] Adding         apidocs\allclasses-noframe.html
[INFO] [DEBUG] Adding         apidocs\constant-values.html
[INFO] [DEBUG] Adding         apidocs\deprecated-list.html
[INFO] [DEBUG] Adding         apidocs\help-doc.html
[INFO] [DEBUG] Adding         apidocs\index-all.html
[INFO] [DEBUG] Adding         apidocs\index.html
[INFO] [DEBUG] Adding         apidocs\javadoc.bat
[INFO] [DEBUG] Adding         apidocs\options
[INFO] [DEBUG] Adding         apidocs\org
[INFO] [DEBUG] Adding         apidocs\org\apache
[INFO] [DEBUG] Adding         apidocs\org\apache\maven
[INFO] [DEBUG] Adding         apidocs\org\apache\maven\it
[INFO] [DEBUG] Adding         apidocs\org\apache\maven\it\ThisHasJavadoc.html
[INFO] [DEBUG] Adding         apidocs\org\apache\maven\it\class-use
[INFO] [DEBUG] Adding         apidocs\org\apache\maven\it\class-use\ThisHasJavadoc.html
[INFO] [DEBUG] Adding         apidocs\org\apache\maven\it\package-frame.html
[INFO] [DEBUG] Adding         apidocs\org\apache\maven\it\package-summary.html
[INFO] [DEBUG] Adding         apidocs\org\apache\maven\it\package-tree.html
[INFO] [DEBUG] Adding         apidocs\org\apache\maven\it\package-use.html
[INFO] [DEBUG] Adding         apidocs\overview-tree.html
[INFO] [DEBUG] Adding         apidocs\package-list
[INFO] [DEBUG] Adding         apidocs\packages
[INFO] [DEBUG] Adding         apidocs\resources
[INFO] [DEBUG] Adding  (bin)  apidocs\resources\background.gif
[INFO] [DEBUG] Adding  (bin)  apidocs\resources\tab.gif
[INFO] [DEBUG] Adding  (bin)  apidocs\resources\titlebar.gif
[INFO] [DEBUG] Adding  (bin)  apidocs\resources\titlebar_end.gif
[INFO] [DEBUG] Adding         apidocs\stylesheet.css
[INFO] [DEBUG] Deleting       branches
[INFO] [DEBUG] Adding         css
[INFO] [DEBUG] Adding         css\maven-base.css
[INFO] [DEBUG] Adding         css\maven-theme.css
[INFO] [DEBUG] Adding         css\print.css
[INFO] [DEBUG] Adding         css\site.css
[INFO] [DEBUG] Adding         dependencies.html
[INFO] [DEBUG] Adding         distribution-management.html
[INFO] [DEBUG] Adding         images
[INFO] [DEBUG] Adding  (bin)  images\close.gif
[INFO] [DEBUG] Adding  (bin)  images\collapsed.gif
[INFO] [DEBUG] Adding  (bin)  images\expanded.gif
[INFO] [DEBUG] Adding  (bin)  images\external.png
[INFO] [DEBUG] Adding  (bin)  images\icon_error_sml.gif
[INFO] [DEBUG] Adding  (bin)  images\icon_info_sml.gif
[INFO] [DEBUG] Adding  (bin)  images\icon_success_sml.gif
[INFO] [DEBUG] Adding  (bin)  images\icon_warning_sml.gif
[INFO] [DEBUG] Adding         images\logos
[INFO] [DEBUG] Adding  (bin)  images\logos\build-by-maven-black.png
[INFO] [DEBUG] Adding  (bin)  images\logos\build-by-maven-white.png
[INFO] [DEBUG] Adding  (bin)  images\logos\maven-feather.png
[INFO] [DEBUG] Adding  (bin)  images\newwindow.png
[INFO] [DEBUG] Adding         index.html
[INFO] [DEBUG] Adding         integration.html
[INFO] [DEBUG] Adding         issue-tracking.html
[INFO] [DEBUG] Adding         license.html
[INFO] [DEBUG] Adding         mail-lists.html
[INFO] [DEBUG] Adding         plugin-management.html
[INFO] [DEBUG] Adding         plugins.html
[INFO] [DEBUG] Adding         project-info.html
[INFO] [DEBUG] Adding         project-reports.html
[INFO] [DEBUG] Adding         project-summary.html
[INFO] [DEBUG] Adding         source-repository.html
[INFO] [DEBUG] Deleting       tags
[INFO] [DEBUG] Adding         team-list.html
[INFO] [DEBUG] Deleting       trunk\pom.xml
[INFO] [DEBUG] Sending        trunk\readme.txt
[INFO] [DEBUG] Deleting       trunk\src
[INFO] [DEBUG] Transmitting file data ......................................................
[INFO] [DEBUG] Committed revision 9.
[INFO] [INFO] Checked in 54 file(s) to revision 9 in 0 h 0 m 6 s
[INFO] [INFO] ------------------------------------------------------------------------
[INFO] [INFO] BUILD SUCCESS
[INFO] [INFO] ------------------------------------------------------------------------
[INFO] [INFO] Total time: 24.781 s
[INFO] [INFO] Finished at: 2019-02-28T18:00:10-08:00
[INFO] [INFO] Final Memory: 36M/528M
[INFO] [INFO] ------------------------------------------------------------------------
[INFO] Picked up JAVA_TOOL_OPTIONS: -Dmaven.ext.class.path="f:\jenkins\jenkins-slave\workspace\en-scm-publish-plugin_MSCMPUB-38@tmp\withMaven1f4dadba\pipeline-maven-spy.jar"
-Dorg.jenkinsci.plugins.pipeline.maven.reportsFolder="f:\jenkins\jenkins-slave\workspace\en-scm-publish-plugin_MSCMPUB-38@tmp\withMaven1f4dadba"

[INFO]           site-deploy\pom.xml .............................. SUCCESS (31.5 s)
[INFO] 
[INFO] --- maven-checkstyle-plugin:3.0.0:check (checkstyle-check) @ maven-scm-publish-plugin
---
[INFO] Downloading from central: https://repo.maven.apache.org/maven2/org/apache/maven/shared/maven-shared-resources/2/maven-shared-resources-2.pom
[INFO] Downloaded from central: https://repo.maven.apache.org/maven2/org/apache/maven/shared/maven-shared-resources/2/maven-shared-resources-2.pom
(3.0 kB at 99 kB/s)
[INFO] Downloading from central: https://repo.maven.apache.org/maven2/org/codehaus/plexus/plexus-utils/3.0.10/plexus-utils-3.0.10.pom
[INFO] Downloaded from central: https://repo.maven.apache.org/maven2/org/codehaus/plexus/plexus-utils/3.0.10/plexus-utils-3.0.10.pom
(3.1 kB at 150 kB/s)
[INFO] Downloading from central: https://repo.maven.apache.org/maven2/org/codehaus/plexus/plexus/3.3/plexus-3.3.pom
[INFO] Downloaded from central: https://repo.maven.apache.org/maven2/org/codehaus/plexus/plexus/3.3/plexus-3.3.pom
(20 kB at 642 kB/s)
[INFO] Downloading from central: https://repo.maven.apache.org/maven2/org/apache/maven/doxia/doxia-integration-tools/1.6/doxia-integration-tools-1.6.pom
[INFO] Downloaded from central: https://repo.maven.apache.org/maven2/org/apache/maven/doxia/doxia-integration-tools/1.6/doxia-integration-tools-1.6.pom
(7.0 kB at 248 kB/s)
[INFO] Downloading from central: https://repo.maven.apache.org/maven2/org/apache/maven/doxia/doxia-tools/3/doxia-tools-3.pom
[INFO] Downloaded from central: https://repo.maven.apache.org/maven2/org/apache/maven/doxia/doxia-tools/3/doxia-tools-3.pom
(9.9 kB at 310 kB/s)
[INFO] Downloading from central: https://repo.maven.apache.org/maven2/org/codehaus/plexus/plexus-resources/1.1.0/plexus-resources-1.1.0.pom
[INFO] Downloaded from central: https://repo.maven.apache.org/maven2/org/codehaus/plexus/plexus-resources/1.1.0/plexus-resources-1.1.0.pom
(3.2 kB at 132 kB/s)
[INFO] Downloading from central: https://repo.maven.apache.org/maven2/com/puppycrawl/tools/checkstyle/6.18/checkstyle-6.18.pom
[INFO] Downloaded from central: https://repo.maven.apache.org/maven2/com/puppycrawl/tools/checkstyle/6.18/checkstyle-6.18.pom
(71 kB at 1.9 MB/s)
[INFO] Downloading from central: https://repo.maven.apache.org/maven2/antlr/antlr/2.7.7/antlr-2.7.7.pom
[INFO] Downloaded from central: https://repo.maven.apache.org/maven2/antlr/antlr/2.7.7/antlr-2.7.7.pom
(632 B at 24 kB/s)
[INFO] Downloading from central: https://repo.maven.apache.org/maven2/org/antlr/antlr4-runtime/4.5.3/antlr4-runtime-4.5.3.pom
[INFO] Downloaded from central: https://repo.maven.apache.org/maven2/org/antlr/antlr4-runtime/4.5.3/antlr4-runtime-4.5.3.pom
(2.3 kB at 110 kB/s)
[INFO] Downloading from central: https://repo.maven.apache.org/maven2/org/antlr/antlr4-master/4.5.3/antlr4-master-4.5.3.pom
[INFO] Downloaded from central: https://repo.maven.apache.org/maven2/org/antlr/antlr4-master/4.5.3/antlr4-master-4.5.3.pom
(3.7 kB at 123 kB/s)
[INFO] Downloading from central: https://repo.maven.apache.org/maven2/commons-beanutils/commons-beanutils/1.9.2/commons-beanutils-1.9.2.pom
[INFO] Downloaded from central: https://repo.maven.apache.org/maven2/commons-beanutils/commons-beanutils/1.9.2/commons-beanutils-1.9.2.pom
(14 kB at 461 kB/s)
[INFO] Downloading from central: https://repo.maven.apache.org/maven2/org/apache/commons/commons-parent/33/commons-parent-33.pom
[INFO] Downloaded from central: https://repo.maven.apache.org/maven2/org/apache/commons/commons-parent/33/commons-parent-33.pom
(53 kB at 1.8 MB/s)
[INFO] Downloading from central: https://repo.maven.apache.org/maven2/commons-cli/commons-cli/1.3.1/commons-cli-1.3.1.pom
[INFO] Downloaded from central: https://repo.maven.apache.org/maven2/commons-cli/commons-cli/1.3.1/commons-cli-1.3.1.pom
(10 kB at 346 kB/s)
[INFO] Downloading from central: https://repo.maven.apache.org/maven2/com/google/guava/guava/19.0/guava-19.0.pom
[INFO] Downloaded from central: https://repo.maven.apache.org/maven2/com/google/guava/guava/19.0/guava-19.0.pom
(6.8 kB at 234 kB/s)
[INFO] Downloading from central: https://repo.maven.apache.org/maven2/com/google/guava/guava-parent/19.0/guava-parent-19.0.pom
[INFO] Downloaded from central: https://repo.maven.apache.org/maven2/com/google/guava/guava-parent/19.0/guava-parent-19.0.pom
(9.9 kB at 319 kB/s)
[INFO] Downloading from central: https://repo.maven.apache.org/maven2/org/sonatype/oss/oss-parent/7/oss-parent-7.pom
[INFO] Downloaded from central: https://repo.maven.apache.org/maven2/org/sonatype/oss/oss-parent/7/oss-parent-7.pom
(4.8 kB at 193 kB/s)
[INFO] Downloading from central: https://repo.maven.apache.org/maven2/org/apache/maven/shared/maven-shared-resources/2/maven-shared-resources-2.jar
[INFO] Downloading from central: https://repo.maven.apache.org/maven2/org/apache/maven/doxia/doxia-integration-tools/1.6/doxia-integration-tools-1.6.jar
[INFO] Downloading from central: https://repo.maven.apache.org/maven2/org/apache/maven/doxia/doxia-core/1.2/doxia-core-1.2.jar
[INFO] Downloading from central: https://repo.maven.apache.org/maven2/commons-digester/commons-digester/1.6/commons-digester-1.6.jar
[INFO] Downloading from central: https://repo.maven.apache.org/maven2/commons-logging/commons-logging/1.0.4/commons-logging-1.0.4.jar
[INFO] Downloaded from central: https://repo.maven.apache.org/maven2/org/apache/maven/shared/maven-shared-resources/2/maven-shared-resources-2.jar
(13 kB at 126 kB/s)
[INFO] Downloading from central: https://repo.maven.apache.org/maven2/commons-io/commons-io/1.4/commons-io-1.4.jar
[INFO] Downloaded from central: https://repo.maven.apache.org/maven2/commons-logging/commons-logging/1.0.4/commons-logging-1.0.4.jar
(38 kB at 170 kB/s)
[INFO] Downloading from central: https://repo.maven.apache.org/maven2/org/codehaus/plexus/plexus-resources/1.1.0/plexus-resources-1.1.0.jar
[INFO] Downloaded from central: https://repo.maven.apache.org/maven2/org/apache/maven/doxia/doxia-integration-tools/1.6/doxia-integration-tools-1.6.jar
(45 kB at 174 kB/s)
[INFO] Downloading from central: https://repo.maven.apache.org/maven2/com/puppycrawl/tools/checkstyle/6.18/checkstyle-6.18.jar
[INFO] Downloaded from central: https://repo.maven.apache.org/maven2/com/puppycrawl/tools/checkstyle/6.18/checkstyle-6.18.jar
(1.2 MB at 3.6 MB/s)
[INFO] Downloading from central: https://repo.maven.apache.org/maven2/antlr/antlr/2.7.7/antlr-2.7.7.jar
[INFO] Downloaded from central: https://repo.maven.apache.org/maven2/antlr/antlr/2.7.7/antlr-2.7.7.jar
(445 kB at 1.3 MB/s)
[INFO] Downloading from central: https://repo.maven.apache.org/maven2/org/antlr/antlr4-runtime/4.5.3/antlr4-runtime-4.5.3.jar
[INFO] Downloaded from central: https://repo.maven.apache.org/maven2/org/apache/maven/doxia/doxia-core/1.2/doxia-core-1.2.jar
(154 kB at 387 kB/s)
[INFO] Downloading from central: https://repo.maven.apache.org/maven2/commons-beanutils/commons-beanutils/1.9.2/commons-beanutils-1.9.2.jar
[INFO] Downloaded from central: https://repo.maven.apache.org/maven2/commons-digester/commons-digester/1.6/commons-digester-1.6.jar
(168 kB at 418 kB/s)
[INFO] Downloading from central: https://repo.maven.apache.org/maven2/commons-cli/commons-cli/1.3.1/commons-cli-1.3.1.jar
[INFO] Downloaded from central: https://repo.maven.apache.org/maven2/org/codehaus/plexus/plexus-resources/1.1.0/plexus-resources-1.1.0.jar
(23 kB at 37 kB/s)
[INFO] Downloading from central: https://repo.maven.apache.org/maven2/com/google/guava/guava/19.0/guava-19.0.jar
[INFO] Downloaded from central: https://repo.maven.apache.org/maven2/commons-io/commons-io/1.4/commons-io-1.4.jar
(109 kB at 143 kB/s)
[INFO] Downloading from central: https://repo.maven.apache.org/maven2/commons-lang/commons-lang/2.1/commons-lang-2.1.jar
[INFO] Downloaded from central: https://repo.maven.apache.org/maven2/com/google/guava/guava/19.0/guava-19.0.jar
(2.3 MB at 3.0 MB/s)
[INFO] Downloaded from central: https://repo.maven.apache.org/maven2/commons-cli/commons-cli/1.3.1/commons-cli-1.3.1.jar
(53 kB at 68 kB/s)
[INFO] Downloaded from central: https://repo.maven.apache.org/maven2/commons-lang/commons-lang/2.1/commons-lang-2.1.jar
(208 kB at 266 kB/s)
[INFO] Downloaded from central: https://repo.maven.apache.org/maven2/org/antlr/antlr4-runtime/4.5.3/antlr4-runtime-4.5.3.jar
(302 kB at 340 kB/s)
[INFO] Downloaded from central: https://repo.maven.apache.org/maven2/commons-beanutils/commons-beanutils/1.9.2/commons-beanutils-1.9.2.jar
(234 kB at 251 kB/s)
[INFO] 
[INFO] --- maven-invoker-plugin:3.1.0:verify (integration-test) @ maven-scm-publish-plugin
---
[INFO] -------------------------------------------------
[INFO] Build Summary:
[INFO]   Passed: 2, Failed: 1, Errors: 0, Skipped: 0
[INFO] -------------------------------------------------
[ERROR] The following builds failed:
[ERROR] *  publish-scm\pom.xml
[INFO] -------------------------------------------------
[INFO] ------------------------------------------------------------------------
[INFO] BUILD FAILURE
[INFO] ------------------------------------------------------------------------
[INFO] Total time: 03:45 min
[INFO] Finished at: 2019-02-28T18:00:16-08:00
[INFO] Final Memory: 50M/798M
[INFO] ------------------------------------------------------------------------
[INFO] [jenkins-event-spy] Generated F:\jenkins\jenkins-slave\workspace\en-scm-publish-plugin_MSCMPUB-38@tmp\withMaven1f4dadba\maven-spy-20190228-175630-613143169598758537280.log
[ERROR] Failed to execute goal org.apache.maven.plugins:maven-invoker-plugin:3.1.0:verify
(integration-test) on project maven-scm-publish-plugin: 1 build failed. See console output
above for details. -> [Help 1]
[ERROR] 
[ERROR] To see the full stack trace of the errors, re-run Maven with the -e switch.
[ERROR] Re-run Maven using the -X switch to enable full debug logging.
[ERROR] 
[ERROR] For more information about the errors and possible solutions, please read the following
articles:
[ERROR] [Help 1] http://cwiki.apache.org/confluence/display/MAVEN/MojoFailureException
Picked up JAVA_TOOL_OPTIONS: -Dmaven.ext.class.path="f:\jenkins\jenkins-slave\workspace\en-scm-publish-plugin_MSCMPUB-38@tmp\withMaven1f4dadba\pipeline-maven-spy.jar"
-Dorg.jenkinsci.plugins.pipeline.maven.reportsFolder="f:\jenkins\jenkins-slave\workspace\en-scm-publish-plugin_MSCMPUB-38@tmp\withMaven1f4dadba"

[Pipeline] }
[Pipeline] // dir
[Pipeline] }
[withMaven] invokerPublisher - Archive invoker results for Maven artifact MavenArtifact{org.apache.maven.plugins:maven-scm-publish-plugin:maven-plugin:3.1.0-SNAPSHOT(version:
3.1.0-SNAPSHOT, snapshot:false) } generated by PluginInvocation{org.apache.maven.plugins:maven-invoker-plugin:3.1.0@integration-test
 integration-test}: m\target\invoker-reports\*.xml
[withMaven] junitPublisher - Archive test results for Maven artifact org.apache.maven.plugins:maven-scm-publish-plugin:maven-plugin:3.1.0-SNAPSHOT
generated by maven-surefire-plugin:test (default-test): m\target\surefire-reports\*.xml
Recording test results
None of the test reports contained any result
[withMaven] Publishers: Invoker Publisher: 1290 ms, Junit Publisher: 38 ms
[Pipeline] // withMaven
[Pipeline] echo
[FAILURE-004] hudson.AbortException: script returned exit code 1
[Pipeline] cleanWs
[WS-CLEANUP] Deleting project workspace...
[WS-CLEANUP] Deferred wipeout is used...
[WS-CLEANUP] done
[Pipeline] }
[Pipeline] // stage
[Pipeline] }
[Pipeline] // node
[Pipeline] }
Failed in branch windows-jdk7
[Pipeline] // parallel
[Pipeline] echo
[FAILURE-001] org.jenkinsci.plugins.scriptsecurity.sandbox.RejectedAccessException: Scripts
not permitted to use method org.jenkinsci.plugins.workflow.support.steps.build.RunWrapper
getRawBuild
[Pipeline] stage
[Pipeline] { (Notifications)
[Pipeline] echo
Build result: FAILURE
[Pipeline] jiraIssueSelector
[Pipeline] emailext
Mime
  • Unnamed multipart/mixed (inline, None, 0 bytes)
View raw message