maven-notifications mailing list archives

Site index · List index
Message view « Date » · « Thread »
Top « Date » · « Thread »
From Apache Jenkins Server <jenk...@builds.apache.org>
Subject Build failed in Jenkins: Maven TLP » maven-wagon » WAGON-482 #1
Date Fri, 01 Mar 2019 04:19:35 GMT
See https://builds.apache.org/job/maven-box/job/maven-wagon/job/WAGON-482/1/

No changes.

All tests passed

Build log:
[...truncated 15677 lines...]
[Pipeline] // dir
[Pipeline] }
[withMaven] junitPublisher - Archive test results for Maven artifact org.apache.maven.wagon:wagon-provider-api:jar:3.0.1-SNAPSHOT
generated by maven-surefire-plugin:test (default-test): m\wagon-provider-api\target\surefire-reports\*.xml
Recording test results
[INFO] /F:/jenkins/jenkins-slave/workspace/maven-box_maven-wagon_WAGON-482/m/wagon-providers/wagon-ssh/src/test/java/org/apache/maven/wagon/providers/ssh/jsch/ScpWagonWithSshPrivateKeySearchTest.java:
F:\jenkins\jenkins-slave\workspace\maven-box_maven-wagon_WAGON-482\m\wagon-providers\wagon-ssh\src\test\java\org\apache\maven\wagon\providers\ssh\jsch\ScpWagonWithSshPrivateKeySearchTest.java
uses or overrides a deprecated API.
[INFO] /F:/jenkins/jenkins-slave/workspace/maven-box_maven-wagon_WAGON-482/m/wagon-providers/wagon-ssh/src/test/java/org/apache/maven/wagon/providers/ssh/jsch/ScpWagonWithSshPrivateKeySearchTest.java:
Recompile with -Xlint:deprecation for details.
[INFO] 
[INFO] --- maven-surefire-plugin:2.20:test (default-test) @ wagon-ssh ---
[INFO] 
[INFO] --- maven-jar-plugin:2.5:jar (default-jar) @ wagon-ssh ---
[INFO] Building jar: F:\jenkins\jenkins-slave\workspace\maven-box_maven-wagon_WAGON-482\m\wagon-providers\wagon-ssh\target\wagon-ssh-3.0.1-SNAPSHOT.jar
[INFO] 
[INFO] --- maven-site-plugin:3.4:attach-descriptor (attach-descriptor) @ wagon-ssh ---
[INFO] 
[INFO] --- maven-checkstyle-plugin:2.15:check (checkstyle-check) @ wagon-ssh ---
[withMaven] junitPublisher - Archive test results for Maven artifact org.apache.maven.wagon:wagon-provider-test:jar:3.0.1-SNAPSHOT
generated by maven-surefire-plugin:test (default-test): m\wagon-provider-test\target\surefire-reports\*.xml
Recording test results
None of the test reports contained any result
[withMaven] junitPublisher - Archive test results for Maven artifact org.apache.maven.wagon:wagon-file:jar:3.0.1-SNAPSHOT
generated by maven-surefire-plugin:test (default-test): m\wagon-providers\wagon-file\target\surefire-reports\*.xml
Recording test results
[withMaven] junitPublisher - Archive test results for Maven artifact org.apache.maven.wagon:wagon-ftp:jar:3.0.1-SNAPSHOT
generated by maven-surefire-plugin:test (default-test): m\wagon-providers\wagon-ftp\target\surefire-reports\*.xml
Recording test results
[INFO] There is 1 error reported by Checkstyle 6.1.1 with config/maven_checks.xml ruleset.
[INFO] Ignored 1 error, 0 violation remaining.
[INFO] 
[INFO] ------------------------------------------------------------------------
[INFO] Building Apache Maven Wagon :: Providers :: WebDAV Provider 3.0.1-SNAPSHOT
[INFO] ------------------------------------------------------------------------
[INFO] Downloading from central: https://repo.maven.apache.org/maven2/org/apache/jackrabbit/jackrabbit-webdav/2.14.1/jackrabbit-webdav-2.14.1.pom
[INFO] Downloaded from central: https://repo.maven.apache.org/maven2/org/apache/jackrabbit/jackrabbit-webdav/2.14.1/jackrabbit-webdav-2.14.1.pom
(5.3 kB at 191 kB/s)
[INFO] Downloading from central: https://repo.maven.apache.org/maven2/org/apache/jackrabbit/jackrabbit-parent/2.14.1/jackrabbit-parent-2.14.1.pom
[INFO] Downloaded from central: https://repo.maven.apache.org/maven2/org/apache/jackrabbit/jackrabbit-parent/2.14.1/jackrabbit-parent-2.14.1.pom
(32 kB at 1.1 MB/s)
[INFO] Downloading from central: https://repo.maven.apache.org/maven2/commons-codec/commons-codec/1.10/commons-codec-1.10.pom
[INFO] Downloaded from central: https://repo.maven.apache.org/maven2/commons-codec/commons-codec/1.10/commons-codec-1.10.pom
(12 kB at 553 kB/s)
[INFO] Downloading from central: https://repo.maven.apache.org/maven2/org/apache/commons/commons-parent/35/commons-parent-35.pom
[INFO] Downloaded from central: https://repo.maven.apache.org/maven2/org/apache/commons/commons-parent/35/commons-parent-35.pom
(58 kB at 2.1 MB/s)
[INFO] Downloading from central: https://repo.maven.apache.org/maven2/it/could/webdav/0.4/webdav-0.4.pom
[INFO] Downloaded from central: https://repo.maven.apache.org/maven2/it/could/webdav/0.4/webdav-0.4.pom
(1.1 kB at 49 kB/s)
[INFO] Downloading from central: https://repo.maven.apache.org/maven2/biz/aQute/bnd/1.50.0/bnd-1.50.0.pom
[withMaven] junitPublisher - Archive test results for Maven artifact org.apache.maven.wagon:wagon-http-shared:jar:3.0.1-SNAPSHOT
generated by maven-surefire-plugin:test (default-test): m\wagon-providers\wagon-http-shared\target\surefire-reports\*.xml
Recording test results
[INFO] Downloaded from central: https://repo.maven.apache.org/maven2/biz/aQute/bnd/1.50.0/bnd-1.50.0.pom
(1.3 kB at 47 kB/s)
[INFO] Downloading from central: https://repo.maven.apache.org/maven2/commons-codec/commons-codec/1.10/commons-codec-1.10.jar
[INFO] Downloading from central: https://repo.maven.apache.org/maven2/org/apache/jackrabbit/jackrabbit-webdav/2.14.1/jackrabbit-webdav-2.14.1.jar
[INFO] Downloading from central: https://repo.maven.apache.org/maven2/it/could/webdav/0.4/webdav-0.4.jar
[INFO] Downloading from central: https://repo.maven.apache.org/maven2/javax/servlet/servlet-api/2.3/servlet-api-2.3.jar
[INFO] Downloading from central: https://repo.maven.apache.org/maven2/biz/aQute/bnd/1.50.0/bnd-1.50.0.jar
[INFO] Downloaded from central: https://repo.maven.apache.org/maven2/biz/aQute/bnd/1.50.0/bnd-1.50.0.jar
(828 kB at 8.4 MB/s)
[INFO] Downloaded from central: https://repo.maven.apache.org/maven2/commons-codec/commons-codec/1.10/commons-codec-1.10.jar
(284 kB at 2.7 MB/s)
[INFO] Downloaded from central: https://repo.maven.apache.org/maven2/org/apache/jackrabbit/jackrabbit-webdav/2.14.1/jackrabbit-webdav-2.14.1.jar
(364 kB at 3.3 MB/s)
[INFO] Downloaded from central: https://repo.maven.apache.org/maven2/javax/servlet/servlet-api/2.3/servlet-api-2.3.jar
(78 kB at 473 kB/s)
[withMaven] junitPublisher - Archive test results for Maven artifact org.apache.maven.wagon:wagon-tck-http:jar:3.0.1-SNAPSHOT
generated by maven-surefire-plugin:test (default-test): m\wagon-tcks\wagon-tck-http\target\surefire-reports\*.xml
Recording test results
None of the test reports contained any result
[withMaven] junitPublisher - Archive test results for Maven artifact org.apache.maven.wagon:wagon-http:jar:3.0.1-SNAPSHOT
generated by maven-surefire-plugin:test (default-test): m\wagon-providers\wagon-http\target\surefire-reports\*.xml
Recording test results
[INFO] Downloaded from central: https://repo.maven.apache.org/maven2/it/could/webdav/0.4/webdav-0.4.jar
(103 kB at 377 kB/s)
[INFO] 
[INFO] --- maven-clean-plugin:2.5:clean (default-clean) @ wagon-webdav-jackrabbit ---
[INFO] 
[INFO] --- maven-enforcer-plugin:1.3.1:enforce (enforce-bytecode-version) @ wagon-webdav-jackrabbit
---
[INFO] 
[INFO] --- maven-enforcer-plugin:1.3.1:enforce (ban-known-bad-maven-versions) @ wagon-webdav-jackrabbit
---
[INFO] 
[INFO] --- maven-enforcer-plugin:1.3.1:enforce (default) @ wagon-webdav-jackrabbit ---
[INFO] 
[INFO] --- apache-rat-plugin:0.11:check (rat-check) @ wagon-webdav-jackrabbit ---
[INFO] 51 implicit excludes (use -debug for more details).
[INFO] Exclude: .checkstyle
[INFO] Exclude: **/*.odg
[INFO] Exclude: src/test/resources/**
[INFO] Exclude: src/main/resources/default-server-root/**
[INFO] Exclude: src/main/resources/ssh-keys/**
[INFO] Exclude: src/test/ssh-keys/**
[INFO] Exclude: .repository/**
[INFO] Exclude: out/**
[INFO] Exclude: DEPENDENCIES
[INFO] 12 resources included (use -debug for more details)
[INFO] Rat check: Summary of files. Unapproved: 0 unknown: 0 generated: 0 approved: 12 licence.
[INFO] 
[INFO] --- maven-remote-resources-plugin:1.5:process (default) @ wagon-webdav-jackrabbit ---
[INFO] 
[INFO] --- maven-resources-plugin:2.7:resources (default-resources) @ wagon-webdav-jackrabbit
---
[INFO] Using 'UTF-8' encoding to copy filtered resources.
[INFO] Copying 1 resource
[INFO] Copying 3 resources
[INFO] 
[INFO] --- maven-compiler-plugin:3.2:compile (default-compile) @ wagon-webdav-jackrabbit ---
[INFO] Changes detected - recompiling the module!
[INFO] Compiling 4 source files to F:\jenkins\jenkins-slave\workspace\maven-box_maven-wagon_WAGON-482\m\wagon-providers\wagon-webdav-jackrabbit\target\classes
[withMaven] junitPublisher - Archive test results for Maven artifact org.apache.maven.wagon:wagon-http-lightweight:jar:3.0.1-SNAPSHOT
generated by maven-surefire-plugin:test (default-test): m\wagon-providers\wagon-http-lightweight\target\surefire-reports\*.xml
Recording test results
[INFO] /F:/jenkins/jenkins-slave/workspace/maven-box_maven-wagon_WAGON-482/m/wagon-providers/wagon-webdav-jackrabbit/src/main/java/org/apache/maven/wagon/providers/webdav/WebDavWagon.java:
F:\jenkins\jenkins-slave\workspace\maven-box_maven-wagon_WAGON-482\m\wagon-providers\wagon-webdav-jackrabbit\src\main\java\org\apache\maven\wagon\providers\webdav\WebDavWagon.java
uses or overrides a deprecated API.
[INFO] /F:/jenkins/jenkins-slave/workspace/maven-box_maven-wagon_WAGON-482/m/wagon-providers/wagon-webdav-jackrabbit/src/main/java/org/apache/maven/wagon/providers/webdav/WebDavWagon.java:
Recompile with -Xlint:deprecation for details.
[INFO] 
[INFO] --- plexus-component-metadata:1.5.5:generate-metadata (generate) @ wagon-webdav-jackrabbit
---
[INFO] Discovered 1 component descriptors(s)
[INFO] 
[INFO] --- animal-sniffer-maven-plugin:1.15:check (check-java-1.7-compat) @ wagon-webdav-jackrabbit
---
[INFO] Checking unresolved references to org.codehaus.mojo.signature:java17:1.0
[withMaven] junitPublisher - Archive test results for Maven artifact org.apache.maven.wagon:wagon-scm:jar:3.0.1-SNAPSHOT
generated by maven-surefire-plugin:test (default-test): m\wagon-providers\wagon-scm\target\surefire-reports\*.xml
Recording test results
[withMaven] junitPublisher - Archive test results for Maven artifact org.apache.maven.wagon:wagon-ssh-common:jar:3.0.1-SNAPSHOT
generated by maven-surefire-plugin:test (default-test): m\wagon-providers\wagon-ssh-common\target\surefire-reports\*.xml
Recording test results
[INFO] 
[INFO] --- maven-resources-plugin:2.7:testResources (default-testResources) @ wagon-webdav-jackrabbit
---
[INFO] Using 'UTF-8' encoding to copy filtered resources.
[INFO] Copying 2 resources
[INFO] Copying 3 resources
[INFO] 
[INFO] --- maven-compiler-plugin:3.2:testCompile (default-testCompile) @ wagon-webdav-jackrabbit
---
[INFO] Changes detected - recompiling the module!
[INFO] Compiling 4 source files to F:\jenkins\jenkins-slave\workspace\maven-box_maven-wagon_WAGON-482\m\wagon-providers\wagon-webdav-jackrabbit\target\test-classes
[withMaven] junitPublisher - Archive test results for Maven artifact org.apache.maven.wagon:wagon-ssh-common-test:jar:3.0.1-SNAPSHOT
generated by maven-surefire-plugin:test (default-test): m\wagon-providers\wagon-ssh-common-test\target\surefire-reports\*.xml
Recording test results
None of the test reports contained any result
[withMaven] junitPublisher - Archive test results for Maven artifact org.apache.maven.wagon:wagon-ssh-external:jar:3.0.1-SNAPSHOT
generated by maven-surefire-plugin:test (default-test): m\wagon-providers\wagon-ssh-external\target\surefire-reports\*.xml
Recording test results
None of the test reports contained any result
[withMaven] junitPublisher - Archive test results for Maven artifact org.apache.maven.wagon:wagon-ssh:jar:3.0.1-SNAPSHOT
generated by maven-surefire-plugin:test (default-test): m\wagon-providers\wagon-ssh\target\surefire-reports\*.xml
Recording test results
[INFO] /F:/jenkins/jenkins-slave/workspace/maven-box_maven-wagon_WAGON-482/m/wagon-providers/wagon-webdav-jackrabbit/src/test/java/org/apache/maven/wagon/providers/webdav/HttpClientWagonTest.java:
F:\jenkins\jenkins-slave\workspace\maven-box_maven-wagon_WAGON-482\m\wagon-providers\wagon-webdav-jackrabbit\src\test\java\org\apache\maven\wagon\providers\webdav\HttpClientWagonTest.java
uses or overrides a deprecated API.
[INFO] /F:/jenkins/jenkins-slave/workspace/maven-box_maven-wagon_WAGON-482/m/wagon-providers/wagon-webdav-jackrabbit/src/test/java/org/apache/maven/wagon/providers/webdav/HttpClientWagonTest.java:
Recompile with -Xlint:deprecation for details.
[INFO] 
[INFO] --- maven-surefire-plugin:2.20:test (default-test) @ wagon-webdav-jackrabbit ---
[INFO] 
[INFO] -------------------------------------------------------
[INFO]  T E S T S
[INFO] -------------------------------------------------------
None of the test reports contained any result
[withMaven] junitPublisher - Archive test results for Maven artifact org.apache.maven.wagon:wagon-webdav-jackrabbit:jar:3.0.1-SNAPSHOT
generated by maven-surefire-plugin:test (default-test): m\wagon-providers\wagon-webdav-jackrabbit\target\surefire-reports\*.xml
Recording test results
[INFO] Running org.apache.maven.wagon.providers.webdav.HttpClientWagonTest
[withMaven] Publishers: Pipeline Graph Publisher: 12 ms, Junit Publisher: 4183 ms, Concordion
Publisher: 1 ms, Dependencies Fingerprint Publisher: 637 ms, JGiven Publisher: 1 ms
[Pipeline] // withMaven
[Pipeline] cleanWs
[WS-CLEANUP] Deleting project workspace...
[WS-CLEANUP] Deferred wipeout is used...
[WS-CLEANUP] done
[Pipeline] }
[Pipeline] // stage
[Pipeline] }
[Pipeline] // node
[Pipeline] }
[INFO] Tests run: 6, Failures: 0, Errors: 0, Skipped: 0, Time elapsed: 0.945 s - in org.apache.maven.wagon.providers.webdav.HttpClientWagonTest
[INFO] Running org.apache.maven.wagon.providers.webdav.PathNavigatorTest
[INFO] Tests run: 1, Failures: 0, Errors: 0, Skipped: 0, Time elapsed: 0 s - in org.apache.maven.wagon.providers.webdav.PathNavigatorTest
[INFO] Running org.apache.maven.wagon.providers.webdav.WebDavsWagonTest
[INFO] Tests run: 69, Failures: 0, Errors: 0, Skipped: 0, Time elapsed: 32.477 s - in org.apache.maven.wagon.providers.webdav.WebDavsWagonTest
[INFO] Running org.apache.maven.wagon.providers.webdav.WebDavWagonTest
[INFO] Tests run: 69, Failures: 0, Errors: 0, Skipped: 0, Time elapsed: 27.016 s - in org.apache.maven.wagon.providers.webdav.WebDavWagonTest
[INFO] 
[INFO] Results:
[INFO] 
[INFO] Tests run: 145, Failures: 0, Errors: 0, Skipped: 0
[INFO] 
[INFO] 
[INFO] --- maven-jar-plugin:2.5:jar (default-jar) @ wagon-webdav-jackrabbit ---
[INFO] Building jar: F:\jenkins\jenkins-slave\workspace\maven-box_maven-wagon_WAGON-482\m\wagon-providers\wagon-webdav-jackrabbit\target\wagon-webdav-jackrabbit-3.0.1-SNAPSHOT.jar
[INFO] 
[INFO] --- maven-site-plugin:3.4:attach-descriptor (attach-descriptor) @ wagon-webdav-jackrabbit
---
[INFO] 
[INFO] --- maven-checkstyle-plugin:2.15:check (checkstyle-check) @ wagon-webdav-jackrabbit
---
[INFO] ------------------------------------------------------------------------
[INFO] Reactor Summary:
[INFO] 
[INFO] Apache Maven Wagon ................................. SUCCESS [ 47.778 s]
[INFO] Apache Maven Wagon :: API .......................... SUCCESS [ 17.487 s]
[INFO] Apache Maven Wagon :: Provider Test ................ SUCCESS [  5.642 s]
[INFO] Apache Maven Wagon :: Providers .................... SUCCESS [  1.767 s]
[INFO] Apache Maven Wagon :: Providers :: File Provider ... SUCCESS [  4.797 s]
[INFO] Apache Maven Wagon :: Providers :: FTP Provider .... SUCCESS [  9.965 s]
[INFO] Apache Maven Wagon :: Providers :: HTTP Shared Library SUCCESS [  5.610 s]
[INFO] Apache Maven Wagon :: Test Compatibility Kits ...... SUCCESS [  1.705 s]
[INFO] Apache Maven Wagon :: HTTP Test Compatibility Kit .. SUCCESS [  3.005 s]
[INFO] Apache Maven Wagon :: Providers :: HTTP Provider ... SUCCESS [04:56 min]
[INFO] Apache Maven Wagon :: Providers :: Lightweight HTTP Provider SUCCESS [02:15 min]
[INFO] Apache Maven Wagon :: Providers :: SCM Provider .... SUCCESS [ 29.051 s]
[INFO] Apache Maven Wagon :: Providers :: SSH Common Library SUCCESS [  4.944 s]
[INFO] Apache Maven Wagon :: Providers :: SSH Common Tests  SUCCESS [  4.536 s]
[INFO] Apache Maven Wagon :: Providers :: SSH External Provider SUCCESS [  2.719 s]
[INFO] Apache Maven Wagon :: Providers :: SSH Provider .... SUCCESS [  5.875 s]
[INFO] Apache Maven Wagon :: Providers :: WebDAV Provider . SUCCESS [01:05 min]
[INFO] ------------------------------------------------------------------------
[INFO] BUILD SUCCESS
[INFO] ------------------------------------------------------------------------
[INFO] Total time: 10:44 min
[INFO] Finished at: 2019-02-28T20:19:27-08:00
[INFO] Final Memory: 53M/449M
[INFO] ------------------------------------------------------------------------
[WARNING] The requested profile "run-its" could not be activated because it does not exist.
[INFO] [jenkins-event-spy] Generated F:\jenkins\jenkins-slave\workspace\maven-box_maven-wagon_WAGON-482@tmp\withMavenb5cafb9a\maven-spy-20190228-200842-3888241855722152662412.log
Picked up JAVA_TOOL_OPTIONS: -Dmaven.ext.class.path="f:\jenkins\jenkins-slave\workspace\maven-box_maven-wagon_WAGON-482@tmp\withMavenb5cafb9a\pipeline-maven-spy.jar"
-Dorg.jenkinsci.plugins.pipeline.maven.reportsFolder="f:\jenkins\jenkins-slave\workspace\maven-box_maven-wagon_WAGON-482@tmp\withMavenb5cafb9a"

[Pipeline] }
[Pipeline] // dir
[Pipeline] }
[withMaven] junitPublisher - Archive test results for Maven artifact org.apache.maven.wagon:wagon-provider-api:jar:3.0.1-SNAPSHOT
generated by maven-surefire-plugin:test (default-test): m\wagon-provider-api\target\surefire-reports\*.xml
Recording test results
[withMaven] junitPublisher - Archive test results for Maven artifact org.apache.maven.wagon:wagon-provider-test:jar:3.0.1-SNAPSHOT
generated by maven-surefire-plugin:test (default-test): m\wagon-provider-test\target\surefire-reports\*.xml
Recording test results
None of the test reports contained any result
[withMaven] junitPublisher - Archive test results for Maven artifact org.apache.maven.wagon:wagon-file:jar:3.0.1-SNAPSHOT
generated by maven-surefire-plugin:test (default-test): m\wagon-providers\wagon-file\target\surefire-reports\*.xml
Recording test results
[withMaven] junitPublisher - Archive test results for Maven artifact org.apache.maven.wagon:wagon-ftp:jar:3.0.1-SNAPSHOT
generated by maven-surefire-plugin:test (default-test): m\wagon-providers\wagon-ftp\target\surefire-reports\*.xml
Recording test results
[withMaven] junitPublisher - Archive test results for Maven artifact org.apache.maven.wagon:wagon-http-shared:jar:3.0.1-SNAPSHOT
generated by maven-surefire-plugin:test (default-test): m\wagon-providers\wagon-http-shared\target\surefire-reports\*.xml
Recording test results
[withMaven] junitPublisher - Archive test results for Maven artifact org.apache.maven.wagon:wagon-tck-http:jar:3.0.1-SNAPSHOT
generated by maven-surefire-plugin:test (default-test): m\wagon-tcks\wagon-tck-http\target\surefire-reports\*.xml
Recording test results
None of the test reports contained any result
[withMaven] junitPublisher - Archive test results for Maven artifact org.apache.maven.wagon:wagon-http:jar:3.0.1-SNAPSHOT
generated by maven-surefire-plugin:test (default-test): m\wagon-providers\wagon-http\target\surefire-reports\*.xml
Recording test results
[withMaven] junitPublisher - Archive test results for Maven artifact org.apache.maven.wagon:wagon-http-lightweight:jar:3.0.1-SNAPSHOT
generated by maven-surefire-plugin:test (default-test): m\wagon-providers\wagon-http-lightweight\target\surefire-reports\*.xml
Recording test results
[withMaven] junitPublisher - Archive test results for Maven artifact org.apache.maven.wagon:wagon-scm:jar:3.0.1-SNAPSHOT
generated by maven-surefire-plugin:test (default-test): m\wagon-providers\wagon-scm\target\surefire-reports\*.xml
Recording test results
[withMaven] junitPublisher - Archive test results for Maven artifact org.apache.maven.wagon:wagon-ssh-common:jar:3.0.1-SNAPSHOT
generated by maven-surefire-plugin:test (default-test): m\wagon-providers\wagon-ssh-common\target\surefire-reports\*.xml
Recording test results
[withMaven] junitPublisher - Archive test results for Maven artifact org.apache.maven.wagon:wagon-ssh-common-test:jar:3.0.1-SNAPSHOT
generated by maven-surefire-plugin:test (default-test): m\wagon-providers\wagon-ssh-common-test\target\surefire-reports\*.xml
Recording test results
None of the test reports contained any result
[withMaven] junitPublisher - Archive test results for Maven artifact org.apache.maven.wagon:wagon-ssh-external:jar:3.0.1-SNAPSHOT
generated by maven-surefire-plugin:test (default-test): m\wagon-providers\wagon-ssh-external\target\surefire-reports\*.xml
Recording test results
None of the test reports contained any result
[withMaven] junitPublisher - Archive test results for Maven artifact org.apache.maven.wagon:wagon-ssh:jar:3.0.1-SNAPSHOT
generated by maven-surefire-plugin:test (default-test): m\wagon-providers\wagon-ssh\target\surefire-reports\*.xml
Recording test results
None of the test reports contained any result
[withMaven] junitPublisher - Archive test results for Maven artifact org.apache.maven.wagon:wagon-webdav-jackrabbit:jar:3.0.1-SNAPSHOT
generated by maven-surefire-plugin:test (default-test): m\wagon-providers\wagon-webdav-jackrabbit\target\surefire-reports\*.xml
Recording test results
[withMaven] Publishers: Pipeline Graph Publisher: 10 ms, Junit Publisher: 5423 ms, Concordion
Publisher: 1 ms, Dependencies Fingerprint Publisher: 662 ms, JGiven Publisher: 1 ms
[Pipeline] // withMaven
[Pipeline] cleanWs
[WS-CLEANUP] Deleting project workspace...
[WS-CLEANUP] Deferred wipeout is used...
[WS-CLEANUP] done
[Pipeline] }
[Pipeline] // stage
[Pipeline] }
[Pipeline] // node
[Pipeline] }
[Pipeline] // parallel
[Pipeline] echo
[FAILURE-001] org.jenkinsci.plugins.scriptsecurity.sandbox.RejectedAccessException: Scripts
not permitted to use method org.jenkinsci.plugins.workflow.support.steps.build.RunWrapper
getRawBuild
[Pipeline] stage
[Pipeline] { (Notifications)
[Pipeline] echo
Build result: FAILURE
[Pipeline] jiraIssueSelector
[Pipeline] emailext
Mime
  • Unnamed multipart/mixed (inline, None, 0 bytes)
View raw message