maven-notifications mailing list archives

Site index · List index
Message view « Date » · « Thread »
Top « Date » · « Thread »
From Apache Jenkins Server <jenk...@builds.apache.org>
Subject Build failed in Jenkins: Maven TLP » maven-surefire » SUREFIRE-1004 #2
Date Fri, 01 Mar 2019 03:20:55 GMT
See https://builds.apache.org/job/maven-box/job/maven-surefire/job/SUREFIRE-1004/2/

No changes.

1 tests failed.
FAILED:  org.apache.maven.surefire.its.JUnitPlatformEnginesIT.platform[1.4.0-SNAPSHOT]

Error Message:

Expected: <[\[DEBUG\] test\(compact\) classpath:  test-classes  classes  junit-jupiter-engine-5\.4\.0-SNAPSHOT\.jar
 apiguardian-api-1\.0\.0\.jar  junit-platform-engine-1\.4\.0-SNAPSHOT\.jar  junit-platform-commons-1\.4\.0-SNAPSHOT\.jar
 opentest4j-1\.1\.1\.jar  junit-jupiter-api-5\.4\.0-SNAPSHOT\.jar]>
     but: was <[[DEBUG] test(compact) classpath:  test-classes  classes  junit-jupiter-engine-5.4.0-SNAPSHOT.jar
 apiguardian-api-1.0.0.jar  junit-platform-engine-1.4.0-SNAPSHOT.jar  opentest4j-1.1.1.jar
 junit-platform-commons-1.4.0-SNAPSHOT.jar  junit-jupiter-api-5.4.0-SNAPSHOT.jar]>

Stack Trace:
java.lang.AssertionError: 

Expected: <[\[DEBUG\] test\(compact\) classpath:  test-classes  classes  junit-jupiter-engine-5\.4\.0-SNAPSHOT\.jar
 apiguardian-api-1\.0\.0\.jar  junit-platform-engine-1\.4\.0-SNAPSHOT\.jar  junit-platform-commons-1\.4\.0-SNAPSHOT\.jar
 opentest4j-1\.1\.1\.jar  junit-jupiter-api-5\.4\.0-SNAPSHOT\.jar]>
     but: was <[[DEBUG] test(compact) classpath:  test-classes  classes  junit-jupiter-engine-5.4.0-SNAPSHOT.jar
 apiguardian-api-1.0.0.jar  junit-platform-engine-1.4.0-SNAPSHOT.jar  opentest4j-1.1.1.jar
 junit-platform-commons-1.4.0-SNAPSHOT.jar  junit-jupiter-api-5.4.0-SNAPSHOT.jar]>
	at org.apache.maven.surefire.its.JUnitPlatformEnginesIT.platform(JUnitPlatformEnginesIT.java:110)




Build log:
[...truncated 23675 lines...]
[2019-03-01T02:25:11.639Z]     at org.apache.maven.plugin.failsafe.VerifyMojo.execute (VerifyMojo.java:192)
[2019-03-01T02:25:11.639Z]     at org.apache.maven.plugin.DefaultBuildPluginManager.executeMojo
(DefaultBuildPluginManager.java:137)
[2019-03-01T02:25:11.639Z]     at org.apache.maven.lifecycle.internal.MojoExecutor.execute
(MojoExecutor.java:210)
[2019-03-01T02:25:11.639Z]     at org.apache.maven.lifecycle.internal.MojoExecutor.execute
(MojoExecutor.java:156)
[2019-03-01T02:25:11.639Z]     at org.apache.maven.lifecycle.internal.MojoExecutor.execute
(MojoExecutor.java:148)
[2019-03-01T02:25:11.639Z]     at org.apache.maven.lifecycle.internal.LifecycleModuleBuilder.buildProject
(LifecycleModuleBuilder.java:117)
[2019-03-01T02:25:11.639Z]     at org.apache.maven.lifecycle.internal.LifecycleModuleBuilder.buildProject
(LifecycleModuleBuilder.java:81)
[2019-03-01T02:25:11.639Z]     at org.apache.maven.lifecycle.internal.builder.singlethreaded.SingleThreadedBuilder.build
(SingleThreadedBuilder.java:56)
[2019-03-01T02:25:11.639Z]     at org.apache.maven.lifecycle.internal.LifecycleStarter.execute
(LifecycleStarter.java:128)
[2019-03-01T02:25:11.639Z]     at org.apache.maven.DefaultMaven.doExecute (DefaultMaven.java:305)
[2019-03-01T02:25:11.639Z]     at org.apache.maven.DefaultMaven.doExecute (DefaultMaven.java:192)
[2019-03-01T02:25:11.639Z]     at org.apache.maven.DefaultMaven.execute (DefaultMaven.java:105)
[2019-03-01T02:25:11.639Z]     at org.apache.maven.cli.MavenCli.execute (MavenCli.java:956)
[2019-03-01T02:25:11.639Z]     at org.apache.maven.cli.MavenCli.doMain (MavenCli.java:288)
[2019-03-01T02:25:11.639Z]     at org.apache.maven.cli.MavenCli.main (MavenCli.java:192)
[2019-03-01T02:25:11.639Z]     at sun.reflect.NativeMethodAccessorImpl.invoke0 (Native Method)
[2019-03-01T02:25:11.639Z]     at sun.reflect.NativeMethodAccessorImpl.invoke (NativeMethodAccessorImpl.java:62)
[2019-03-01T02:25:11.639Z]     at sun.reflect.DelegatingMethodAccessorImpl.invoke (DelegatingMethodAccessorImpl.java:43)
[2019-03-01T02:25:11.639Z]     at java.lang.reflect.Method.invoke (Method.java:498)
[2019-03-01T02:25:11.639Z]     at org.codehaus.plexus.classworlds.launcher.Launcher.launchEnhanced
(Launcher.java:289)
[2019-03-01T02:25:11.639Z]     at org.codehaus.plexus.classworlds.launcher.Launcher.launch
(Launcher.java:229)
[2019-03-01T02:25:11.639Z]     at org.codehaus.plexus.classworlds.launcher.Launcher.mainWithExitCode
(Launcher.java:415)
[2019-03-01T02:25:11.639Z]     at org.codehaus.plexus.classworlds.launcher.Launcher.main (Launcher.java:356)
[2019-03-01T02:25:11.639Z] [ERROR] 
[2019-03-01T02:25:11.639Z] [ERROR] Re-run Maven using the -X switch to enable full debug logging.
[2019-03-01T02:25:11.639Z] [ERROR] 
[2019-03-01T02:25:11.639Z] [ERROR] For more information about the errors and possible solutions,
please read the following articles:
[2019-03-01T02:25:11.639Z] [ERROR] [Help 1] http://cwiki.apache.org/confluence/display/MAVEN/MojoFailureException
[2019-03-01T02:25:11.639Z] [ERROR] 
[2019-03-01T02:25:11.639Z] [ERROR] After correcting the problems, you can resume the build
with the command
[2019-03-01T02:25:11.639Z] [ERROR]   mvn <goals> -rf :surefire-its
[Pipeline] }
[Pipeline] // withEnv
[Pipeline] }
[Pipeline] // stage
[Pipeline] fileExists
[Pipeline] zip
[2019-03-01T02:25:12.702Z] Writing zip file of /home/jenkins/jenkins-slave/workspace/box_maven-surefire_SUREFIRE-1004@2/maven-failsafe-plugin/target/it
to /home/jenkins/jenkins-slave/workspace/box_maven-surefire_SUREFIRE-1004@2/maven-failsafe-plugin--linux-jdk11-maven3.6.x.zip
[2019-03-01T02:25:13.246Z] Zipped 78 entries.
[2019-03-01T02:25:13.246Z] Archiving /home/jenkins/jenkins-slave/workspace/box_maven-surefire_SUREFIRE-1004@2/maven-failsafe-plugin--linux-jdk11-maven3.6.x.zip
[2019-03-01T02:25:13.246Z] [Fast Archiver] No prior successful build to compare, so performing
full copy of artifacts
[Pipeline] fileExists
[Pipeline] zip
[2019-03-01T02:25:14.205Z] Writing zip file of /home/jenkins/jenkins-slave/workspace/box_maven-surefire_SUREFIRE-1004@2/surefire-its/target
to /home/jenkins/jenkins-slave/workspace/box_maven-surefire_SUREFIRE-1004@2/surefire-its--linux-jdk11-maven3.6.x.zip
[2019-03-01T02:25:20.383Z] [INFO] Tests run: 2, Failures: 0, Errors: 0, Skipped: 0, Time elapsed:
12.031 s - in org.apache.maven.surefire.its.jiras.Surefire920TestFailureIgnoreWithTimeoutIT
[2019-03-01T02:25:20.383Z] [INFO] Running org.apache.maven.surefire.its.jiras.Surefire926FailureWith2ProvidersIT
[2019-03-01T02:25:21.363Z] Zipped 16536 entries.
[2019-03-01T02:25:21.363Z] Archiving /home/jenkins/jenkins-slave/workspace/box_maven-surefire_SUREFIRE-1004@2/surefire-its--linux-jdk11-maven3.6.x.zip
[2019-03-01T02:25:21.363Z] [Fast Archiver] No prior successful build to compare, so performing
full copy of artifacts
[2019-03-01T02:25:22.725Z] [INFO] Tests run: 1, Failures: 0, Errors: 0, Skipped: 0, Time elapsed:
3.273 s - in org.apache.maven.surefire.its.jiras.Surefire926FailureWith2ProvidersIT
[2019-03-01T02:25:22.725Z] [INFO] Running org.apache.maven.surefire.its.jiras.Surefire930TestNgSuiteXmlIT
[Pipeline] archiveArtifacts
[2019-03-01T02:25:23.816Z] Archiving artifacts
[2019-03-01T02:25:23.976Z] [Fast Archiver] No prior successful build to compare, so performing
full copy of artifacts
[Pipeline] cleanWs
[2019-03-01T02:25:26.386Z] [WS-CLEANUP] Deleting project workspace...
[2019-03-01T02:25:26.386Z] [WS-CLEANUP] Deferred wipeout is used...
[2019-03-01T02:25:26.707Z] [WS-CLEANUP] done
[Pipeline] }
[Pipeline] // ws
[Pipeline] }
[Pipeline] // timestamps
[Pipeline] }
[Pipeline] // node
[Pipeline] }
[2019-03-01T02:25:28.038Z] [INFO] Tests run: 1, Failures: 0, Errors: 0, Skipped: 0, Time elapsed:
5.689 s - in org.apache.maven.surefire.its.jiras.Surefire930TestNgSuiteXmlIT
[2019-03-01T02:25:28.038Z] [INFO] Running org.apache.maven.surefire.its.jiras.Surefire943ReportContentIT
[2019-03-01T02:25:49.404Z] [INFO] Tests run: 2, Failures: 0, Errors: 0, Skipped: 0, Time elapsed:
20.987 s - in org.apache.maven.surefire.its.jiras.Surefire943ReportContentIT
[2019-03-01T02:25:49.404Z] [INFO] Running org.apache.maven.surefire.its.jiras.Surefire946KillMainProcessInReusableForkIT
[2019-03-01T02:26:10.697Z] [INFO] Tests run: 3, Failures: 0, Errors: 0, Skipped: 0, Time elapsed:
21.069 s - in org.apache.maven.surefire.its.jiras.Surefire946KillMainProcessInReusableForkIT
[2019-03-01T02:26:10.697Z] [INFO] Running org.apache.maven.surefire.its.jiras.Surefire972BizarreNoClassDefIT
[2019-03-01T02:26:15.944Z] [INFO] Tests run: 1, Failures: 0, Errors: 0, Skipped: 0, Time elapsed:
5.807 s - in org.apache.maven.surefire.its.jiras.Surefire972BizarreNoClassDefIT
[2019-03-01T02:26:15.944Z] [INFO] Running org.apache.maven.surefire.its.jiras.Surefire975DefaultVMEncodingIT
[2019-03-01T02:26:21.292Z] [INFO] Tests run: 1, Failures: 0, Errors: 0, Skipped: 0, Time elapsed:
4.36 s - in org.apache.maven.surefire.its.jiras.Surefire975DefaultVMEncodingIT
[2019-03-01T02:26:21.292Z] [INFO] Running org.apache.maven.surefire.its.jiras.Surefire979WrongClassLoaderIT
[2019-03-01T02:26:24.518Z] [INFO] Tests run: 1, Failures: 0, Errors: 0, Skipped: 0, Time elapsed:
4.061 s - in org.apache.maven.surefire.its.jiras.Surefire979WrongClassLoaderIT
[2019-03-01T02:26:24.518Z] [INFO] Running org.apache.maven.surefire.its.jiras.Surefire985ParameterizedRunnerAndCategoriesIT
[2019-03-01T02:26:28.711Z] [INFO] Tests run: 1, Failures: 0, Errors: 0, Skipped: 0, Time elapsed:
3.468 s - in org.apache.maven.surefire.its.jiras.Surefire985ParameterizedRunnerAndCategoriesIT
[2019-03-01T02:26:28.711Z] [INFO] Running org.apache.maven.surefire.its.jiras.Surefire995CategoryInheritanceIT
[2019-03-01T02:26:46.809Z] [INFO] Tests run: 5, Failures: 0, Errors: 0, Skipped: 0, Time elapsed:
17.096 s - in org.apache.maven.surefire.its.jiras.Surefire995CategoryInheritanceIT
[2019-03-01T02:26:46.809Z] [INFO] 
[2019-03-01T02:26:46.809Z] [INFO] Results:
[2019-03-01T02:26:46.809Z] [INFO] 
[2019-03-01T02:26:46.809Z] [ERROR] Failures: 
[2019-03-01T02:26:46.809Z] [ERROR]   JUnitPlatformEnginesIT.platform:110 
[2019-03-01T02:26:46.809Z] Expected: <[\[DEBUG\] test\(compact\) classpath:  test-classes
 classes  junit-jupiter-engine-5\.4\.0-SNAPSHOT\.jar  apiguardian-api-1\.0\.0\.jar  junit-platform-engine-1\.4\.0-SNAPSHOT\.jar
 junit-platform-commons-1\.4\.0-SNAPSHOT\.jar  opentest4j-1\.1\.1\.jar  junit-jupiter-api-5\.4\.0-SNAPSHOT\.jar]>
[2019-03-01T02:26:46.809Z]      but: was <[[DEBUG] test(compact) classpath:  test-classes
 classes  junit-jupiter-engine-5.4.0-SNAPSHOT.jar  apiguardian-api-1.0.0.jar  junit-platform-engine-1.4.0-SNAPSHOT.jar
 opentest4j-1.1.1.jar  junit-platform-commons-1.4.0-SNAPSHOT.jar  junit-jupiter-api-5.4.0-SNAPSHOT.jar]>
[2019-03-01T02:26:46.809Z] [INFO] 
[2019-03-01T02:26:46.809Z] [ERROR] Tests run: 787, Failures: 1, Errors: 0, Skipped: 134
[2019-03-01T02:26:46.809Z] [INFO] 
[2019-03-01T02:26:46.809Z] [INFO] 
[2019-03-01T02:26:46.809Z] [INFO] --- maven-checkstyle-plugin:3.0.0:check (checkstyle-check)
@ surefire-its ---
[2019-03-01T02:26:46.809Z] [INFO] 
[2019-03-01T02:26:46.809Z] [INFO] --- maven-failsafe-plugin:3.0.0-M3:verify (default) @ surefire-its
---
[2019-03-01T02:26:46.809Z] [INFO] Failsafe report directory: /home/jenkins/jenkins-slave/workspace/box_maven-surefire_SUREFIRE-1004@2/surefire-its/target/failsafe-reports
[2019-03-01T02:26:46.809Z] [INFO] ------------------------------------------------------------------------
[2019-03-01T02:26:46.810Z] [INFO] Reactor Summary for Apache Maven Surefire 3.0.0-M4-SNAPSHOT:
[2019-03-01T02:26:46.810Z] [INFO] 
[2019-03-01T02:26:46.810Z] [INFO] Apache Maven Surefire .............................. SUCCESS
[ 15.651 s]
[2019-03-01T02:26:46.810Z] [INFO] SureFire Logger API ................................ SUCCESS
[  3.405 s]
[2019-03-01T02:26:46.810Z] [INFO] SureFire API ....................................... SUCCESS
[ 10.471 s]
[2019-03-01T02:26:46.810Z] [INFO] SureFire Booter .................................... SUCCESS
[ 12.430 s]
[2019-03-01T02:26:46.810Z] [INFO] Maven Surefire Test-Grouping Support ............... SUCCESS
[  5.161 s]
[2019-03-01T02:26:46.810Z] [INFO] SureFire Providers ................................. SUCCESS
[  0.878 s]
[2019-03-01T02:26:46.810Z] [INFO] Shared JUnit3 Provider Code ........................ SUCCESS
[  3.483 s]
[2019-03-01T02:26:46.810Z] [INFO] Shared Java 5 Provider Base ........................ SUCCESS
[  4.375 s]
[2019-03-01T02:26:46.810Z] [INFO] Shared JUnit4 Provider Code ........................ SUCCESS
[  4.472 s]
[2019-03-01T02:26:46.810Z] [INFO] Shared JUnit48 Provider Code ....................... SUCCESS
[  4.824 s]
[2019-03-01T02:26:46.810Z] [INFO] SureFire JUnit Runner .............................. SUCCESS
[  3.342 s]
[2019-03-01T02:26:46.810Z] [INFO] SureFire JUnit4 Runner ............................. SUCCESS
[ 33.292 s]
[2019-03-01T02:26:46.810Z] [INFO] Maven Surefire Common .............................. SUCCESS
[ 32.709 s]
[2019-03-01T02:26:46.810Z] [INFO] SureFire JUnitCore Runner .......................... SUCCESS
[02:20 min]
[2019-03-01T02:26:46.810Z] [INFO] SureFire JUnit Platform Runner ..................... SUCCESS
[  7.308 s]
[2019-03-01T02:26:46.810Z] [INFO] SureFire TestNG Utils .............................. SUCCESS
[  3.600 s]
[2019-03-01T02:26:46.810Z] [INFO] SureFire TestNG Runner ............................. SUCCESS
[  4.166 s]
[2019-03-01T02:26:46.810Z] [INFO] ShadeFire JUnit3 Provider .......................... SUCCESS
[  1.187 s]
[2019-03-01T02:26:46.810Z] [INFO] Surefire Report Parser ............................. SUCCESS
[ 34.906 s]
[2019-03-01T02:26:46.810Z] [INFO] Maven Surefire Plugin .............................. SUCCESS
[  8.649 s]
[2019-03-01T02:26:46.810Z] [INFO] Maven Failsafe Plugin .............................. SUCCESS
[01:21 min]
[2019-03-01T02:26:46.810Z] [INFO] Maven Surefire Report Plugin ....................... SUCCESS
[ 15.125 s]
[2019-03-01T02:26:46.810Z] [INFO] Maven Surefire Integration Tests ................... FAILURE
[  01:00 h]
[2019-03-01T02:26:46.810Z] [INFO] ------------------------------------------------------------------------
[2019-03-01T02:26:46.810Z] [INFO] BUILD FAILURE
[2019-03-01T02:26:46.810Z] [INFO] ------------------------------------------------------------------------
[2019-03-01T02:26:46.810Z] [INFO] Total time:  01:07 h
[2019-03-01T02:26:46.810Z] [INFO] Finished at: 2019-03-01T02:26:45Z
[2019-03-01T02:26:46.810Z] [INFO] ------------------------------------------------------------------------
[2019-03-01T02:26:46.810Z] [ERROR] Failed to execute goal org.apache.maven.plugins:maven-failsafe-plugin:3.0.0-M3:verify
(default) on project surefire-its: There are test failures.
[2019-03-01T02:26:46.810Z] [ERROR] 
[2019-03-01T02:26:46.810Z] [ERROR] Please refer to /home/jenkins/jenkins-slave/workspace/box_maven-surefire_SUREFIRE-1004@2/surefire-its/target/failsafe-reports
for the individual test results.
[2019-03-01T02:26:46.810Z] [ERROR] Please refer to dump files (if any exist) [date].dump,
[date]-jvmRun[N].dump and [date].dumpstream.
[2019-03-01T02:26:46.810Z] [ERROR] -> [Help 1]
[2019-03-01T02:26:46.810Z] org.apache.maven.lifecycle.LifecycleExecutionException: Failed
to execute goal org.apache.maven.plugins:maven-failsafe-plugin:3.0.0-M3:verify (default) on
project surefire-its: There are test failures.
[2019-03-01T02:26:46.810Z] 
[2019-03-01T02:26:46.810Z] Please refer to /home/jenkins/jenkins-slave/workspace/box_maven-surefire_SUREFIRE-1004@2/surefire-its/target/failsafe-reports
for the individual test results.
[2019-03-01T02:26:46.810Z] Please refer to dump files (if any exist) [date].dump, [date]-jvmRun[N].dump
and [date].dumpstream.
[2019-03-01T02:26:46.810Z]     at org.apache.maven.lifecycle.internal.MojoExecutor.execute
(MojoExecutor.java:215)
[2019-03-01T02:26:46.810Z]     at org.apache.maven.lifecycle.internal.MojoExecutor.execute
(MojoExecutor.java:156)
[2019-03-01T02:26:46.810Z]     at org.apache.maven.lifecycle.internal.MojoExecutor.execute
(MojoExecutor.java:148)
[2019-03-01T02:26:46.810Z]     at org.apache.maven.lifecycle.internal.LifecycleModuleBuilder.buildProject
(LifecycleModuleBuilder.java:117)
[2019-03-01T02:26:46.810Z]     at org.apache.maven.lifecycle.internal.LifecycleModuleBuilder.buildProject
(LifecycleModuleBuilder.java:81)
[2019-03-01T02:26:46.810Z]     at org.apache.maven.lifecycle.internal.builder.singlethreaded.SingleThreadedBuilder.build
(SingleThreadedBuilder.java:56)
[2019-03-01T02:26:46.810Z]     at org.apache.maven.lifecycle.internal.LifecycleStarter.execute
(LifecycleStarter.java:128)
[2019-03-01T02:26:46.810Z]     at org.apache.maven.DefaultMaven.doExecute (DefaultMaven.java:305)
[2019-03-01T02:26:46.810Z]     at org.apache.maven.DefaultMaven.doExecute (DefaultMaven.java:192)
[2019-03-01T02:26:46.810Z]     at org.apache.maven.DefaultMaven.execute (DefaultMaven.java:105)
[2019-03-01T02:26:46.810Z]     at org.apache.maven.cli.MavenCli.execute (MavenCli.java:956)
[2019-03-01T02:26:46.810Z]     at org.apache.maven.cli.MavenCli.doMain (MavenCli.java:288)
[2019-03-01T02:26:46.810Z]     at org.apache.maven.cli.MavenCli.main (MavenCli.java:192)
[2019-03-01T02:26:46.810Z]     at sun.reflect.NativeMethodAccessorImpl.invoke0 (Native Method)
[2019-03-01T02:26:46.810Z]     at sun.reflect.NativeMethodAccessorImpl.invoke (NativeMethodAccessorImpl.java:62)
[2019-03-01T02:26:46.810Z]     at sun.reflect.DelegatingMethodAccessorImpl.invoke (DelegatingMethodAccessorImpl.java:43)
[2019-03-01T02:26:46.810Z]     at java.lang.reflect.Method.invoke (Method.java:498)
[2019-03-01T02:26:46.810Z]     at org.codehaus.plexus.classworlds.launcher.Launcher.launchEnhanced
(Launcher.java:289)
[2019-03-01T02:26:46.810Z]     at org.codehaus.plexus.classworlds.launcher.Launcher.launch
(Launcher.java:229)
[2019-03-01T02:26:46.810Z]     at org.codehaus.plexus.classworlds.launcher.Launcher.mainWithExitCode
(Launcher.java:415)
[2019-03-01T02:26:46.810Z]     at org.codehaus.plexus.classworlds.launcher.Launcher.main (Launcher.java:356)
[2019-03-01T02:26:46.810Z] Caused by: org.apache.maven.plugin.MojoFailureException: There
are test failures.
[2019-03-01T02:26:46.810Z] 
[2019-03-01T02:26:46.810Z] Please refer to /home/jenkins/jenkins-slave/workspace/box_maven-surefire_SUREFIRE-1004@2/surefire-its/target/failsafe-reports
for the individual test results.
[2019-03-01T02:26:46.810Z] Please refer to dump files (if any exist) [date].dump, [date]-jvmRun[N].dump
and [date].dumpstream.
[2019-03-01T02:26:46.810Z]     at org.apache.maven.plugin.surefire.SurefireHelper.throwException
(SurefireHelper.java:271)
[2019-03-01T02:26:46.810Z]     at org.apache.maven.plugin.surefire.SurefireHelper.reportExecution
(SurefireHelper.java:159)
[2019-03-01T02:26:46.810Z]     at org.apache.maven.plugin.failsafe.VerifyMojo.execute (VerifyMojo.java:192)
[2019-03-01T02:26:46.810Z]     at org.apache.maven.plugin.DefaultBuildPluginManager.executeMojo
(DefaultBuildPluginManager.java:137)
[2019-03-01T02:26:46.810Z]     at org.apache.maven.lifecycle.internal.MojoExecutor.execute
(MojoExecutor.java:210)
[2019-03-01T02:26:46.810Z]     at org.apache.maven.lifecycle.internal.MojoExecutor.execute
(MojoExecutor.java:156)
[2019-03-01T02:26:46.810Z]     at org.apache.maven.lifecycle.internal.MojoExecutor.execute
(MojoExecutor.java:148)
[2019-03-01T02:26:46.810Z]     at org.apache.maven.lifecycle.internal.LifecycleModuleBuilder.buildProject
(LifecycleModuleBuilder.java:117)
[2019-03-01T02:26:46.810Z]     at org.apache.maven.lifecycle.internal.LifecycleModuleBuilder.buildProject
(LifecycleModuleBuilder.java:81)
[2019-03-01T02:26:46.810Z]     at org.apache.maven.lifecycle.internal.builder.singlethreaded.SingleThreadedBuilder.build
(SingleThreadedBuilder.java:56)
[2019-03-01T02:26:46.810Z]     at org.apache.maven.lifecycle.internal.LifecycleStarter.execute
(LifecycleStarter.java:128)
[2019-03-01T02:26:46.810Z]     at org.apache.maven.DefaultMaven.doExecute (DefaultMaven.java:305)
[2019-03-01T02:26:46.810Z]     at org.apache.maven.DefaultMaven.doExecute (DefaultMaven.java:192)
[2019-03-01T02:26:46.810Z]     at org.apache.maven.DefaultMaven.execute (DefaultMaven.java:105)
[2019-03-01T02:26:46.810Z]     at org.apache.maven.cli.MavenCli.execute (MavenCli.java:956)
[2019-03-01T02:26:46.810Z]     at org.apache.maven.cli.MavenCli.doMain (MavenCli.java:288)
[2019-03-01T02:26:46.810Z]     at org.apache.maven.cli.MavenCli.main (MavenCli.java:192)
[2019-03-01T02:26:46.811Z]     at sun.reflect.NativeMethodAccessorImpl.invoke0 (Native Method)
[2019-03-01T02:26:46.946Z]     at sun.reflect.NativeMethodAccessorImpl.invoke (NativeMethodAccessorImpl.java:62)
[2019-03-01T02:26:46.946Z]     at sun.reflect.DelegatingMethodAccessorImpl.invoke (DelegatingMethodAccessorImpl.java:43)
[2019-03-01T02:26:46.946Z]     at java.lang.reflect.Method.invoke (Method.java:498)
[2019-03-01T02:26:46.946Z]     at org.codehaus.plexus.classworlds.launcher.Launcher.launchEnhanced
(Launcher.java:289)
[2019-03-01T02:26:46.946Z]     at org.codehaus.plexus.classworlds.launcher.Launcher.launch
(Launcher.java:229)
[2019-03-01T02:26:46.946Z]     at org.codehaus.plexus.classworlds.launcher.Launcher.mainWithExitCode
(Launcher.java:415)
[2019-03-01T02:26:46.946Z]     at org.codehaus.plexus.classworlds.launcher.Launcher.main (Launcher.java:356)
[2019-03-01T02:26:46.946Z] [ERROR] 
[2019-03-01T02:26:46.946Z] [ERROR] Re-run Maven using the -X switch to enable full debug logging.
[2019-03-01T02:26:46.946Z] [ERROR] 
[2019-03-01T02:26:46.946Z] [ERROR] For more information about the errors and possible solutions,
please read the following articles:
[2019-03-01T02:26:46.946Z] [ERROR] [Help 1] http://cwiki.apache.org/confluence/display/MAVEN/MojoFailureException
[2019-03-01T02:26:46.946Z] [ERROR] 
[2019-03-01T02:26:46.946Z] [ERROR] After correcting the problems, you can resume the build
with the command
[2019-03-01T02:26:46.946Z] [ERROR]   mvn <goals> -rf :surefire-its
[Pipeline] }
[Pipeline] // withEnv
[Pipeline] }
[Pipeline] // stage
[Pipeline] openTasks
[2019-03-01T02:26:47.536Z] [TASKS] Skipping publisher since build result is FAILURE
[Pipeline] jacoco
[Pipeline] junit
[2019-03-01T02:26:47.892Z] Recording test results
[Pipeline] fileExists
[Pipeline] zip
[2019-03-01T02:26:50.245Z] Writing zip file of /home/jenkins/jenkins-slave/workspace/box_maven-surefire_SUREFIRE-1004@2/maven-failsafe-plugin/target/it
to /home/jenkins/jenkins-slave/workspace/box_maven-surefire_SUREFIRE-1004@2/maven-failsafe-plugin--linux-jdk12-maven3.6.x.zip
[2019-03-01T02:26:50.496Z] Zipped 78 entries.
[2019-03-01T02:26:50.497Z] Archiving /home/jenkins/jenkins-slave/workspace/box_maven-surefire_SUREFIRE-1004@2/maven-failsafe-plugin--linux-jdk12-maven3.6.x.zip
[2019-03-01T02:26:50.497Z] [Fast Archiver] No prior successful build to compare, so performing
full copy of artifacts
[Pipeline] fileExists
[Pipeline] zip
[2019-03-01T02:26:51.347Z] Writing zip file of /home/jenkins/jenkins-slave/workspace/box_maven-surefire_SUREFIRE-1004@2/surefire-its/target
to /home/jenkins/jenkins-slave/workspace/box_maven-surefire_SUREFIRE-1004@2/surefire-its--linux-jdk12-maven3.6.x.zip
[2019-03-01T02:26:58.661Z] Zipped 16531 entries.
[2019-03-01T02:26:58.661Z] Archiving /home/jenkins/jenkins-slave/workspace/box_maven-surefire_SUREFIRE-1004@2/surefire-its--linux-jdk12-maven3.6.x.zip
[2019-03-01T02:26:58.661Z] [Fast Archiver] No prior successful build to compare, so performing
full copy of artifacts
[Pipeline] archiveArtifacts
[2019-03-01T02:27:01.674Z] Archiving artifacts
[2019-03-01T02:27:01.833Z] [Fast Archiver] No prior successful build to compare, so performing
full copy of artifacts
[Pipeline] cleanWs
[2019-03-01T02:27:04.245Z] [WS-CLEANUP] Deleting project workspace...
[2019-03-01T02:27:04.245Z] [WS-CLEANUP] Deferred wipeout is used...
[2019-03-01T02:27:04.555Z] [WS-CLEANUP] done
[Pipeline] }
[Pipeline] // ws
[Pipeline] }
[Pipeline] // timestamps
[Pipeline] }
[Pipeline] // node
[Pipeline] }
Aborted by tibordigana
[Pipeline] // node
[Pipeline] // node
[Pipeline] // node
[Pipeline] // node
[Pipeline] }
Failed in branch windows-jdk12-maven3.6.x
[Pipeline] }
Failed in branch windows-jdk11-maven3.6.x
[Pipeline] }
Failed in branch windows-jdk8-maven3.6.x
[Pipeline] }
Failed in branch windows-jdk7-maven3.6.x
[Pipeline] // parallel
[Pipeline] echo
org.jenkinsci.plugins.workflow.steps.FlowInterruptedException: org.jenkinsci.plugins.workflow.steps.FlowInterruptedException
[Pipeline] echo
Build result: FAILURE
[Pipeline] jiraIssueSelector
[Pipeline] emailext
Mime
  • Unnamed multipart/mixed (inline, None, 0 bytes)
View raw message