maven-notifications mailing list archives

Site index · List index
Message view « Date » · « Thread »
Top « Date » · « Thread »
From Apache Jenkins Server <jenk...@builds.apache.org>
Subject Build failed in Jenkins: Maven TLP » maven-help-plugin » MPH-160 #3
Date Mon, 11 Mar 2019 17:02:03 GMT
See https://builds.apache.org/job/maven-box/job/maven-help-plugin/job/MPH-160/3/

No changes.

All tests passed

Build log:
[...truncated 5237 lines...]
    at org.apache.maven.DefaultMaven.execute (DefaultMaven.java:107)
    at org.apache.maven.cli.MavenCli.execute (MavenCli.java:955)
    at org.apache.maven.cli.MavenCli.doMain (MavenCli.java:290)
    at org.apache.maven.cli.MavenCli.main (MavenCli.java:194)
    at sun.reflect.NativeMethodAccessorImpl.invoke0 (Native Method)
    at sun.reflect.NativeMethodAccessorImpl.invoke (NativeMethodAccessorImpl.java:62)
    at sun.reflect.DelegatingMethodAccessorImpl.invoke (DelegatingMethodAccessorImpl.java:43)
    at java.lang.reflect.Method.invoke (Method.java:498)
    at org.codehaus.plexus.classworlds.launcher.Launcher.launchEnhanced (Launcher.java:289)
    at org.codehaus.plexus.classworlds.launcher.Launcher.launch (Launcher.java:229)
    at org.codehaus.plexus.classworlds.launcher.Launcher.mainWithExitCode (Launcher.java:415)
    at org.codehaus.plexus.classworlds.launcher.Launcher.main (Launcher.java:356)
Caused by: org.apache.maven.plugin.MojoFailureException: 1 build failed. See console output
above for details.
    at org.apache.maven.plugins.invoker.InvokerSession.handleFailures (InvokerSession.java:260)
    at org.apache.maven.plugins.invoker.VerifyMojo.execute (VerifyMojo.java:137)
    at org.apache.maven.plugin.DefaultBuildPluginManager.executeMojo (DefaultBuildPluginManager.java:134)
    at org.apache.maven.lifecycle.internal.MojoExecutor.execute (MojoExecutor.java:208)
    at org.apache.maven.lifecycle.internal.MojoExecutor.execute (MojoExecutor.java:154)
    at org.apache.maven.lifecycle.internal.MojoExecutor.execute (MojoExecutor.java:146)
    at org.apache.maven.lifecycle.internal.LifecycleModuleBuilder.buildProject (LifecycleModuleBuilder.java:117)
    at org.apache.maven.lifecycle.internal.LifecycleModuleBuilder.buildProject (LifecycleModuleBuilder.java:81)
    at org.apache.maven.lifecycle.internal.builder.singlethreaded.SingleThreadedBuilder.build
(SingleThreadedBuilder.java:51)
    at org.apache.maven.lifecycle.internal.LifecycleStarter.execute (LifecycleStarter.java:128)
    at org.apache.maven.DefaultMaven.doExecute (DefaultMaven.java:309)
    at org.apache.maven.DefaultMaven.doExecute (DefaultMaven.java:194)
    at org.apache.maven.DefaultMaven.execute (DefaultMaven.java:107)
    at org.apache.maven.cli.MavenCli.execute (MavenCli.java:955)
    at org.apache.maven.cli.MavenCli.doMain (MavenCli.java:290)
    at org.apache.maven.cli.MavenCli.main (MavenCli.java:194)
    at sun.reflect.NativeMethodAccessorImpl.invoke0 (Native Method)
    at sun.reflect.NativeMethodAccessorImpl.invoke (NativeMethodAccessorImpl.java:62)
    at sun.reflect.DelegatingMethodAccessorImpl.invoke (DelegatingMethodAccessorImpl.java:43)
    at java.lang.reflect.Method.invoke (Method.java:498)
    at org.codehaus.plexus.classworlds.launcher.Launcher.launchEnhanced (Launcher.java:289)
    at org.codehaus.plexus.classworlds.launcher.Launcher.launch (Launcher.java:229)
    at org.codehaus.plexus.classworlds.launcher.Launcher.mainWithExitCode (Launcher.java:415)
    at org.codehaus.plexus.classworlds.launcher.Launcher.main (Launcher.java:356)
[ERROR] 
[ERROR] Re-run Maven using the -X switch to enable full debug logging.
[ERROR] 
[ERROR] For more information about the errors and possible solutions, please read the following
articles:
[ERROR] [Help 1] http://cwiki.apache.org/confluence/display/MAVEN/MojoFailureException
Picked up JAVA_TOOL_OPTIONS: -Dmaven.ext.class.path="f:\jenkins\jenkins-slave\workspace\en-box_maven-help-plugin_MPH-160@3@tmp\withMavena5c5a32c\pipeline-maven-spy.jar"
-Dorg.jenkinsci.plugins.pipeline.maven.reportsFolder="f:\jenkins\jenkins-slave\workspace\en-box_maven-help-plugin_MPH-160@3@tmp\withMavena5c5a32c"

[Pipeline] }
[Pipeline] // dir
[Pipeline] }
[Fast Archiver] No prior successful build to compare, so performing full copy of artifacts
[withMaven] junitPublisher - Archive test results for Maven artifact org.apache.maven.plugins:maven-help-plugin:maven-plugin:3.2.0-SNAPSHOT
generated by maven-surefire-plugin:test (default-test): windows-jdk8-m3.5.x_build\target\surefire-reports\*.xml
Recording test results
[withMaven] openTasksPublisher - Scan Tasks for Maven artifact org.apache.maven.plugins:maven-help-plugin:maven-plugin:3.2.0-SNAPSHOT
in source directory windows-jdk8-m3.5.x_build\src\main\java
[TASKS] Scanning folder 'f:\jenkins\jenkins-slave\workspace\en-box_maven-help-plugin_MPH-160@3'
for files matching the pattern 'windows-jdk8-m3.5.x_build\src\main\java\**\*' - excludes:
null
[TASKS] Found 9 files to scan for tasks
[TASKS] Found 1 open tasks.
Skipping warnings blame since pipelines do not have an SCM link.%n
[withMaven] invokerPublisher - Archive invoker results for Maven artifact MavenArtifact{org.apache.maven.plugins:maven-help-plugin:maven-plugin:3.2.0-SNAPSHOT(version:
3.2.0-SNAPSHOT, snapshot:false) } generated by PluginInvocation{org.apache.maven.plugins:maven-invoker-plugin:3.1.0@integration-test
 integration-test}: windows-jdk8-m3.5.x_build\target\invoker-reports\*.xml
[withMaven] Publishers: Generated Artifacts Publisher: 19 ms, Junit Publisher: 239 ms, Open
Task Scanner Publisher: 92 ms, Dependencies Fingerprint Publisher: 32 ms, Invoker Publisher:
8844 ms, Pipeline Graph Publisher: 2 ms
[Pipeline] // withMaven
[Pipeline] cleanWs
[WS-CLEANUP] Deleting project workspace...
[WS-CLEANUP] Deferred wipeout is used...
[WS-CLEANUP] done
[Pipeline] cleanWs
[WS-CLEANUP] Deleting project workspace...
[WS-CLEANUP] Deferred wipeout is used...
[WS-CLEANUP] done
[Pipeline] }
[Pipeline] // stage
[Pipeline] }
[Pipeline] // ws
[Pipeline] }
[Pipeline] // node
[Pipeline] }
Failed in branch windows-jdk8-m3.5.x_build
[INFO] run post-build script verify.groovy
[INFO]           describe-cmd-with-goal\pom.xml ................... SUCCESS (74.7 s)
[INFO] Building: describe-cmd-with-goal-invalid\pom.xml
Cannot contact windows-2016-1: java.lang.InterruptedException
[INFO]           describe-cmd-with-goal-invalid\pom.xml ........... SUCCESS (49.7 s)
[INFO] Building: describe-cmd-with-goal-report\pom.xml
[INFO] run post-build script verify.groovy
[INFO]           describe-cmd-with-goal-report\pom.xml ............ SUCCESS (479.1 s)
[INFO] Building: describe-ga\pom.xml
[INFO]           describe-ga\pom.xml .............................. SUCCESS (46.0 s)
[INFO] Building: describe-gav\pom.xml
[INFO]           describe-gav\pom.xml ............................. SUCCESS (79.9 s)
[INFO] Building: describe-plugin-in-plugin-management\pom.xml
[INFO] run post-build script verify.groovy
[INFO]           describe-plugin-in-plugin-management\pom.xml ..... SUCCESS (87.0 s)
[INFO] Building: describe-plugin-without-name\pom.xml
[INFO] run post-build script verify.groovy
[INFO]           describe-plugin-without-name\pom.xml ............. SUCCESS (59.5 s)
[INFO] Building: describe-prefix\pom.xml
[INFO]           describe-prefix\pom.xml .......................... SUCCESS (9.7 s)
[INFO] Building: describe-prefix-and-invalid-mojo\pom.xml
[INFO] run post-build script verify.groovy
[INFO]           describe-prefix-and-invalid-mojo\pom.xml ......... SUCCESS (8.0 s)
[INFO] Building: describe-prefix-and-mojo\pom.xml
[INFO]           describe-prefix-and-mojo\pom.xml ................. SUCCESS (8.6 s)
[INFO] Building: effective-pom\pom.xml
[INFO]           effective-pom\pom.xml ............................ SUCCESS (6.9 s)
[INFO] Building: effective-pom-artifact\pom.xml
[INFO] run post-build script verify.groovy
[INFO]           effective-pom-artifact\pom.xml ................... SUCCESS (33.4 s)
[INFO] Building: effective-pom-from-lifecycle\pom.xml
[INFO] run post-build script verify.groovy
[INFO]           effective-pom-from-lifecycle\pom.xml ............. SUCCESS (46.9 s)
[INFO] Building: effective-pom-multimodule\pom.xml
[INFO] run post-build script verify.groovy
[INFO]           effective-pom-multimodule\pom.xml ................ SUCCESS (40.6 s)
[INFO] Building: effective-pom-multimodule-unlink-parent\pom.xml
[INFO] run post-build script verify.groovy
[INFO]           effective-pom-multimodule-unlink-parent\pom.xml .. SUCCESS (51.5 s)
[INFO] Building: effective-pom-verbose\pom.xml
[INFO]           effective-pom-verbose\pom.xml .................... SUCCESS (46.9 s)
[INFO] Building: effective-pom_properties\pom.xml
[INFO] run post-build script verify.groovy
[INFO]           effective-pom_properties\pom.xml ................. SUCCESS (36.0 s)
[INFO] Building: effective-settings\pom.xml
[INFO]           effective-settings\pom.xml ....................... SUCCESS (9.9 s)
[INFO] Building: effective-settings_deep-clone\pom.xml
[INFO] run post-build script verify.groovy
[INFO]           effective-settings_deep-clone\pom.xml ............ SUCCESS (6.5 s)
[INFO] Building: evaluate\pom.xml
[INFO] run post-build script verify.groovy
[INFO]           evaluate\pom.xml ................................. SUCCESS (7.6 s)
[INFO] Building: evaluate-artifact-with-expression-with-output\pom.xml
[INFO] run post-build script verify.groovy
[INFO]           evaluate-artifact-with-expression-with-output\pom.xml SUCCESS (175.6 s)
[INFO] Building: evaluate-forceStdout\pom.xml
[INFO] run post-build script verify.groovy
[INFO]           evaluate-forceStdout\pom.xml ..................... SUCCESS (55.5 s)
[INFO] Building: evaluate-settings-servers\pom.xml
[INFO] run post-build script verify.groovy
[INFO]           evaluate-settings-servers\pom.xml ................ FAILED (48.3 s)
[INFO]   The post-build script did not succeed. f:\jenkins\jenkins-slave\workspace\en-box_maven-help-plugin_MPH-160@2\windows-jdk12-m3.5.x_build\target\it\evaluate-settings-servers\result.txt
(The system cannot find the file specified)
[INFO] Building: evaluate-with-expression-with-output\pom.xml
[INFO] run post-build script verify.groovy
[INFO]           evaluate-with-expression-with-output\pom.xml ..... SUCCESS (8.9 s)
[INFO] Building: system\pom.xml
[INFO]           system\pom.xml ................................... SUCCESS (7.5 s)
[INFO] 
[INFO] --- maven-checkstyle-plugin:3.0.0:check (checkstyle-check) @ maven-help-plugin ---
[INFO] 
[INFO] --- maven-invoker-plugin:3.1.0:verify (integration-test) @ maven-help-plugin ---
[INFO] -------------------------------------------------
[INFO] Build Summary:
[INFO]   Passed: 30, Failed: 1, Errors: 0, Skipped: 0
[INFO] -------------------------------------------------
[ERROR] The following builds failed:
[ERROR] *  evaluate-settings-servers\pom.xml
[INFO] -------------------------------------------------
[INFO] ------------------------------------------------------------------------
[INFO] BUILD FAILURE
[INFO] ------------------------------------------------------------------------
[INFO] Total time: 40:50 min
[INFO] Finished at: 2019-03-11T17:00:37Z
[INFO] Final Memory: 51M/153M
[INFO] ------------------------------------------------------------------------
[INFO] [jenkins-event-spy] Generated F:\jenkins\jenkins-slave\workspace\en-box_maven-help-plugin_MPH-160@2@tmp\withMaven8a0f1a78\maven-spy-20190311-161942-86317354373731495201042.log
[ERROR] Failed to execute goal org.apache.maven.plugins:maven-invoker-plugin:3.1.0:verify
(integration-test) on project maven-help-plugin: 1 build failed. See console output above
for details. -> [Help 1]
org.apache.maven.lifecycle.LifecycleExecutionException: Failed to execute goal org.apache.maven.plugins:maven-invoker-plugin:3.1.0:verify
(integration-test) on project maven-help-plugin: 1 build failed. See console output above
for details.
    at org.apache.maven.lifecycle.internal.MojoExecutor.execute (MojoExecutor.java:213)
    at org.apache.maven.lifecycle.internal.MojoExecutor.execute (MojoExecutor.java:154)
    at org.apache.maven.lifecycle.internal.MojoExecutor.execute (MojoExecutor.java:146)
    at org.apache.maven.lifecycle.internal.LifecycleModuleBuilder.buildProject (LifecycleModuleBuilder.java:117)
    at org.apache.maven.lifecycle.internal.LifecycleModuleBuilder.buildProject (LifecycleModuleBuilder.java:81)
    at org.apache.maven.lifecycle.internal.builder.singlethreaded.SingleThreadedBuilder.build
(SingleThreadedBuilder.java:51)
    at org.apache.maven.lifecycle.internal.LifecycleStarter.execute (LifecycleStarter.java:128)
    at org.apache.maven.DefaultMaven.doExecute (DefaultMaven.java:309)
    at org.apache.maven.DefaultMaven.doExecute (DefaultMaven.java:194)
    at org.apache.maven.DefaultMaven.execute (DefaultMaven.java:107)
    at org.apache.maven.cli.MavenCli.execute (MavenCli.java:955)
    at org.apache.maven.cli.MavenCli.doMain (MavenCli.java:290)
    at org.apache.maven.cli.MavenCli.main (MavenCli.java:194)
    at jdk.internal.reflect.NativeMethodAccessorImpl.invoke0 (Native Method)
    at jdk.internal.reflect.NativeMethodAccessorImpl.invoke (NativeMethodAccessorImpl.java:62)
    at jdk.internal.reflect.DelegatingMethodAccessorImpl.invoke (DelegatingMethodAccessorImpl.java:43)
    at java.lang.reflect.Method.invoke (Method.java:567)
    at org.codehaus.plexus.classworlds.launcher.Launcher.launchEnhanced (Launcher.java:289)
    at org.codehaus.plexus.classworlds.launcher.Launcher.launch (Launcher.java:229)
    at org.codehaus.plexus.classworlds.launcher.Launcher.mainWithExitCode (Launcher.java:415)
    at org.codehaus.plexus.classworlds.launcher.Launcher.main (Launcher.java:356)
Caused by: org.apache.maven.plugin.MojoFailureException: 1 build failed. See console output
above for details.
    at org.apache.maven.plugins.invoker.InvokerSession.handleFailures (InvokerSession.java:260)
    at org.apache.maven.plugins.invoker.VerifyMojo.execute (VerifyMojo.java:137)
    at org.apache.maven.plugin.DefaultBuildPluginManager.executeMojo (DefaultBuildPluginManager.java:134)
    at org.apache.maven.lifecycle.internal.MojoExecutor.execute (MojoExecutor.java:208)
    at org.apache.maven.lifecycle.internal.MojoExecutor.execute (MojoExecutor.java:154)
    at org.apache.maven.lifecycle.internal.MojoExecutor.execute (MojoExecutor.java:146)
    at org.apache.maven.lifecycle.internal.LifecycleModuleBuilder.buildProject (LifecycleModuleBuilder.java:117)
    at org.apache.maven.lifecycle.internal.LifecycleModuleBuilder.buildProject (LifecycleModuleBuilder.java:81)
    at org.apache.maven.lifecycle.internal.builder.singlethreaded.SingleThreadedBuilder.build
(SingleThreadedBuilder.java:51)
    at org.apache.maven.lifecycle.internal.LifecycleStarter.execute (LifecycleStarter.java:128)
    at org.apache.maven.DefaultMaven.doExecute (DefaultMaven.java:309)
    at org.apache.maven.DefaultMaven.doExecute (DefaultMaven.java:194)
    at org.apache.maven.DefaultMaven.execute (DefaultMaven.java:107)
    at org.apache.maven.cli.MavenCli.execute (MavenCli.java:955)
    at org.apache.maven.cli.MavenCli.doMain (MavenCli.java:290)
    at org.apache.maven.cli.MavenCli.main (MavenCli.java:194)
    at jdk.internal.reflect.NativeMethodAccessorImpl.invoke0 (Native Method)
    at jdk.internal.reflect.NativeMethodAccessorImpl.invoke (NativeMethodAccessorImpl.java:62)
    at jdk.internal.reflect.DelegatingMethodAccessorImpl.invoke (DelegatingMethodAccessorImpl.java:43)
    at java.lang.reflect.Method.invoke (Method.java:567)
    at org.codehaus.plexus.classworlds.launcher.Launcher.launchEnhanced (Launcher.java:289)
    at org.codehaus.plexus.classworlds.launcher.Launcher.launch (Launcher.java:229)
    at org.codehaus.plexus.classworlds.launcher.Launcher.mainWithExitCode (Launcher.java:415)
    at org.codehaus.plexus.classworlds.launcher.Launcher.main (Launcher.java:356)
[ERROR] 
[ERROR] Re-run Maven using the -X switch to enable full debug logging.
[ERROR] 
[ERROR] For more information about the errors and possible solutions, please read the following
articles:
[ERROR] [Help 1] http://cwiki.apache.org/confluence/display/MAVEN/MojoFailureException
[Pipeline] }
[Pipeline] // dir
[Pipeline] }
[Fast Archiver] No prior successful build to compare, so performing full copy of artifacts
[withMaven] junitPublisher - Archive test results for Maven artifact org.apache.maven.plugins:maven-help-plugin:maven-plugin:3.2.0-SNAPSHOT
generated by maven-surefire-plugin:test (default-test): windows-jdk12-m3.5.x_build\target\surefire-reports\*.xml
Recording test results
[withMaven] openTasksPublisher - Scan Tasks for Maven artifact org.apache.maven.plugins:maven-help-plugin:maven-plugin:3.2.0-SNAPSHOT
in source directory windows-jdk12-m3.5.x_build\src\main\java
[TASKS] Scanning folder 'f:\jenkins\jenkins-slave\workspace\en-box_maven-help-plugin_MPH-160@2'
for files matching the pattern 'windows-jdk12-m3.5.x_build\src\main\java\**\*' - excludes:
null
[TASKS] Found 9 files to scan for tasks
[TASKS] Found 1 open tasks.
Skipping warnings blame since pipelines do not have an SCM link.%n
[withMaven] invokerPublisher - Archive invoker results for Maven artifact MavenArtifact{org.apache.maven.plugins:maven-help-plugin:maven-plugin:3.2.0-SNAPSHOT(version:
3.2.0-SNAPSHOT, snapshot:false) } generated by PluginInvocation{org.apache.maven.plugins:maven-invoker-plugin:3.1.0@integration-test
 integration-test}: windows-jdk12-m3.5.x_build\target\invoker-reports\*.xml
[withMaven] Publishers: Generated Artifacts Publisher: 144 ms, Junit Publisher: 1793 ms, Open
Task Scanner Publisher: 440 ms, Dependencies Fingerprint Publisher: 278 ms, Invoker Publisher:
77103 ms, Pipeline Graph Publisher: 20 ms
[Pipeline] // withMaven
[Pipeline] cleanWs
[WS-CLEANUP] Deleting project workspace...
[WS-CLEANUP] Deferred wipeout is used...
[WS-CLEANUP] done
[Pipeline] cleanWs
[WS-CLEANUP] Deleting project workspace...
[WS-CLEANUP] Deferred wipeout is used...
[WS-CLEANUP] done
[Pipeline] }
[Pipeline] // stage
[Pipeline] }
[Pipeline] // ws
[Pipeline] }
[Pipeline] // node
[Pipeline] }
Failed in branch windows-jdk12-m3.5.x_build
[Pipeline] // parallel
[Pipeline] stage
[Pipeline] { (Notifications)
[Pipeline] echo
Build result: FAILURE
[Pipeline] jiraIssueSelector
[Pipeline] emailext
Mime
  • Unnamed multipart/mixed (inline, None, 0 bytes)
View raw message