maven-notifications mailing list archives

Site index · List index
Message view « Date » · « Thread »
Top « Date » · « Thread »
From Apache Jenkins Server <jenk...@builds.apache.org>
Subject Build failed in Jenkins: Maven TLP » maven-site » MNG-5940 #2
Date Fri, 01 Mar 2019 00:27:26 GMT
See https://builds.apache.org/job/maven-box/job/maven-site/job/MNG-5940/2/

No changes.

No tests ran.

Build log:
Branch indexing
Obtained Jenkinsfile from dc40536effb28dea0bb481850f29dc22a8e49549
Running in Durability level: MAX_SURVIVABILITY
Loading library jenkins-env@master
Attempting to resolve master from remote references...
 > git --version # timeout=10
 > git ls-remote -h https://gitbox.apache.org/repos/asf/maven-jenkins-env.git # timeout=10
Found match: refs/heads/master revision 301add823574336a6bc9f551351ac881b87e0d79
No credentials specified
 > git rev-parse --is-inside-work-tree # timeout=10
Fetching changes from the remote Git repository
 > git config remote.origin.url https://gitbox.apache.org/repos/asf/maven-jenkins-env.git
# timeout=10
Fetching without tags
Fetching upstream changes from https://gitbox.apache.org/repos/asf/maven-jenkins-env.git
 > git --version # timeout=10
 > git fetch --no-tags --progress https://gitbox.apache.org/repos/asf/maven-jenkins-env.git
+refs/heads/*:refs/remotes/origin/*
Checking out Revision 301add823574336a6bc9f551351ac881b87e0d79 (master)
 > git config core.sparsecheckout # timeout=10
 > git checkout -f 301add823574336a6bc9f551351ac881b87e0d79
Commit message: "Add support for Maven 3.6.x/3.6.0"
 > git rev-list --no-walk 301add823574336a6bc9f551351ac881b87e0d79 # timeout=10
Loading library jenkins-lib@master
Attempting to resolve master from remote references...
 > git --version # timeout=10
 > git ls-remote -h https://gitbox.apache.org/repos/asf/maven-jenkins-lib.git # timeout=10
Found match: refs/heads/master revision d44ea6697c8090e41a63584e6e15cd8e9d903a1f
No credentials specified
 > git rev-parse --is-inside-work-tree # timeout=10
Fetching changes from the remote Git repository
 > git config remote.origin.url https://gitbox.apache.org/repos/asf/maven-jenkins-lib.git
# timeout=10
Fetching without tags
Fetching upstream changes from https://gitbox.apache.org/repos/asf/maven-jenkins-lib.git
 > git --version # timeout=10
 > git fetch --no-tags --progress https://gitbox.apache.org/repos/asf/maven-jenkins-lib.git
+refs/heads/*:refs/remotes/origin/*
Checking out Revision d44ea6697c8090e41a63584e6e15cd8e9d903a1f (master)
 > git config core.sparsecheckout # timeout=10
 > git checkout -f d44ea6697c8090e41a63584e6e15cd8e9d903a1f
Commit message: "[INFRA-17514] Jenkins invoker-plugin updated by INFRA"
 > git rev-list --no-walk d44ea6697c8090e41a63584e6e15cd8e9d903a1f # timeout=10
[Pipeline] Start of Pipeline
[Pipeline] node
Still waiting to schedule task
Waiting for next available executor on ‘websites1’
Running on websites1 in /home/jenkins/jenkins-slave/workspace/maven-box_maven-site_MNG-5940
[Pipeline] {
[Pipeline] stage
[Pipeline] { (Declarative: Checkout SCM)
[Pipeline] checkout
No credentials specified
Fetching changes from the remote Git repository
Fetching without tags
 > git rev-parse --is-inside-work-tree # timeout=10
 > git config remote.origin.url https://gitbox.apache.org/repos/asf/maven-site.git # timeout=10
Fetching upstream changes from https://gitbox.apache.org/repos/asf/maven-site.git
 > git --version # timeout=10
 > git fetch --no-tags --progress https://gitbox.apache.org/repos/asf/maven-site.git +refs/heads/*:refs/remotes/origin/*
Checking out Revision dc40536effb28dea0bb481850f29dc22a8e49549 (MNG-5940)
Commit message: "[MNG-5940] Change the maven-source-plugin jar goal into jar-no-fork in Maven
Super POM"
Cleaning workspace
[Pipeline] }
[Pipeline] // stage
[Pipeline] withEnv
[Pipeline] {
[Pipeline] timeout
Timeout set to expire in 10 min
[Pipeline] {
[Pipeline] timestamps
[Pipeline] {
[Pipeline] ansiColor
[Pipeline] {
[Pipeline] stage
[Pipeline] { (Build)
 > git config core.sparsecheckout # timeout=10
 > git checkout -f dc40536effb28dea0bb481850f29dc22a8e49549
 > git rev-list --no-walk dc40536effb28dea0bb481850f29dc22a8e49549 # timeout=10
 > git rev-parse --verify HEAD # timeout=10
Resetting working tree
 > git reset --hard # timeout=10
 > git clean -fdx # timeout=10
[Pipeline] withMaven
[2019-03-01T00:27:20.167Z] [withMaven] Options: [org.jenkinsci.plugins.pipeline.maven.publishers.GeneratedArtifactsPublisher[disabled=true],
JunitTestsPublisher[disabled=true,healthScaleFactor=,keepLongStdio=false,ignoreAttachments=false],
org.jenkinsci.plugins.pipeline.maven.publishers.FindbugsAnalysisPublisher[disabled='true',
healthy='', unHealthy='', thresholdLimit='low'], org.jenkinsci.plugins.pipeline.maven.publishers.TasksScannerPublisher[disabled='true',
healthy='', unHealthy='', thresholdLimit='low']]
[2019-03-01T00:27:20.167Z] [withMaven] Available options: 
[2019-03-01T00:27:20.167Z] [withMaven] using JDK installation JDK 1.8 (latest)
[2019-03-01T00:27:20.222Z] [withMaven] using Maven installation 'Maven 3 (latest)'
[Pipeline] {
[Pipeline] sh
[2019-03-01T00:27:21.759Z] + mvn clean site
[2019-03-01T00:27:21.759Z] ----- withMaven Wrapper script -----
[2019-03-01T00:27:21.759Z] Picked up JAVA_TOOL_OPTIONS: -Dmaven.ext.class.path="/home/jenkins/jenkins-slave/workspace/maven-box_maven-site_MNG-5940@tmp/withMavend4cb8d6e/pipeline-maven-spy.jar"
-Dorg.jenkinsci.plugins.pipeline.maven.reportsFolder="/home/jenkins/jenkins-slave/workspace/maven-box_maven-site_MNG-5940@tmp/withMavend4cb8d6e"

[2019-03-01T00:27:22.055Z] Apache Maven 3.6.0 (97c98ec64a1fdfee7767ce5ffb20918da4f719f3; 2018-10-24T18:41:47Z)
[2019-03-01T00:27:22.055Z] Maven home: /home/jenkins/tools/maven/latest3
[2019-03-01T00:27:22.055Z] Java version: 1.8.0_191, vendor: Oracle Corporation, runtime: /usr/local/asfpackages/java/jdk1.8.0_191/jre
[2019-03-01T00:27:22.055Z] Default locale: en_US, platform encoding: UTF-8
[2019-03-01T00:27:22.055Z] OS name: "linux", version: "4.4.0-116-generic", arch: "amd64",
family: "unix"
[2019-03-01T00:27:24.783Z] [INFO] [jenkins-event-spy] Generate /home/jenkins/jenkins-slave/workspace/maven-box_maven-site_MNG-5940@tmp/withMavend4cb8d6e/maven-spy-20190301-002724-2733518423337731179890.log.tmp
...
[2019-03-01T00:27:24.783Z] [INFO] Scanning for projects...
[2019-03-01T00:27:25.423Z] [INFO] Downloading from Nexus: http://repository.apache.org/snapshots/org/apache/maven/maven-parent/32-SNAPSHOT/maven-metadata.xml
[2019-03-01T00:27:25.718Z] [INFO] Downloading from Nexus: http://repository.apache.org/snapshots/org/apache/maven/maven-parent/32-SNAPSHOT/maven-parent-32-SNAPSHOT.pom
[2019-03-01T00:27:26.010Z] [ERROR] [ERROR] Some problems were encountered while processing
the POMs:
[2019-03-01T00:27:26.011Z] [FATAL] Non-resolvable parent POM for org.apache.maven:maven-site:1.0:
Could not find artifact org.apache.maven:maven-parent:pom:32-SNAPSHOT in Nexus (http://repository.apache.org/snapshots)
and 'parent.relativePath' points at wrong local POM @ line 23, column 11
[2019-03-01T00:27:26.011Z]  @ 
[2019-03-01T00:27:26.011Z] [INFO] [jenkins-event-spy] Generated /home/jenkins/jenkins-slave/workspace/maven-box_maven-site_MNG-5940@tmp/withMavend4cb8d6e/maven-spy-20190301-002724-2733518423337731179890.log
[2019-03-01T00:27:26.011Z] [ERROR] The build could not read 1 project -> [Help 1]
[2019-03-01T00:27:26.011Z] [ERROR]   
[2019-03-01T00:27:26.011Z] [ERROR]   The project org.apache.maven:maven-site:1.0 (/home/jenkins/jenkins-slave/workspace/maven-box_maven-site_MNG-5940/pom.xml)
has 1 error
[2019-03-01T00:27:26.011Z] [ERROR]     Non-resolvable parent POM for org.apache.maven:maven-site:1.0:
Could not find artifact org.apache.maven:maven-parent:pom:32-SNAPSHOT in Nexus (http://repository.apache.org/snapshots)
and 'parent.relativePath' points at wrong local POM @ line 23, column 11 -> [Help 2]
[2019-03-01T00:27:26.011Z] [ERROR] 
[2019-03-01T00:27:26.011Z] [ERROR] To see the full stack trace of the errors, re-run Maven
with the -e switch.
[2019-03-01T00:27:26.011Z] [ERROR] Re-run Maven using the -X switch to enable full debug logging.
[2019-03-01T00:27:26.011Z] [ERROR] 
[2019-03-01T00:27:26.011Z] [ERROR] For more information about the errors and possible solutions,
please read the following articles:
[2019-03-01T00:27:26.011Z] [ERROR] [Help 1] http://cwiki.apache.org/confluence/display/MAVEN/ProjectBuildingException
[2019-03-01T00:27:26.011Z] [ERROR] [Help 2] http://cwiki.apache.org/confluence/display/MAVEN/UnresolvableModelException
[Pipeline] }
[2019-03-01T00:27:26.585Z] [withMaven] Publishers: 
[Pipeline] // withMaven
[Pipeline] }
[Pipeline] // stage
[Pipeline] stage
[Pipeline] { (Deploy)
Stage "Deploy" skipped due to earlier failure(s)
[Pipeline] }
[Pipeline] // stage
[Pipeline] stage
[Pipeline] { (Declarative: Post Actions)
[Pipeline] echo
[2019-03-01T00:27:26.895Z] Build result: FAILURE
[Pipeline] jiraIssueSelector
[Pipeline] emailext
Mime
  • Unnamed multipart/mixed (inline, None, 0 bytes)
View raw message