maven-notifications mailing list archives

Site index · List index
Message view « Date » · « Thread »
Top « Date » · « Thread »
From Apache Jenkins Server <jenk...@builds.apache.org>
Subject Build failed in Jenkins: Maven TLP » maven-jar-plugin » MJAR-262 #1
Date Mon, 11 Mar 2019 18:05:47 GMT
See https://builds.apache.org/job/maven-box/job/maven-jar-plugin/job/MJAR-262/1/

No changes.

All tests passed

Build log:
[...truncated 328384 lines...]
[INFO] urls[9] = file:/F:/jenkins/jenkins-slave/workspace/en-box_maven-jar-plugin_MJAR-262@2/windows-jdk11-m3.5.x_build/target/local-repo/org/apache/maven/shared/maven-shared-utils/3.2.1/maven-shared-utils-3.2.1.jar
[INFO] urls[10] = file:/F:/jenkins/jenkins-slave/workspace/en-box_maven-jar-plugin_MJAR-262@2/windows-jdk11-m3.5.x_build/target/local-repo/commons-io/commons-io/2.5/commons-io-2.5.jar
[INFO] urls[11] = file:/F:/jenkins/jenkins-slave/workspace/en-box_maven-jar-plugin_MJAR-262@2/windows-jdk11-m3.5.x_build/target/local-repo/org/codehaus/plexus/plexus-archiver/3.7.0/plexus-archiver-3.7.0.jar
[INFO] urls[12] = file:/F:/jenkins/jenkins-slave/workspace/en-box_maven-jar-plugin_MJAR-262@2/windows-jdk11-m3.5.x_build/target/local-repo/org/codehaus/plexus/plexus-io/3.1.0/plexus-io-3.1.0.jar
[INFO] urls[13] = file:/F:/jenkins/jenkins-slave/workspace/en-box_maven-jar-plugin_MJAR-262@2/windows-jdk11-m3.5.x_build/target/local-repo/org/apache/commons/commons-compress/1.18/commons-compress-1.18.jar
[INFO] urls[14] = file:/F:/jenkins/jenkins-slave/workspace/en-box_maven-jar-plugin_MJAR-262@2/windows-jdk11-m3.5.x_build/target/local-repo/org/iq80/snappy/snappy/0.4/snappy-0.4.jar
[INFO] urls[15] = file:/F:/jenkins/jenkins-slave/workspace/en-box_maven-jar-plugin_MJAR-262@2/windows-jdk11-m3.5.x_build/target/local-repo/org/tukaani/xz/1.8/xz-1.8.jar
[INFO] urls[16] = file:/F:/jenkins/jenkins-slave/workspace/en-box_maven-jar-plugin_MJAR-262@2/windows-jdk11-m3.5.x_build/target/local-repo/org/codehaus/plexus/plexus-utils/3.1.0/plexus-utils-3.1.0.jar
[INFO] Number of foreign imports: 1
[INFO] import: Entry[import  from realm ClassRealm[maven.api, parent: null]]
[INFO] 
[INFO] -----------------------------------------------------
[INFO] 
[INFO]     at org.apache.maven.plugin.DefaultBuildPluginManager.executeMojo (DefaultBuildPluginManager.java:183)
[INFO]     at org.apache.maven.lifecycle.internal.MojoExecutor.execute (MojoExecutor.java:208)
[INFO]     at org.apache.maven.lifecycle.internal.MojoExecutor.execute (MojoExecutor.java:154)
[INFO]     at org.apache.maven.lifecycle.internal.MojoExecutor.execute (MojoExecutor.java:146)
[INFO]     at org.apache.maven.lifecycle.internal.LifecycleModuleBuilder.buildProject (LifecycleModuleBuilder.java:117)
[INFO]     at org.apache.maven.lifecycle.internal.LifecycleModuleBuilder.buildProject (LifecycleModuleBuilder.java:81)
[INFO]     at org.apache.maven.lifecycle.internal.builder.singlethreaded.SingleThreadedBuilder.build
(SingleThreadedBuilder.java:51)
[INFO]     at org.apache.maven.lifecycle.internal.LifecycleStarter.execute (LifecycleStarter.java:128)
[INFO]     at org.apache.maven.DefaultMaven.doExecute (DefaultMaven.java:309)
[INFO]     at org.apache.maven.DefaultMaven.doExecute (DefaultMaven.java:194)
[INFO]     at org.apache.maven.DefaultMaven.execute (DefaultMaven.java:107)
[INFO]     at org.apache.maven.cli.MavenCli.execute (MavenCli.java:955)
[INFO]     at org.apache.maven.cli.MavenCli.doMain (MavenCli.java:290)
[INFO]     at org.apache.maven.cli.MavenCli.main (MavenCli.java:194)
[INFO]     at jdk.internal.reflect.NativeMethodAccessorImpl.invoke0 (Native Method)
[INFO]     at jdk.internal.reflect.NativeMethodAccessorImpl.invoke (NativeMethodAccessorImpl.java:62)
[INFO]     at jdk.internal.reflect.DelegatingMethodAccessorImpl.invoke (DelegatingMethodAccessorImpl.java:43)
[INFO]     at java.lang.reflect.Method.invoke (Method.java:566)
[INFO]     at org.codehaus.plexus.classworlds.launcher.Launcher.launchEnhanced (Launcher.java:289)
[INFO]     at org.codehaus.plexus.classworlds.launcher.Launcher.launch (Launcher.java:229)
[INFO]     at org.codehaus.plexus.classworlds.launcher.Launcher.mainWithExitCode (Launcher.java:415)
[INFO]     at org.codehaus.plexus.classworlds.launcher.Launcher.main (Launcher.java:356)
[INFO] Caused by: org.apache.maven.plugin.PluginContainerException: An API incompatibility
was encountered while executing org.apache.maven.plugins:maven-jar-plugin:3.1.2-SNAPSHOT:jar:
java.lang.NoSuchMethodError: org.codehaus.plexus.archiver.jar.JarArchiver.setMinimalDefaultManifest(Z)V
[INFO] -----------------------------------------------------
[INFO] realm =    plugin>org.apache.maven.plugins:maven-jar-plugin:3.1.2-SNAPSHOT
[INFO] strategy = org.codehaus.plexus.classworlds.strategy.SelfFirstStrategy
[INFO] urls[0] = file:/F:/jenkins/jenkins-slave/workspace/en-box_maven-jar-plugin_MJAR-262@2/windows-jdk11-m3.5.x_build/target/local-repo/org/apache/maven/plugins/maven-jar-plugin/3.1.2-SNAPSHOT/maven-jar-plugin-3.1.2-SNAPSHOT.jar
[INFO] urls[1] = file:/F:/jenkins/jenkins-slave/workspace/en-box_maven-jar-plugin_MJAR-262@2/windows-jdk11-m3.5.x_build/target/local-repo/org/sonatype/sisu/sisu-inject-bean/1.4.2/sisu-inject-bean-1.4.2.jar
[INFO] urls[2] = file:/F:/jenkins/jenkins-slave/workspace/en-box_maven-jar-plugin_MJAR-262@2/windows-jdk11-m3.5.x_build/target/local-repo/org/sonatype/sisu/sisu-guice/2.1.7/sisu-guice-2.1.7-noaop.jar
[INFO] urls[3] = file:/F:/jenkins/jenkins-slave/workspace/en-box_maven-jar-plugin_MJAR-262@2/windows-jdk11-m3.5.x_build/target/local-repo/org/sonatype/aether/aether-util/1.7/aether-util-1.7.jar
[INFO] urls[4] = file:/F:/jenkins/jenkins-slave/workspace/en-box_maven-jar-plugin_MJAR-262@2/windows-jdk11-m3.5.x_build/target/local-repo/org/codehaus/plexus/plexus-interpolation/1.14/plexus-interpolation-1.14.jar
[INFO] urls[5] = file:/F:/jenkins/jenkins-slave/workspace/en-box_maven-jar-plugin_MJAR-262@2/windows-jdk11-m3.5.x_build/target/local-repo/org/codehaus/plexus/plexus-component-annotations/1.7.1/plexus-component-annotations-1.7.1.jar
[INFO] urls[6] = file:/F:/jenkins/jenkins-slave/workspace/en-box_maven-jar-plugin_MJAR-262@2/windows-jdk11-m3.5.x_build/target/local-repo/org/sonatype/plexus/plexus-sec-dispatcher/1.3/plexus-sec-dispatcher-1.3.jar
[INFO] urls[7] = file:/F:/jenkins/jenkins-slave/workspace/en-box_maven-jar-plugin_MJAR-262@2/windows-jdk11-m3.5.x_build/target/local-repo/org/sonatype/plexus/plexus-cipher/1.4/plexus-cipher-1.4.jar
[INFO] urls[8] = file:/F:/jenkins/jenkins-slave/workspace/en-box_maven-jar-plugin_MJAR-262@2/windows-jdk11-m3.5.x_build/target/local-repo/org/apache/maven/maven-archiver/3.4.0/maven-archiver-3.4.0.jar
[INFO] urls[9] = file:/F:/jenkins/jenkins-slave/workspace/en-box_maven-jar-plugin_MJAR-262@2/windows-jdk11-m3.5.x_build/target/local-repo/org/apache/maven/shared/maven-shared-utils/3.2.1/maven-shared-utils-3.2.1.jar
[INFO] urls[10] = file:/F:/jenkins/jenkins-slave/workspace/en-box_maven-jar-plugin_MJAR-262@2/windows-jdk11-m3.5.x_build/target/local-repo/commons-io/commons-io/2.5/commons-io-2.5.jar
[INFO] urls[11] = file:/F:/jenkins/jenkins-slave/workspace/en-box_maven-jar-plugin_MJAR-262@2/windows-jdk11-m3.5.x_build/target/local-repo/org/codehaus/plexus/plexus-archiver/3.7.0/plexus-archiver-3.7.0.jar
[INFO] urls[12] = file:/F:/jenkins/jenkins-slave/workspace/en-box_maven-jar-plugin_MJAR-262@2/windows-jdk11-m3.5.x_build/target/local-repo/org/codehaus/plexus/plexus-io/3.1.0/plexus-io-3.1.0.jar
[INFO] urls[13] = file:/F:/jenkins/jenkins-slave/workspace/en-box_maven-jar-plugin_MJAR-262@2/windows-jdk11-m3.5.x_build/target/local-repo/org/apache/commons/commons-compress/1.18/commons-compress-1.18.jar
[INFO] urls[14] = file:/F:/jenkins/jenkins-slave/workspace/en-box_maven-jar-plugin_MJAR-262@2/windows-jdk11-m3.5.x_build/target/local-repo/org/iq80/snappy/snappy/0.4/snappy-0.4.jar
[INFO] urls[15] = file:/F:/jenkins/jenkins-slave/workspace/en-box_maven-jar-plugin_MJAR-262@2/windows-jdk11-m3.5.x_build/target/local-repo/org/tukaani/xz/1.8/xz-1.8.jar
[INFO] urls[16] = file:/F:/jenkins/jenkins-slave/workspace/en-box_maven-jar-plugin_MJAR-262@2/windows-jdk11-m3.5.x_build/target/local-repo/org/codehaus/plexus/plexus-utils/3.1.0/plexus-utils-3.1.0.jar
[INFO] Number of foreign imports: 1
[INFO] import: Entry[import  from realm ClassRealm[maven.api, parent: null]]
[INFO] 
[INFO] -----------------------------------------------------
[INFO] 
[INFO]     at org.apache.maven.plugin.DefaultBuildPluginManager.executeMojo (DefaultBuildPluginManager.java:181)
[INFO]     at org.apache.maven.lifecycle.internal.MojoExecutor.execute (MojoExecutor.java:208)
[INFO]     at org.apache.maven.lifecycle.internal.MojoExecutor.execute (MojoExecutor.java:154)
[INFO]     at org.apache.maven.lifecycle.internal.MojoExecutor.execute (MojoExecutor.java:146)
[INFO]     at org.apache.maven.lifecycle.internal.LifecycleModuleBuilder.buildProject (LifecycleModuleBuilder.java:117)
[INFO]     at org.apache.maven.lifecycle.internal.LifecycleModuleBuilder.buildProject (LifecycleModuleBuilder.java:81)
[INFO]     at org.apache.maven.lifecycle.internal.builder.singlethreaded.SingleThreadedBuilder.build
(SingleThreadedBuilder.java:51)
[INFO]     at org.apache.maven.lifecycle.internal.LifecycleStarter.execute (LifecycleStarter.java:128)
[INFO]     at org.apache.maven.DefaultMaven.doExecute (DefaultMaven.java:309)
[INFO]     at org.apache.maven.DefaultMaven.doExecute (DefaultMaven.java:194)
[INFO]     at org.apache.maven.DefaultMaven.execute (DefaultMaven.java:107)
[INFO]     at org.apache.maven.cli.MavenCli.execute (MavenCli.java:955)
[INFO]     at org.apache.maven.cli.MavenCli.doMain (MavenCli.java:290)
[INFO]     at org.apache.maven.cli.MavenCli.main (MavenCli.java:194)
[INFO]     at jdk.internal.reflect.NativeMethodAccessorImpl.invoke0 (Native Method)
[INFO]     at jdk.internal.reflect.NativeMethodAccessorImpl.invoke (NativeMethodAccessorImpl.java:62)
[INFO]     at jdk.internal.reflect.DelegatingMethodAccessorImpl.invoke (DelegatingMethodAccessorImpl.java:43)
[INFO]     at java.lang.reflect.Method.invoke (Method.java:566)
[INFO]     at org.codehaus.plexus.classworlds.launcher.Launcher.launchEnhanced (Launcher.java:289)
[INFO]     at org.codehaus.plexus.classworlds.launcher.Launcher.launch (Launcher.java:229)
[INFO]     at org.codehaus.plexus.classworlds.launcher.Launcher.mainWithExitCode (Launcher.java:415)
[INFO]     at org.codehaus.plexus.classworlds.launcher.Launcher.main (Launcher.java:356)
[INFO] Caused by: java.lang.NoSuchMethodError: org.codehaus.plexus.archiver.jar.JarArchiver.setMinimalDefaultManifest(Z)V
[INFO]     at org.apache.maven.archiver.MavenArchiver.createArchive (MavenArchiver.java:618)
[INFO]     at org.apache.maven.plugins.jar.AbstractJarMojo.createArchive (AbstractJarMojo.java:224)
[INFO]     at org.apache.maven.plugins.jar.AbstractJarMojo.execute (AbstractJarMojo.java:255)
[INFO]     at org.apache.maven.plugin.DefaultBuildPluginManager.executeMojo (DefaultBuildPluginManager.java:134)
[INFO]     at org.apache.maven.lifecycle.internal.MojoExecutor.execute (MojoExecutor.java:208)
[INFO]     at org.apache.maven.lifecycle.internal.MojoExecutor.execute (MojoExecutor.java:154)
[INFO]     at org.apache.maven.lifecycle.internal.MojoExecutor.execute (MojoExecutor.java:146)
[INFO]     at org.apache.maven.lifecycle.internal.LifecycleModuleBuilder.buildProject (LifecycleModuleBuilder.java:117)
[INFO]     at org.apache.maven.lifecycle.internal.LifecycleModuleBuilder.buildProject (LifecycleModuleBuilder.java:81)
[INFO]     at org.apache.maven.lifecycle.internal.builder.singlethreaded.SingleThreadedBuilder.build
(SingleThreadedBuilder.java:51)
[INFO]     at org.apache.maven.lifecycle.internal.LifecycleStarter.execute (LifecycleStarter.java:128)
[INFO]     at org.apache.maven.DefaultMaven.doExecute (DefaultMaven.java:309)
[INFO]     at org.apache.maven.DefaultMaven.doExecute (DefaultMaven.java:194)
[INFO]     at org.apache.maven.DefaultMaven.execute (DefaultMaven.java:107)
[INFO]     at org.apache.maven.cli.MavenCli.execute (MavenCli.java:955)
[INFO]     at org.apache.maven.cli.MavenCli.doMain (MavenCli.java:290)
[INFO]     at org.apache.maven.cli.MavenCli.main (MavenCli.java:194)
[INFO]     at jdk.internal.reflect.NativeMethodAccessorImpl.invoke0 (Native Method)
[INFO]     at jdk.internal.reflect.NativeMethodAccessorImpl.invoke (NativeMethodAccessorImpl.java:62)
[INFO]     at jdk.internal.reflect.DelegatingMethodAccessorImpl.invoke (DelegatingMethodAccessorImpl.java:43)
[INFO]     at java.lang.reflect.Method.invoke (Method.java:566)
[INFO]     at org.codehaus.plexus.classworlds.launcher.Launcher.launchEnhanced (Launcher.java:289)
[INFO]     at org.codehaus.plexus.classworlds.launcher.Launcher.launch (Launcher.java:229)
[INFO]     at org.codehaus.plexus.classworlds.launcher.Launcher.mainWithExitCode (Launcher.java:415)
[INFO]     at org.codehaus.plexus.classworlds.launcher.Launcher.main (Launcher.java:356)
[INFO] [ERROR] 
[INFO] [ERROR] 
[INFO] [ERROR] For more information about the errors and possible solutions, please read the
following articles:
[INFO] [ERROR] [Help 1] http://cwiki.apache.org/confluence/display/MAVEN/PluginContainerException
[INFO] run post-build script verify.bsh
[INFO] Running post-build script: f:\jenkins\jenkins-slave\workspace\en-box_maven-jar-plugin_MJAR-262@2\windows-jdk11-m3.5.x_build\target\it\project-004\verify.bsh
[INFO] Finished post-build script: f:\jenkins\jenkins-slave\workspace\en-box_maven-jar-plugin_MJAR-262@2\windows-jdk11-m3.5.x_build\target\it\project-004\verify.bsh
[INFO]           project-004\pom.xml .............................. FAILED (10.3 s)
[INFO]   The post-build script returned false.
[INFO] 
[INFO] --- maven-checkstyle-plugin:3.0.0:check (checkstyle-check) @ maven-jar-plugin ---
[INFO] 
[INFO] --- maven-invoker-plugin:3.1.0:verify (integration-test) @ maven-jar-plugin ---
[INFO] -------------------------------------------------
[INFO] Build Summary:
[INFO]   Passed: 2, Failed: 23, Errors: 0, Skipped: 1
[INFO] -------------------------------------------------
[ERROR] The following builds failed:
[ERROR] *  manifest-content\pom.xml
[ERROR] *  mjar-139\pom.xml
[ERROR] *  MJAR-162\pom.xml
[ERROR] *  MJAR-183\pom.xml
[ERROR] *  MJAR-199-change-classifier\pom.xml
[ERROR] *  MJAR-199\pom.xml
[ERROR] *  MJAR-228\pom.xml
[ERROR] *  MJAR-260-invalid-automatic-module-name\pom.xml
[ERROR] *  MJAR-260-valid-automatic-module-name\pom.xml
[ERROR] *  MJAR-30-excludes\pom.xml
[ERROR] *  MJAR-30-fullcontent\pom.xml
[ERROR] *  MJAR-30-include\pom.xml
[ERROR] *  MJAR-60\pom.xml
[ERROR] *  MJAR-70-recreation\pom.xml
[ERROR] *  mjar-71-01\pom.xml
[ERROR] *  mjar-71-02\pom.xml
[ERROR] *  MJAR-75\pom.xml
[ERROR] *  MJAR-80-exclude\pom.xml
[ERROR] *  MJAR-80-fullcontent\pom.xml
[ERROR] *  MJAR-80-include\pom.xml
[ERROR] *  MJAR-82\pom.xml
[ERROR] *  mjar-90\pom.xml
[ERROR] *  project-004\pom.xml
[INFO] -------------------------------------------------
[INFO] ------------------------------------------------------------------------
[INFO] BUILD FAILURE
[INFO] ------------------------------------------------------------------------
[INFO] Total time: 05:46 min
[INFO] Finished at: 2019-03-11T18:05:38Z
[INFO] Final Memory: 40M/144M
[INFO] ------------------------------------------------------------------------
[INFO] [jenkins-event-spy] Generated F:\jenkins\jenkins-slave\workspace\en-box_maven-jar-plugin_MJAR-262@2@tmp\withMaven1a867be6\maven-spy-20190311-175951-58913269747545670944562.log
[ERROR] Failed to execute goal org.apache.maven.plugins:maven-invoker-plugin:3.1.0:verify
(integration-test) on project maven-jar-plugin: 23 builds failed. See console output above
for details. -> [Help 1]
org.apache.maven.lifecycle.LifecycleExecutionException: Failed to execute goal org.apache.maven.plugins:maven-invoker-plugin:3.1.0:verify
(integration-test) on project maven-jar-plugin: 23 builds failed. See console output above
for details.
    at org.apache.maven.lifecycle.internal.MojoExecutor.execute (MojoExecutor.java:213)
    at org.apache.maven.lifecycle.internal.MojoExecutor.execute (MojoExecutor.java:154)
    at org.apache.maven.lifecycle.internal.MojoExecutor.execute (MojoExecutor.java:146)
    at org.apache.maven.lifecycle.internal.LifecycleModuleBuilder.buildProject (LifecycleModuleBuilder.java:117)
    at org.apache.maven.lifecycle.internal.LifecycleModuleBuilder.buildProject (LifecycleModuleBuilder.java:81)
    at org.apache.maven.lifecycle.internal.builder.singlethreaded.SingleThreadedBuilder.build
(SingleThreadedBuilder.java:51)
    at org.apache.maven.lifecycle.internal.LifecycleStarter.execute (LifecycleStarter.java:128)
    at org.apache.maven.DefaultMaven.doExecute (DefaultMaven.java:309)
    at org.apache.maven.DefaultMaven.doExecute (DefaultMaven.java:194)
    at org.apache.maven.DefaultMaven.execute (DefaultMaven.java:107)
    at org.apache.maven.cli.MavenCli.execute (MavenCli.java:955)
    at org.apache.maven.cli.MavenCli.doMain (MavenCli.java:290)
    at org.apache.maven.cli.MavenCli.main (MavenCli.java:194)
    at jdk.internal.reflect.NativeMethodAccessorImpl.invoke0 (Native Method)
    at jdk.internal.reflect.NativeMethodAccessorImpl.invoke (NativeMethodAccessorImpl.java:62)
    at jdk.internal.reflect.DelegatingMethodAccessorImpl.invoke (DelegatingMethodAccessorImpl.java:43)
    at java.lang.reflect.Method.invoke (Method.java:566)
    at org.codehaus.plexus.classworlds.launcher.Launcher.launchEnhanced (Launcher.java:289)
    at org.codehaus.plexus.classworlds.launcher.Launcher.launch (Launcher.java:229)
    at org.codehaus.plexus.classworlds.launcher.Launcher.mainWithExitCode (Launcher.java:415)
    at org.codehaus.plexus.classworlds.launcher.Launcher.main (Launcher.java:356)
Caused by: org.apache.maven.plugin.MojoFailureException: 23 builds failed. See console output
above for details.
    at org.apache.maven.plugins.invoker.InvokerSession.handleFailures (InvokerSession.java:260)
    at org.apache.maven.plugins.invoker.VerifyMojo.execute (VerifyMojo.java:137)
    at org.apache.maven.plugin.DefaultBuildPluginManager.executeMojo (DefaultBuildPluginManager.java:134)
    at org.apache.maven.lifecycle.internal.MojoExecutor.execute (MojoExecutor.java:208)
    at org.apache.maven.lifecycle.internal.MojoExecutor.execute (MojoExecutor.java:154)
    at org.apache.maven.lifecycle.internal.MojoExecutor.execute (MojoExecutor.java:146)
    at org.apache.maven.lifecycle.internal.LifecycleModuleBuilder.buildProject (LifecycleModuleBuilder.java:117)
    at org.apache.maven.lifecycle.internal.LifecycleModuleBuilder.buildProject (LifecycleModuleBuilder.java:81)
    at org.apache.maven.lifecycle.internal.builder.singlethreaded.SingleThreadedBuilder.build
(SingleThreadedBuilder.java:51)
    at org.apache.maven.lifecycle.internal.LifecycleStarter.execute (LifecycleStarter.java:128)
    at org.apache.maven.DefaultMaven.doExecute (DefaultMaven.java:309)
    at org.apache.maven.DefaultMaven.doExecute (DefaultMaven.java:194)
    at org.apache.maven.DefaultMaven.execute (DefaultMaven.java:107)
    at org.apache.maven.cli.MavenCli.execute (MavenCli.java:955)
    at org.apache.maven.cli.MavenCli.doMain (MavenCli.java:290)
    at org.apache.maven.cli.MavenCli.main (MavenCli.java:194)
    at jdk.internal.reflect.NativeMethodAccessorImpl.invoke0 (Native Method)
    at jdk.internal.reflect.NativeMethodAccessorImpl.invoke (NativeMethodAccessorImpl.java:62)
    at jdk.internal.reflect.DelegatingMethodAccessorImpl.invoke (DelegatingMethodAccessorImpl.java:43)
    at java.lang.reflect.Method.invoke (Method.java:566)
    at org.codehaus.plexus.classworlds.launcher.Launcher.launchEnhanced (Launcher.java:289)
    at org.codehaus.plexus.classworlds.launcher.Launcher.launch (Launcher.java:229)
    at org.codehaus.plexus.classworlds.launcher.Launcher.mainWithExitCode (Launcher.java:415)
    at org.codehaus.plexus.classworlds.launcher.Launcher.main (Launcher.java:356)
[ERROR] 
[ERROR] Re-run Maven using the -X switch to enable full debug logging.
[ERROR] 
[ERROR] For more information about the errors and possible solutions, please read the following
articles:
[ERROR] [Help 1] http://cwiki.apache.org/confluence/display/MAVEN/MojoFailureException
[Pipeline] }
[Pipeline] // dir
[Pipeline] }
[Fast Archiver] No prior successful build to compare, so performing full copy of artifacts
[withMaven] junitPublisher - Archive test results for Maven artifact org.apache.maven.plugins:maven-jar-plugin:maven-plugin:3.1.2-SNAPSHOT
generated by maven-surefire-plugin:test (default-test): windows-jdk11-m3.5.x_build\target\surefire-reports\*.xml
Recording test results
[withMaven] openTasksPublisher - Scan Tasks for Maven artifact org.apache.maven.plugins:maven-jar-plugin:maven-plugin:3.1.2-SNAPSHOT
in source directory windows-jdk11-m3.5.x_build\src\main\java
[TASKS] Scanning folder 'f:\jenkins\jenkins-slave\workspace\en-box_maven-jar-plugin_MJAR-262@2'
for files matching the pattern 'windows-jdk11-m3.5.x_build\src\main\java\**\*' - excludes:
null
[TASKS] Found 3 files to scan for tasks
[TASKS] Found 1 open tasks.
Skipping warnings blame since pipelines do not have an SCM link.%n
[withMaven] invokerPublisher - Archive invoker results for Maven artifact MavenArtifact{org.apache.maven.plugins:maven-jar-plugin:maven-plugin:3.1.2-SNAPSHOT(version:
3.1.2-SNAPSHOT, snapshot:false) } generated by PluginInvocation{org.apache.maven.plugins:maven-invoker-plugin:3.1.0@integration-test
 integration-test}: windows-jdk11-m3.5.x_build\target\invoker-reports\*.xml
[withMaven] Publishers: Generated Artifacts Publisher: 17 ms, Junit Publisher: 85 ms, Open
Task Scanner Publisher: 80 ms, Invoker Publisher: 6987 ms
[Pipeline] // withMaven
[Pipeline] cleanWs
[WS-CLEANUP] Deleting project workspace...
[WS-CLEANUP] Deferred wipeout is used...
[WS-CLEANUP] done
[Pipeline] cleanWs
[WS-CLEANUP] Deleting project workspace...
[WS-CLEANUP] Deferred wipeout is used...
[WS-CLEANUP] done
[Pipeline] }
[Pipeline] // stage
[Pipeline] }
[Pipeline] // ws
[Pipeline] }
[Pipeline] // node
[Pipeline] }
Failed in branch windows-jdk11-m3.5.x_build
[Pipeline] // parallel
[Pipeline] stage
[Pipeline] { (Notifications)
[Pipeline] echo
Build result: FAILURE
[Pipeline] jiraIssueSelector
[Pipeline] emailext
Mime
  • Unnamed multipart/mixed (inline, None, 0 bytes)
View raw message