maven-notifications mailing list archives

Site index · List index
Message view « Date » · « Thread »
Top « Date » · « Thread »
From Apache Jenkins Server <jenk...@builds.apache.org>
Subject Build unstable in Jenkins: Maven TLP » maven-resolver » master #2
Date Wed, 06 Mar 2019 02:17:39 GMT
See https://builds.apache.org/job/maven-box/job/maven-resolver/job/master/2/

Changes:

* document IllegalArgumentException thrown by CTR
* document IllegalArgumentException thrown by CTR
* document IllegalArgumentException thrown by CTR
* document IllegalArgumentException thrown by CTR
* document IllegalArgumentException thrown by CTR
* document IllegalArgumentException thrown by CTR

1 tests failed.
FAILED:  org.eclipse.aether.transport.http.HttpTransporterTest.windows-jdk7 / Build windows-jdk7
/ testConcurrency

Error Message:
test timed out after 20000 milliseconds

Stack Trace:
org.junit.runners.model.TestTimedOutException: test timed out after 20000 milliseconds
	at org.eclipse.aether.transport.http.HttpTransporterTest.testConcurrency(HttpTransporterTest.java:966)




Build log:
[...truncated 20167 lines...]
[INFO] Downloaded from central: https://repo.maven.apache.org/maven2/org/codehaus/plexus/plexus-archiver/3.4.1/plexus-archiver-3.4.1.jar
(187 kB at 161 kB/s)
[INFO] Downloading from central: https://repo.maven.apache.org/maven2/org/codehaus/plexus/plexus-utils/3.0.20/plexus-utils-3.0.20.jar
[INFO] Downloaded from central: https://repo.maven.apache.org/maven2/javax/servlet/servlet-api/2.3/servlet-api-2.3.jar
(78 kB at 67 kB/s)
[INFO] Downloading from central: https://repo.maven.apache.org/maven2/org/apache/maven/surefire/maven-surefire-common/2.19.1/maven-surefire-common-2.19.1.jar
[INFO] Downloaded from central: https://repo.maven.apache.org/maven2/com/thoughtworks/qdox/qdox/2.0-M5/qdox-2.0-M5.jar
(313 kB at 268 kB/s)
[INFO] Downloading from central: https://repo.maven.apache.org/maven2/org/apache/maven/surefire/surefire-api/2.19.1/surefire-api-2.19.1.jar
[INFO] Downloaded from central: https://repo.maven.apache.org/maven2/net/sf/jtidy/jtidy/r938/jtidy-r938.jar
(250 kB at 214 kB/s)
[INFO] Downloading from central: https://repo.maven.apache.org/maven2/org/apache/maven/surefire/surefire-booter/2.19.1/surefire-booter-2.19.1.jar
[INFO] Downloaded from central: https://repo.maven.apache.org/maven2/org/codehaus/plexus/plexus-utils/3.0.20/plexus-utils-3.0.20.jar
(243 kB at 177 kB/s)
[INFO] Downloading from central: https://repo.maven.apache.org/maven2/org/apache/commons/commons-lang3/3.1/commons-lang3-3.1.jar
[INFO] Downloaded from central: https://repo.maven.apache.org/maven2/org/apache/commons/commons-lang3/3.1/commons-lang3-3.1.jar
(316 kB at 226 kB/s)
[INFO] Downloaded from central: https://repo.maven.apache.org/maven2/org/apache/maven/doxia/doxia-core/1.4/doxia-core-1.4.jar
(165 kB at 100 kB/s)
[INFO] Downloaded from central: https://repo.maven.apache.org/maven2/org/apache/maven/surefire/surefire-booter/2.19.1/surefire-booter-2.19.1.jar
(46 kB at 27 kB/s)
[INFO] Downloaded from central: https://repo.maven.apache.org/maven2/org/apache/maven/surefire/surefire-api/2.19.1/surefire-api-2.19.1.jar
(196 kB at 95 kB/s)
[INFO] Downloaded from central: https://repo.maven.apache.org/maven2/org/apache/maven/surefire/maven-surefire-common/2.19.1/maven-surefire-common-2.19.1.jar
(293 kB at 126 kB/s)
[ERROR] 

Artifact Ids of the format maven-___-plugin are reserved for 
plugins in the Group Id org.apache.maven.plugins
Please change your artifactId to the format ___-maven-plugin
In the future this error will break the build.


[INFO] Using 'UTF-8' encoding to read mojo source files.
[INFO] java-annotations mojo extractor found 1 mojo descriptor.
[INFO] java-javadoc mojo extractor found 0 mojo descriptor.
[INFO] 
[INFO] --- maven-resources-plugin:3.1.0:testResources (default-testResources) @ maven-resolver-demo-maven-plugin
---
[INFO] Using 'UTF-8' encoding to copy filtered resources.
[INFO] skip non existing resourceDirectory F:\jenkins\jenkins-slave\workspace\maven-box_maven-resolver_master\m\maven-resolver-demos\maven-resolver-demo-maven-plugin\src\test\resources
[INFO] Copying 3 resources
[INFO] 
[INFO] --- maven-compiler-plugin:3.7.0:testCompile (default-testCompile) @ maven-resolver-demo-maven-plugin
---
[INFO] No sources to compile
[INFO] 
[INFO] --- maven-surefire-plugin:2.22.0:test (default-test) @ maven-resolver-demo-maven-plugin
---
[INFO] 
[INFO] --- maven-jar-plugin:3.1.0:jar (default-jar) @ maven-resolver-demo-maven-plugin ---
[INFO] Building jar: F:\jenkins\jenkins-slave\workspace\maven-box_maven-resolver_master\m\maven-resolver-demos\maven-resolver-demo-maven-plugin\target\maven-resolver-demo-maven-plugin-1.3.3-SNAPSHOT.jar
[INFO] 
[INFO] --- maven-plugin-plugin:3.5.2:addPluginArtifactMetadata (default-addPluginArtifactMetadata)
@ maven-resolver-demo-maven-plugin ---
[INFO] 
[INFO] --- maven-site-plugin:3.7.1:attach-descriptor (attach-descriptor) @ maven-resolver-demo-maven-plugin
---
[INFO] Skipping because packaging 'maven-plugin' is not pom.
[INFO] 
[INFO] --- maven-invoker-plugin:3.0.1:install (integration-test) @ maven-resolver-demo-maven-plugin
---
[INFO] Downloading from central: https://repo.maven.apache.org/maven2/org/apache/maven/shared/maven-invoker/3.0.0/maven-invoker-3.0.0.pom
[INFO] Downloaded from central: https://repo.maven.apache.org/maven2/org/apache/maven/shared/maven-invoker/3.0.0/maven-invoker-3.0.0.pom
(5.0 kB at 296 kB/s)
[INFO] Downloading from central: https://repo.maven.apache.org/maven2/org/apache/maven/reporting/maven-reporting-impl/2.4/maven-reporting-impl-2.4.pom
[INFO] Downloaded from central: https://repo.maven.apache.org/maven2/org/apache/maven/reporting/maven-reporting-impl/2.4/maven-reporting-impl-2.4.pom
(6.1 kB at 17 kB/s)
[INFO] Downloading from central: https://repo.maven.apache.org/maven2/commons-validator/commons-validator/1.4.1/commons-validator-1.4.1.pom
[INFO] Downloaded from central: https://repo.maven.apache.org/maven2/commons-validator/commons-validator/1.4.1/commons-validator-1.4.1.pom
(13 kB at 905 kB/s)
[INFO] Downloading from central: https://repo.maven.apache.org/maven2/org/apache/commons/commons-parent/36/commons-parent-36.pom
[INFO] Downloaded from central: https://repo.maven.apache.org/maven2/org/apache/commons/commons-parent/36/commons-parent-36.pom
(58 kB at 2.8 MB/s)
[INFO] Downloading from central: https://repo.maven.apache.org/maven2/commons-beanutils/commons-beanutils/1.8.3/commons-beanutils-1.8.3.pom
[INFO] Downloaded from central: https://repo.maven.apache.org/maven2/commons-beanutils/commons-beanutils/1.8.3/commons-beanutils-1.8.3.pom
(11 kB at 800 kB/s)
[INFO] Downloading from central: https://repo.maven.apache.org/maven2/org/apache/commons/commons-parent/14/commons-parent-14.pom
[INFO] Downloaded from central: https://repo.maven.apache.org/maven2/org/apache/commons/commons-parent/14/commons-parent-14.pom
(31 kB at 2.0 MB/s)
[INFO] Downloading from central: https://repo.maven.apache.org/maven2/commons-digester/commons-digester/1.8.1/commons-digester-1.8.1.pom
[INFO] Downloaded from central: https://repo.maven.apache.org/maven2/commons-digester/commons-digester/1.8.1/commons-digester-1.8.1.pom
(10 kB at 771 kB/s)
[INFO] Downloading from central: https://repo.maven.apache.org/maven2/org/apache/maven/shared/maven-script-interpreter/1.2/maven-script-interpreter-1.2.pom
[INFO] Downloaded from central: https://repo.maven.apache.org/maven2/org/apache/maven/shared/maven-script-interpreter/1.2/maven-script-interpreter-1.2.pom
(4.0 kB at 250 kB/s)
[INFO] Downloading from central: https://repo.maven.apache.org/maven2/org/apache/ant/ant/1.8.1/ant-1.8.1.pom
[INFO] Downloaded from central: https://repo.maven.apache.org/maven2/org/apache/ant/ant/1.8.1/ant-1.8.1.pom
(8.8 kB at 64 kB/s)
[INFO] Downloading from central: https://repo.maven.apache.org/maven2/org/apache/ant/ant-parent/1.8.1/ant-parent-1.8.1.pom
[INFO] Downloaded from central: https://repo.maven.apache.org/maven2/org/apache/ant/ant-parent/1.8.1/ant-parent-1.8.1.pom
(4.3 kB at 285 kB/s)
[INFO] Downloading from central: https://repo.maven.apache.org/maven2/org/apache/maven/shared/maven-artifact-transfer/0.9.1/maven-artifact-transfer-0.9.1.pom
[INFO] Downloaded from central: https://repo.maven.apache.org/maven2/org/apache/maven/shared/maven-artifact-transfer/0.9.1/maven-artifact-transfer-0.9.1.pom
(7.6 kB at 423 kB/s)
[INFO] Downloading from central: https://repo.maven.apache.org/maven2/org/apache/maven/shared/maven-common-artifact-filters/3.0.1/maven-common-artifact-filters-3.0.1.pom
[INFO] Downloaded from central: https://repo.maven.apache.org/maven2/org/apache/maven/shared/maven-common-artifact-filters/3.0.1/maven-common-artifact-filters-3.0.1.pom
(4.8 kB at 24 kB/s)
[INFO] Downloading from central: https://repo.maven.apache.org/maven2/commons-codec/commons-codec/1.6/commons-codec-1.6.pom
[INFO] Downloaded from central: https://repo.maven.apache.org/maven2/commons-codec/commons-codec/1.6/commons-codec-1.6.pom
(11 kB at 797 kB/s)
[INFO] Downloading from central: https://repo.maven.apache.org/maven2/org/slf4j/slf4j-api/1.7.5/slf4j-api-1.7.5.pom
[INFO] Downloaded from central: https://repo.maven.apache.org/maven2/org/slf4j/slf4j-api/1.7.5/slf4j-api-1.7.5.pom
(2.7 kB at 207 kB/s)
[INFO] Downloading from central: https://repo.maven.apache.org/maven2/org/slf4j/slf4j-parent/1.7.5/slf4j-parent-1.7.5.pom
[INFO] Downloaded from central: https://repo.maven.apache.org/maven2/org/slf4j/slf4j-parent/1.7.5/slf4j-parent-1.7.5.pom
(12 kB at 908 kB/s)
[INFO] Downloading from central: https://repo.maven.apache.org/maven2/org/apache/maven/doxia/doxia-sink-api/1.7/doxia-sink-api-1.7.pom
[INFO] Downloaded from central: https://repo.maven.apache.org/maven2/org/apache/maven/doxia/doxia-sink-api/1.7/doxia-sink-api-1.7.pom
(1.5 kB at 118 kB/s)
[INFO] Downloading from central: https://repo.maven.apache.org/maven2/org/apache/maven/doxia/doxia/1.7/doxia-1.7.pom
[INFO] Downloaded from central: https://repo.maven.apache.org/maven2/org/apache/maven/doxia/doxia/1.7/doxia-1.7.pom
(15 kB at 587 kB/s)
[INFO] Downloading from central: https://repo.maven.apache.org/maven2/org/apache/maven/doxia/doxia-logging-api/1.7/doxia-logging-api-1.7.pom
[INFO] Downloaded from central: https://repo.maven.apache.org/maven2/org/apache/maven/doxia/doxia-logging-api/1.7/doxia-logging-api-1.7.pom
(1.5 kB at 12 kB/s)
[INFO] Downloading from central: https://repo.maven.apache.org/maven2/org/apache/maven/doxia/doxia-site-renderer/1.7.4/doxia-site-renderer-1.7.4.pom
[INFO] Downloaded from central: https://repo.maven.apache.org/maven2/org/apache/maven/doxia/doxia-site-renderer/1.7.4/doxia-site-renderer-1.7.4.pom
(6.7 kB at 48 kB/s)
[INFO] Downloading from central: https://repo.maven.apache.org/maven2/org/apache/maven/doxia/doxia-sitetools/1.7.4/doxia-sitetools-1.7.4.pom
[INFO] Downloaded from central: https://repo.maven.apache.org/maven2/org/apache/maven/doxia/doxia-sitetools/1.7.4/doxia-sitetools-1.7.4.pom
(14 kB at 805 kB/s)
[INFO] Downloading from central: https://repo.maven.apache.org/maven2/org/apache/maven/doxia/doxia-core/1.7/doxia-core-1.7.pom
[INFO] Downloaded from central: https://repo.maven.apache.org/maven2/org/apache/maven/doxia/doxia-core/1.7/doxia-core-1.7.pom
(4.1 kB at 313 kB/s)
[INFO] Downloading from central: https://repo.maven.apache.org/maven2/org/apache/maven/doxia/doxia-decoration-model/1.7.4/doxia-decoration-model-1.7.4.pom
[INFO] Downloaded from central: https://repo.maven.apache.org/maven2/org/apache/maven/doxia/doxia-decoration-model/1.7.4/doxia-decoration-model-1.7.4.pom
(3.4 kB at 242 kB/s)
[INFO] Downloading from central: https://repo.maven.apache.org/maven2/org/apache/maven/doxia/doxia-skin-model/1.7.4/doxia-skin-model-1.7.4.pom
[INFO] Downloaded from central: https://repo.maven.apache.org/maven2/org/apache/maven/doxia/doxia-skin-model/1.7.4/doxia-skin-model-1.7.4.pom
(3.0 kB at 233 kB/s)
[INFO] Downloading from central: https://repo.maven.apache.org/maven2/org/apache/maven/doxia/doxia-module-xhtml/1.7/doxia-module-xhtml-1.7.pom
[INFO] Downloaded from central: https://repo.maven.apache.org/maven2/org/apache/maven/doxia/doxia-module-xhtml/1.7/doxia-module-xhtml-1.7.pom
(1.6 kB at 125 kB/s)
[INFO] Downloading from central: https://repo.maven.apache.org/maven2/org/apache/maven/doxia/doxia-modules/1.7/doxia-modules-1.7.pom
[INFO] Downloaded from central: https://repo.maven.apache.org/maven2/org/apache/maven/doxia/doxia-modules/1.7/doxia-modules-1.7.pom
(2.6 kB at 50 kB/s)
[INFO] Downloading from central: https://repo.maven.apache.org/maven2/org/codehaus/groovy/groovy-all/2.4.8/groovy-all-2.4.8.pom
[INFO] Downloaded from central: https://repo.maven.apache.org/maven2/org/codehaus/groovy/groovy-all/2.4.8/groovy-all-2.4.8.pom
(21 kB at 1.4 MB/s)
[INFO] Downloading from central: https://repo.maven.apache.org/maven2/commons-beanutils/commons-beanutils/1.8.3/commons-beanutils-1.8.3.jar
[INFO] Downloading from central: https://repo.maven.apache.org/maven2/org/apache/maven/shared/maven-invoker/3.0.0/maven-invoker-3.0.0.jar
[INFO] Downloading from central: https://repo.maven.apache.org/maven2/commons-digester/commons-digester/1.8.1/commons-digester-1.8.1.jar
[INFO] Downloading from central: https://repo.maven.apache.org/maven2/org/apache/maven/reporting/maven-reporting-impl/2.4/maven-reporting-impl-2.4.jar
[INFO] Downloading from central: https://repo.maven.apache.org/maven2/commons-validator/commons-validator/1.4.1/commons-validator-1.4.1.jar
[INFO] Downloaded from central: https://repo.maven.apache.org/maven2/org/apache/maven/reporting/maven-reporting-impl/2.4/maven-reporting-impl-2.4.jar
(20 kB at 25 kB/s)
[INFO] Downloading from central: https://repo.maven.apache.org/maven2/commons-logging/commons-logging/1.2/commons-logging-1.2.jar
[INFO] Downloaded from central: https://repo.maven.apache.org/maven2/org/apache/maven/shared/maven-invoker/3.0.0/maven-invoker-3.0.0.jar
(33 kB at 41 kB/s)
[INFO] Downloading from central: https://repo.maven.apache.org/maven2/org/apache/maven/shared/maven-script-interpreter/1.2/maven-script-interpreter-1.2.jar
[INFO] Downloaded from central: https://repo.maven.apache.org/maven2/commons-beanutils/commons-beanutils/1.8.3/commons-beanutils-1.8.3.jar
(232 kB at 290 kB/s)
[INFO] Downloading from central: https://repo.maven.apache.org/maven2/org/apache/ant/ant/1.8.1/ant-1.8.1.jar
[INFO] Downloaded from central: https://repo.maven.apache.org/maven2/commons-validator/commons-validator/1.4.1/commons-validator-1.4.1.jar
(190 kB at 191 kB/s)
[INFO] Downloading from central: https://repo.maven.apache.org/maven2/org/apache/maven/shared/maven-artifact-transfer/0.9.1/maven-artifact-transfer-0.9.1.jar
[INFO] Downloaded from central: https://repo.maven.apache.org/maven2/commons-logging/commons-logging/1.2/commons-logging-1.2.jar
(62 kB at 62 kB/s)
[INFO] Downloading from central: https://repo.maven.apache.org/maven2/org/apache/maven/shared/maven-common-artifact-filters/3.0.1/maven-common-artifact-filters-3.0.1.jar
[INFO] Downloaded from central: https://repo.maven.apache.org/maven2/org/apache/ant/ant/1.8.1/ant-1.8.1.jar
(1.5 MB at 1.4 MB/s)
[INFO] Downloading from central: https://repo.maven.apache.org/maven2/commons-codec/commons-codec/1.6/commons-codec-1.6.jar
[INFO] Downloaded from central: https://repo.maven.apache.org/maven2/commons-digester/commons-digester/1.8.1/commons-digester-1.8.1.jar
(146 kB at 131 kB/s)
[INFO] Downloading from central: https://repo.maven.apache.org/maven2/org/slf4j/slf4j-api/1.7.5/slf4j-api-1.7.5.jar
[INFO] Downloaded from central: https://repo.maven.apache.org/maven2/commons-codec/commons-codec/1.6/commons-codec-1.6.jar
(233 kB at 208 kB/s)
[INFO] Downloading from central: https://repo.maven.apache.org/maven2/org/apache/maven/doxia/doxia-sink-api/1.7/doxia-sink-api-1.7.jar
[INFO] Downloaded from central: https://repo.maven.apache.org/maven2/org/apache/maven/doxia/doxia-sink-api/1.7/doxia-sink-api-1.7.jar
(11 kB at 9.5 kB/s)
[INFO] Downloading from central: https://repo.maven.apache.org/maven2/org/apache/maven/doxia/doxia-logging-api/1.7/doxia-logging-api-1.7.jar
[INFO] Downloaded from central: https://repo.maven.apache.org/maven2/org/apache/maven/shared/maven-script-interpreter/1.2/maven-script-interpreter-1.2.jar
(22 kB at 18 kB/s)
[INFO] Downloading from central: https://repo.maven.apache.org/maven2/org/apache/maven/doxia/doxia-site-renderer/1.7.4/doxia-site-renderer-1.7.4.jar
[INFO] Downloaded from central: https://repo.maven.apache.org/maven2/org/apache/maven/shared/maven-artifact-transfer/0.9.1/maven-artifact-transfer-0.9.1.jar
(123 kB at 102 kB/s)
[INFO] Downloading from central: https://repo.maven.apache.org/maven2/org/apache/maven/doxia/doxia-decoration-model/1.7.4/doxia-decoration-model-1.7.4.jar
[INFO] Downloaded from central: https://repo.maven.apache.org/maven2/org/slf4j/slf4j-api/1.7.5/slf4j-api-1.7.5.jar
(26 kB at 20 kB/s)
[INFO] Downloading from central: https://repo.maven.apache.org/maven2/org/apache/maven/doxia/doxia-skin-model/1.7.4/doxia-skin-model-1.7.4.jar
[INFO] Downloaded from central: https://repo.maven.apache.org/maven2/org/apache/maven/doxia/doxia-site-renderer/1.7.4/doxia-site-renderer-1.7.4.jar
(64 kB at 45 kB/s)
[INFO] Downloading from central: https://repo.maven.apache.org/maven2/org/apache/maven/doxia/doxia-module-xhtml/1.7/doxia-module-xhtml-1.7.jar
[INFO] Downloaded from central: https://repo.maven.apache.org/maven2/org/apache/maven/doxia/doxia-logging-api/1.7/doxia-logging-api-1.7.jar
(12 kB at 8.2 kB/s)
[INFO] Downloading from central: https://repo.maven.apache.org/maven2/org/codehaus/groovy/groovy-all/2.4.8/groovy-all-2.4.8.jar
[INFO] Downloaded from central: https://repo.maven.apache.org/maven2/org/apache/maven/doxia/doxia-decoration-model/1.7.4/doxia-decoration-model-1.7.4.jar
(61 kB at 42 kB/s)
[INFO] Downloaded from central: https://repo.maven.apache.org/maven2/org/apache/maven/shared/maven-common-artifact-filters/3.0.1/maven-common-artifact-filters-3.0.1.jar
(61 kB at 41 kB/s)
[INFO] Downloaded from central: https://repo.maven.apache.org/maven2/org/codehaus/groovy/groovy-all/2.4.8/groovy-all-2.4.8.jar
(7.0 MB at 4.1 MB/s)
[INFO] Downloaded from central: https://repo.maven.apache.org/maven2/org/apache/maven/doxia/doxia-module-xhtml/1.7/doxia-module-xhtml-1.7.jar
(17 kB at 10 kB/s)
[INFO] Downloaded from central: https://repo.maven.apache.org/maven2/org/apache/maven/doxia/doxia-skin-model/1.7.4/doxia-skin-model-1.7.4.jar
(16 kB at 9.2 kB/s)
[INFO] Installing f:\jenkins\jenkins-slave\workspace\maven-box_maven-resolver_master\m\pom.xml
to F:\jenkins\jenkins-slave\workspace\maven-box_maven-resolver_master\m\maven-resolver-demos\maven-resolver-demo-maven-plugin\target\local-repo\org\apache\maven\resolver\maven-resolver\1.3.3-SNAPSHOT\maven-resolver-1.3.3-SNAPSHOT.pom
[INFO] Installing f:\jenkins\jenkins-slave\workspace\maven-box_maven-resolver_master\m\target\maven-resolver-1.3.3-SNAPSHOT-site.xml
to F:\jenkins\jenkins-slave\workspace\maven-box_maven-resolver_master\m\maven-resolver-demos\maven-resolver-demo-maven-plugin\target\local-repo\org\apache\maven\resolver\maven-resolver\1.3.3-SNAPSHOT\maven-resolver-1.3.3-SNAPSHOT-site.xml
[INFO] Installing F:\jenkins\jenkins-slave\workspace\maven-box_maven-resolver_master\m\maven-resolver-api\pom.xml
to F:\jenkins\jenkins-slave\workspace\maven-box_maven-resolver_master\m\maven-resolver-demos\maven-resolver-demo-maven-plugin\target\local-repo\org\apache\maven\resolver\maven-resolver-api\1.3.3-SNAPSHOT\maven-resolver-api-1.3.3-SNAPSHOT.pom
[INFO] Installing F:\jenkins\jenkins-slave\workspace\maven-box_maven-resolver_master\m\maven-resolver-api\target\maven-resolver-api-1.3.3-SNAPSHOT.jar
to F:\jenkins\jenkins-slave\workspace\maven-box_maven-resolver_master\m\maven-resolver-demos\maven-resolver-demo-maven-plugin\target\local-repo\org\apache\maven\resolver\maven-resolver-api\1.3.3-SNAPSHOT\maven-resolver-api-1.3.3-SNAPSHOT.jar
[INFO] Installing F:\jenkins\jenkins-slave\workspace\maven-box_maven-resolver_master\m\maven-resolver-spi\pom.xml
to F:\jenkins\jenkins-slave\workspace\maven-box_maven-resolver_master\m\maven-resolver-demos\maven-resolver-demo-maven-plugin\target\local-repo\org\apache\maven\resolver\maven-resolver-spi\1.3.3-SNAPSHOT\maven-resolver-spi-1.3.3-SNAPSHOT.pom
[INFO] Installing F:\jenkins\jenkins-slave\workspace\maven-box_maven-resolver_master\m\maven-resolver-spi\target\maven-resolver-spi-1.3.3-SNAPSHOT.jar
to F:\jenkins\jenkins-slave\workspace\maven-box_maven-resolver_master\m\maven-resolver-demos\maven-resolver-demo-maven-plugin\target\local-repo\org\apache\maven\resolver\maven-resolver-spi\1.3.3-SNAPSHOT\maven-resolver-spi-1.3.3-SNAPSHOT.jar
[INFO] Installing F:\jenkins\jenkins-slave\workspace\maven-box_maven-resolver_master\m\maven-resolver-test-util\pom.xml
to F:\jenkins\jenkins-slave\workspace\maven-box_maven-resolver_master\m\maven-resolver-demos\maven-resolver-demo-maven-plugin\target\local-repo\org\apache\maven\resolver\maven-resolver-test-util\1.3.3-SNAPSHOT\maven-resolver-test-util-1.3.3-SNAPSHOT.pom
[INFO] Installing F:\jenkins\jenkins-slave\workspace\maven-box_maven-resolver_master\m\maven-resolver-test-util\target\maven-resolver-test-util-1.3.3-SNAPSHOT.jar
to F:\jenkins\jenkins-slave\workspace\maven-box_maven-resolver_master\m\maven-resolver-demos\maven-resolver-demo-maven-plugin\target\local-repo\org\apache\maven\resolver\maven-resolver-test-util\1.3.3-SNAPSHOT\maven-resolver-test-util-1.3.3-SNAPSHOT.jar
[INFO] Installing F:\jenkins\jenkins-slave\workspace\maven-box_maven-resolver_master\m\maven-resolver-util\pom.xml
to F:\jenkins\jenkins-slave\workspace\maven-box_maven-resolver_master\m\maven-resolver-demos\maven-resolver-demo-maven-plugin\target\local-repo\org\apache\maven\resolver\maven-resolver-util\1.3.3-SNAPSHOT\maven-resolver-util-1.3.3-SNAPSHOT.pom
[INFO] Installing F:\jenkins\jenkins-slave\workspace\maven-box_maven-resolver_master\m\maven-resolver-util\target\maven-resolver-util-1.3.3-SNAPSHOT.jar
to F:\jenkins\jenkins-slave\workspace\maven-box_maven-resolver_master\m\maven-resolver-demos\maven-resolver-demo-maven-plugin\target\local-repo\org\apache\maven\resolver\maven-resolver-util\1.3.3-SNAPSHOT\maven-resolver-util-1.3.3-SNAPSHOT.jar
[INFO] Installing F:\jenkins\jenkins-slave\workspace\maven-box_maven-resolver_master\m\maven-resolver-impl\pom.xml
to F:\jenkins\jenkins-slave\workspace\maven-box_maven-resolver_master\m\maven-resolver-demos\maven-resolver-demo-maven-plugin\target\local-repo\org\apache\maven\resolver\maven-resolver-impl\1.3.3-SNAPSHOT\maven-resolver-impl-1.3.3-SNAPSHOT.pom
[INFO] Installing F:\jenkins\jenkins-slave\workspace\maven-box_maven-resolver_master\m\maven-resolver-impl\target\maven-resolver-impl-1.3.3-SNAPSHOT.jar
to F:\jenkins\jenkins-slave\workspace\maven-box_maven-resolver_master\m\maven-resolver-demos\maven-resolver-demo-maven-plugin\target\local-repo\org\apache\maven\resolver\maven-resolver-impl\1.3.3-SNAPSHOT\maven-resolver-impl-1.3.3-SNAPSHOT.jar
[INFO] Installing F:\jenkins\jenkins-slave\workspace\maven-box_maven-resolver_master\m\maven-resolver-connector-basic\pom.xml
to F:\jenkins\jenkins-slave\workspace\maven-box_maven-resolver_master\m\maven-resolver-demos\maven-resolver-demo-maven-plugin\target\local-repo\org\apache\maven\resolver\maven-resolver-connector-basic\1.3.3-SNAPSHOT\maven-resolver-connector-basic-1.3.3-SNAPSHOT.pom
[INFO] Installing F:\jenkins\jenkins-slave\workspace\maven-box_maven-resolver_master\m\maven-resolver-connector-basic\target\maven-resolver-connector-basic-1.3.3-SNAPSHOT.jar
to F:\jenkins\jenkins-slave\workspace\maven-box_maven-resolver_master\m\maven-resolver-demos\maven-resolver-demo-maven-plugin\target\local-repo\org\apache\maven\resolver\maven-resolver-connector-basic\1.3.3-SNAPSHOT\maven-resolver-connector-basic-1.3.3-SNAPSHOT.jar
[INFO] Installing F:\jenkins\jenkins-slave\workspace\maven-box_maven-resolver_master\m\maven-resolver-transport-classpath\pom.xml
to F:\jenkins\jenkins-slave\workspace\maven-box_maven-resolver_master\m\maven-resolver-demos\maven-resolver-demo-maven-plugin\target\local-repo\org\apache\maven\resolver\maven-resolver-transport-classpath\1.3.3-SNAPSHOT\maven-resolver-transport-classpath-1.3.3-SNAPSHOT.pom
[INFO] Installing F:\jenkins\jenkins-slave\workspace\maven-box_maven-resolver_master\m\maven-resolver-transport-classpath\target\maven-resolver-transport-classpath-1.3.3-SNAPSHOT.jar
to F:\jenkins\jenkins-slave\workspace\maven-box_maven-resolver_master\m\maven-resolver-demos\maven-resolver-demo-maven-plugin\target\local-repo\org\apache\maven\resolver\maven-resolver-transport-classpath\1.3.3-SNAPSHOT\maven-resolver-transport-classpath-1.3.3-SNAPSHOT.jar
[INFO] Installing F:\jenkins\jenkins-slave\workspace\maven-box_maven-resolver_master\m\maven-resolver-transport-file\pom.xml
to F:\jenkins\jenkins-slave\workspace\maven-box_maven-resolver_master\m\maven-resolver-demos\maven-resolver-demo-maven-plugin\target\local-repo\org\apache\maven\resolver\maven-resolver-transport-file\1.3.3-SNAPSHOT\maven-resolver-transport-file-1.3.3-SNAPSHOT.pom
[INFO] Installing F:\jenkins\jenkins-slave\workspace\maven-box_maven-resolver_master\m\maven-resolver-transport-file\target\maven-resolver-transport-file-1.3.3-SNAPSHOT.jar
to F:\jenkins\jenkins-slave\workspace\maven-box_maven-resolver_master\m\maven-resolver-demos\maven-resolver-demo-maven-plugin\target\local-repo\org\apache\maven\resolver\maven-resolver-transport-file\1.3.3-SNAPSHOT\maven-resolver-transport-file-1.3.3-SNAPSHOT.jar
[INFO] Installing F:\jenkins\jenkins-slave\workspace\maven-box_maven-resolver_master\m\maven-resolver-transport-http\pom.xml
to F:\jenkins\jenkins-slave\workspace\maven-box_maven-resolver_master\m\maven-resolver-demos\maven-resolver-demo-maven-plugin\target\local-repo\org\apache\maven\resolver\maven-resolver-transport-http\1.3.3-SNAPSHOT\maven-resolver-transport-http-1.3.3-SNAPSHOT.pom
[INFO] Installing F:\jenkins\jenkins-slave\workspace\maven-box_maven-resolver_master\m\maven-resolver-transport-http\target\maven-resolver-transport-http-1.3.3-SNAPSHOT.jar
to F:\jenkins\jenkins-slave\workspace\maven-box_maven-resolver_master\m\maven-resolver-demos\maven-resolver-demo-maven-plugin\target\local-repo\org\apache\maven\resolver\maven-resolver-transport-http\1.3.3-SNAPSHOT\maven-resolver-transport-http-1.3.3-SNAPSHOT.jar
[INFO] Installing F:\jenkins\jenkins-slave\workspace\maven-box_maven-resolver_master\m\maven-resolver-transport-wagon\pom.xml
to F:\jenkins\jenkins-slave\workspace\maven-box_maven-resolver_master\m\maven-resolver-demos\maven-resolver-demo-maven-plugin\target\local-repo\org\apache\maven\resolver\maven-resolver-transport-wagon\1.3.3-SNAPSHOT\maven-resolver-transport-wagon-1.3.3-SNAPSHOT.pom
[INFO] Installing F:\jenkins\jenkins-slave\workspace\maven-box_maven-resolver_master\m\maven-resolver-transport-wagon\target\maven-resolver-transport-wagon-1.3.3-SNAPSHOT.jar
to F:\jenkins\jenkins-slave\workspace\maven-box_maven-resolver_master\m\maven-resolver-demos\maven-resolver-demo-maven-plugin\target\local-repo\org\apache\maven\resolver\maven-resolver-transport-wagon\1.3.3-SNAPSHOT\maven-resolver-transport-wagon-1.3.3-SNAPSHOT.jar
[INFO] Installing F:\jenkins\jenkins-slave\workspace\maven-box_maven-resolver_master\m\maven-resolver-demos\pom.xml
to F:\jenkins\jenkins-slave\workspace\maven-box_maven-resolver_master\m\maven-resolver-demos\maven-resolver-demo-maven-plugin\target\local-repo\org\apache\maven\resolver\maven-resolver-demos\1.3.3-SNAPSHOT\maven-resolver-demos-1.3.3-SNAPSHOT.pom
[INFO] Installing F:\jenkins\jenkins-slave\workspace\maven-box_maven-resolver_master\m\maven-resolver-demos\target\maven-resolver-demos-1.3.3-SNAPSHOT-site.xml
to F:\jenkins\jenkins-slave\workspace\maven-box_maven-resolver_master\m\maven-resolver-demos\maven-resolver-demo-maven-plugin\target\local-repo\org\apache\maven\resolver\maven-resolver-demos\1.3.3-SNAPSHOT\maven-resolver-demos-1.3.3-SNAPSHOT-site.xml
[INFO] Installing F:\jenkins\jenkins-slave\workspace\maven-box_maven-resolver_master\m\maven-resolver-demos\maven-resolver-demo-snippets\pom.xml
to F:\jenkins\jenkins-slave\workspace\maven-box_maven-resolver_master\m\maven-resolver-demos\maven-resolver-demo-maven-plugin\target\local-repo\org\apache\maven\resolver\maven-resolver-demo-snippets\1.3.3-SNAPSHOT\maven-resolver-demo-snippets-1.3.3-SNAPSHOT.pom
[INFO] Installing F:\jenkins\jenkins-slave\workspace\maven-box_maven-resolver_master\m\maven-resolver-demos\maven-resolver-demo-snippets\target\maven-resolver-demo-snippets-1.3.3-SNAPSHOT.jar
to F:\jenkins\jenkins-slave\workspace\maven-box_maven-resolver_master\m\maven-resolver-demos\maven-resolver-demo-maven-plugin\target\local-repo\org\apache\maven\resolver\maven-resolver-demo-snippets\1.3.3-SNAPSHOT\maven-resolver-demo-snippets-1.3.3-SNAPSHOT.jar
[INFO] Installing F:\jenkins\jenkins-slave\workspace\maven-box_maven-resolver_master\m\maven-resolver-demos\maven-resolver-demo-maven-plugin\pom.xml
to F:\jenkins\jenkins-slave\workspace\maven-box_maven-resolver_master\m\maven-resolver-demos\maven-resolver-demo-maven-plugin\target\local-repo\org\apache\maven\resolver\maven-resolver-demo-maven-plugin\1.3.3-SNAPSHOT\maven-resolver-demo-maven-plugin-1.3.3-SNAPSHOT.pom
[INFO] Installing F:\jenkins\jenkins-slave\workspace\maven-box_maven-resolver_master\m\maven-resolver-demos\maven-resolver-demo-maven-plugin\target\maven-resolver-demo-maven-plugin-1.3.3-SNAPSHOT.jar
to F:\jenkins\jenkins-slave\workspace\maven-box_maven-resolver_master\m\maven-resolver-demos\maven-resolver-demo-maven-plugin\target\local-repo\org\apache\maven\resolver\maven-resolver-demo-maven-plugin\1.3.3-SNAPSHOT\maven-resolver-demo-maven-plugin-1.3.3-SNAPSHOT.jar
[INFO] 
[INFO] --- maven-invoker-plugin:3.0.1:run (integration-test) @ maven-resolver-demo-maven-plugin
---
[INFO] Running Setup Jobs
[INFO] Building: resolve-artifact\pom.xml
[INFO]           resolve-artifact\pom.xml ......................... SUCCESS (13.0 s)
[INFO] -------------------------------------------------
[INFO] Build Summary:
[INFO]   Passed: 1, Failed: 0, Errors: 0, Skipped: 0
[INFO] -------------------------------------------------
[INFO] 
[INFO] --- maven-checkstyle-plugin:3.0.0:check (checkstyle-check) @ maven-resolver-demo-maven-plugin
---
[INFO] ------------------------------------------------------------------------
[INFO] Reactor Summary:
[INFO] 
[INFO] Maven Artifact Resolver ............................ SUCCESS [04:56 min]
[INFO] Maven Artifact Resolver API ........................ SUCCESS [02:47 min]
[INFO] Maven Artifact Resolver SPI ........................ SUCCESS [ 12.964 s]
[INFO] Maven Artifact Resolver Test Utilities ............. SUCCESS [ 34.309 s]
[INFO] Maven Artifact Resolver Utilities .................. SUCCESS [01:42 min]
[INFO] Maven Artifact Resolver Implementation ............. SUCCESS [05:16 min]
[INFO] Maven Artifact Resolver Connector Basic ............ SUCCESS [01:02 min]
[INFO] Maven Artifact Resolver Transport Classpath ........ SUCCESS [ 35.525 s]
[INFO] Maven Artifact Resolver Transport File ............. SUCCESS [ 16.212 s]
[INFO] Maven Artifact Resolver Transport HTTP ............. SUCCESS [02:53 min]
[INFO] Maven Artifact Resolver Transport Wagon ............ SUCCESS [01:17 min]
[INFO] Maven Artifact Resolver Demos ...................... SUCCESS [  4.905 s]
[INFO] Maven Artifact Resolver Demo Snippets .............. SUCCESS [ 35.824 s]
[INFO] Maven Artifact Resolver Demo Maven Plugin .......... SUCCESS [ 44.767 s]
[INFO] ------------------------------------------------------------------------
[INFO] BUILD SUCCESS
[INFO] ------------------------------------------------------------------------
[INFO] Total time: 23:20 min
[INFO] Finished at: 2019-03-06T02:15:57Z
[INFO] Final Memory: 59M/414M
[INFO] ------------------------------------------------------------------------
[INFO] [jenkins-event-spy] Generated F:\jenkins\jenkins-slave\workspace\maven-box_maven-resolver_master@tmp\withMaven03427f6d\maven-spy-20190306-015229-9963257536593267780982.log
Picked up JAVA_TOOL_OPTIONS: -Dmaven.ext.class.path="f:\jenkins\jenkins-slave\workspace\maven-box_maven-resolver_master@tmp\withMaven03427f6d\pipeline-maven-spy.jar"
-Dorg.jenkinsci.plugins.pipeline.maven.reportsFolder="f:\jenkins\jenkins-slave\workspace\maven-box_maven-resolver_master@tmp\withMaven03427f6d"

[Pipeline] }
[Pipeline] // dir
[Pipeline] }
[withMaven] invokerPublisher - Archive invoker results for Maven artifact MavenArtifact{org.apache.maven.resolver:maven-resolver-demo-maven-plugin:maven-plugin:1.3.3-SNAPSHOT(version:
1.3.3-SNAPSHOT, snapshot:false) } generated by PluginInvocation{org.apache.maven.plugins:maven-invoker-plugin:3.0.1@run
 integration-test}: m\maven-resolver-demos\maven-resolver-demo-maven-plugin\target\invoker-reports\*.xml
[withMaven] junitPublisher - Archive test results for Maven artifact org.apache.maven.resolver:maven-resolver-api:jar:1.3.3-SNAPSHOT
generated by maven-surefire-plugin:test (default-test): m\maven-resolver-api\target\surefire-reports\*.xml
Recording test results
[withMaven] junitPublisher - Archive test results for Maven artifact org.apache.maven.resolver:maven-resolver-spi:jar:1.3.3-SNAPSHOT
generated by maven-surefire-plugin:test (default-test): m\maven-resolver-spi\target\surefire-reports\*.xml
Recording test results
[withMaven] junitPublisher - Archive test results for Maven artifact org.apache.maven.resolver:maven-resolver-test-util:jar:1.3.3-SNAPSHOT
generated by maven-surefire-plugin:test (default-test): m\maven-resolver-test-util\target\surefire-reports\*.xml
Recording test results
[withMaven] junitPublisher - Archive test results for Maven artifact org.apache.maven.resolver:maven-resolver-util:jar:1.3.3-SNAPSHOT
generated by maven-surefire-plugin:test (default-test): m\maven-resolver-util\target\surefire-reports\*.xml
Recording test results
[withMaven] junitPublisher - Archive test results for Maven artifact org.apache.maven.resolver:maven-resolver-impl:jar:1.3.3-SNAPSHOT
generated by maven-surefire-plugin:test (default-test): m\maven-resolver-impl\target\surefire-reports\*.xml
Recording test results
[withMaven] junitPublisher - Archive test results for Maven artifact org.apache.maven.resolver:maven-resolver-connector-basic:jar:1.3.3-SNAPSHOT
generated by maven-surefire-plugin:test (default-test): m\maven-resolver-connector-basic\target\surefire-reports\*.xml
Recording test results
[withMaven] junitPublisher - Archive test results for Maven artifact org.apache.maven.resolver:maven-resolver-transport-classpath:jar:1.3.3-SNAPSHOT
generated by maven-surefire-plugin:test (default-test): m\maven-resolver-transport-classpath\target\surefire-reports\*.xml
Recording test results
[withMaven] junitPublisher - Archive test results for Maven artifact org.apache.maven.resolver:maven-resolver-transport-file:jar:1.3.3-SNAPSHOT
generated by maven-surefire-plugin:test (default-test): m\maven-resolver-transport-file\target\surefire-reports\*.xml
Recording test results
[withMaven] junitPublisher - Archive test results for Maven artifact org.apache.maven.resolver:maven-resolver-transport-http:jar:1.3.3-SNAPSHOT
generated by maven-surefire-plugin:test (default-test): m\maven-resolver-transport-http\target\surefire-reports\*.xml
Recording test results
[withMaven] junitPublisher - Archive test results for Maven artifact org.apache.maven.resolver:maven-resolver-transport-wagon:jar:1.3.3-SNAPSHOT
generated by maven-surefire-plugin:test (default-test): m\maven-resolver-transport-wagon\target\surefire-reports\*.xml
Recording test results
[withMaven] junitPublisher - Archive test results for Maven artifact org.apache.maven.resolver:maven-resolver-demo-snippets:jar:1.3.3-SNAPSHOT
generated by maven-surefire-plugin:test (default-test): m\maven-resolver-demos\maven-resolver-demo-snippets\target\surefire-reports\*.xml
Recording test results
None of the test reports contained any result
[withMaven] junitPublisher - Archive test results for Maven artifact org.apache.maven.resolver:maven-resolver-demo-maven-plugin:maven-plugin:1.3.3-SNAPSHOT
generated by maven-surefire-plugin:test (default-test): m\maven-resolver-demos\maven-resolver-demo-maven-plugin\target\surefire-reports\*.xml
Recording test results
None of the test reports contained any result
[withMaven] Publishers: Pipeline Graph Publisher: 12 ms, Invoker Publisher: 12012 ms, Junit
Publisher: 67050 ms, Concordion Publisher: 2 ms, Dependencies Fingerprint Publisher: 7152
ms, SpotBugs Publisher: 1 ms
[Pipeline] // withMaven
[Pipeline] cleanWs
[WS-CLEANUP] Deleting project workspace...
[WS-CLEANUP] Deferred wipeout is used...
[WS-CLEANUP] done
[Pipeline] }
[Pipeline] // stage
[Pipeline] }
[Pipeline] // node
[Pipeline] }
[Pipeline] // parallel
[Pipeline] stage
[Pipeline] { (Notifications)
[Pipeline] echo
Build result: UNSTABLE
[Pipeline] jiraIssueSelector
[Pipeline] emailext
Mime
  • Unnamed multipart/mixed (inline, None, 0 bytes)
View raw message