maven-notifications mailing list archives

Site index · List index
Message view « Date » · « Thread »
Top « Date » · « Thread »
From Apache Jenkins Server <jenk...@builds.apache.org>
Subject Build failed in Jenkins: Maven TLP » maven-surefire » release/3.0.0-M6 #4
Date Tue, 16 Apr 2019 23:21:29 GMT
See https://builds.apache.org/job/maven-box/job/maven-surefire/job/release%252F3.0.0-M6/4/

Changes:

* [SUREFIRE-1432] Add extension interface with two implementations for
* [SUREFIRE-1432] Add extension interface with two implementations for
* [SUREFIRE-1432] Add extension interface with two implementations for
* [SUREFIRE-1432] Add extension interface with two implementations for

All tests passed

Build log:
[...truncated 23651 lines...]
[2019-04-16T23:11:37.747Z] [WS-CLEANUP] Deleting project workspace...
[2019-04-16T23:11:37.747Z] [WS-CLEANUP] Deferred wipeout is used...
[2019-04-16T23:11:38.097Z] [WS-CLEANUP] done
[Pipeline] }
[Pipeline] // ws
[Pipeline] }
[Pipeline] // timestamps
[Pipeline] }
[Pipeline] // node
[Pipeline] }
[2019-04-16T23:11:38.620Z] [INFO] Tests run: 2, Failures: 0, Errors: 0, Skipped: 0, Time elapsed:
10.38 s - in org.apache.maven.surefire.its.jiras.Surefire34SecurityManagerIT
[2019-04-16T23:11:38.621Z] [INFO] Running org.apache.maven.surefire.its.jiras.Surefire376TestNgAfterSuiteFailureIT
[2019-04-16T23:11:43.927Z] [INFO] Tests run: 1, Failures: 0, Errors: 0, Skipped: 0, Time elapsed:
5.474 s - in org.apache.maven.surefire.its.jiras.Surefire376TestNgAfterSuiteFailureIT
[2019-04-16T23:11:43.927Z] [INFO] Running org.apache.maven.surefire.its.jiras.Surefire377TestNgAndJUnitTogetherIT
[2019-04-16T23:11:55.042Z] [INFO] Tests run: 2, Failures: 0, Errors: 0, Skipped: 0, Time elapsed:
10.565 s - in org.apache.maven.surefire.its.jiras.Surefire377TestNgAndJUnitTogetherIT
[2019-04-16T23:11:55.042Z] [INFO] Running org.apache.maven.surefire.its.jiras.Surefire408ManualProviderSelectionIT
[2019-04-16T23:12:00.303Z] [INFO] Tests run: 1, Failures: 0, Errors: 0, Skipped: 0, Time elapsed:
5.392 s - in org.apache.maven.surefire.its.jiras.Surefire408ManualProviderSelectionIT
[2019-04-16T23:12:00.303Z] [INFO] Running org.apache.maven.surefire.its.jiras.Surefire42NotExtendingTestCaseIT
[2019-04-16T23:12:05.561Z] [INFO] Tests run: 1, Failures: 0, Errors: 0, Skipped: 0, Time elapsed:
5.25 s - in org.apache.maven.surefire.its.jiras.Surefire42NotExtendingTestCaseIT
[2019-04-16T23:12:05.561Z] [INFO] Running org.apache.maven.surefire.its.jiras.Surefire44InnerClassTestIT
[2019-04-16T23:12:10.825Z] [INFO] Tests run: 1, Failures: 0, Errors: 0, Skipped: 0, Time elapsed:
5.259 s - in org.apache.maven.surefire.its.jiras.Surefire44InnerClassTestIT
[2019-04-16T23:12:10.825Z] [INFO] Running org.apache.maven.surefire.its.jiras.Surefire500PuzzlingErrorIT
[2019-04-16T23:12:16.094Z] [INFO] Tests run: 1, Failures: 0, Errors: 0, Skipped: 0, Time elapsed:
5.352 s - in org.apache.maven.surefire.its.jiras.Surefire500PuzzlingErrorIT
[2019-04-16T23:12:16.094Z] [INFO] Running org.apache.maven.surefire.its.jiras.Surefire510TestClassPathForkModesIT
[2019-04-16T23:12:27.207Z] [INFO] Tests run: 2, Failures: 0, Errors: 0, Skipped: 0, Time elapsed:
10.332 s - in org.apache.maven.surefire.its.jiras.Surefire510TestClassPathForkModesIT
[2019-04-16T23:12:27.207Z] [INFO] Running org.apache.maven.surefire.its.jiras.Surefire569RunTestFromDependencyJarsIT
[2019-04-16T23:12:31.385Z] [INFO] Tests run: 1, Failures: 0, Errors: 0, Skipped: 0, Time elapsed:
4.978 s - in org.apache.maven.surefire.its.jiras.Surefire569RunTestFromDependencyJarsIT
[2019-04-16T23:12:31.385Z] [INFO] Running org.apache.maven.surefire.its.jiras.Surefire570MultipleReportDirectoriesIT
[2019-04-16T23:13:00.603Z] [INFO] Tests run: 2, Failures: 0, Errors: 0, Skipped: 0, Time elapsed:
26.844 s - in org.apache.maven.surefire.its.jiras.Surefire570MultipleReportDirectoriesIT
[2019-04-16T23:13:00.603Z] [INFO] Running org.apache.maven.surefire.its.jiras.Surefire613TestCountInParallelIT
[2019-04-16T23:13:04.778Z] [INFO] Tests run: 1, Failures: 0, Errors: 0, Skipped: 0, Time elapsed:
6.586 s - in org.apache.maven.surefire.its.jiras.Surefire613TestCountInParallelIT
[2019-04-16T23:13:04.778Z] [INFO] Running org.apache.maven.surefire.its.jiras.Surefire621TestCountingJunit3InParallelIT
[2019-04-16T23:13:39.059Z] [INFO] Tests run: 5, Failures: 0, Errors: 0, Skipped: 0, Time elapsed:
33.541 s - in org.apache.maven.surefire.its.jiras.Surefire621TestCountingJunit3InParallelIT
[2019-04-16T23:13:39.059Z] [INFO] Running org.apache.maven.surefire.its.jiras.Surefire628ConsoleOutputBeforeAndAfterClassIT
[2019-04-16T23:13:44.332Z] [INFO] Tests run: 1, Failures: 0, Errors: 0, Skipped: 0, Time elapsed:
6.261 s - in org.apache.maven.surefire.its.jiras.Surefire628ConsoleOutputBeforeAndAfterClassIT
[2019-04-16T23:13:44.332Z] [INFO] Running org.apache.maven.surefire.its.jiras.Surefire634UnsettableSystemPropertiesWarningIT
[2019-04-16T23:13:49.613Z] [INFO] Tests run: 1, Failures: 0, Errors: 0, Skipped: 0, Time elapsed:
5.342 s - in org.apache.maven.surefire.its.jiras.Surefire634UnsettableSystemPropertiesWarningIT
[2019-04-16T23:13:49.613Z] [INFO] Running org.apache.maven.surefire.its.jiras.Surefire649EmptyStringSystemPropertiesIT
[2019-04-16T23:13:58.982Z] [INFO] Tests run: 2, Failures: 0, Errors: 0, Skipped: 0, Time elapsed:
9.397 s - in org.apache.maven.surefire.its.jiras.Surefire649EmptyStringSystemPropertiesIT
[2019-04-16T23:13:58.982Z] [INFO] Running org.apache.maven.surefire.its.jiras.Surefire673MockitoIT
[2019-04-16T23:14:05.457Z] [INFO] Tests run: 1, Failures: 0, Errors: 0, Skipped: 0, Time elapsed:
6.424 s - in org.apache.maven.surefire.its.jiras.Surefire673MockitoIT
[2019-04-16T23:14:05.457Z] [INFO] Running org.apache.maven.surefire.its.jiras.Surefire674BuildFailingWhenErrorsIT
[2019-04-16T23:14:10.720Z] [INFO] Tests run: 1, Failures: 0, Errors: 0, Skipped: 0, Time elapsed:
5.397 s - in org.apache.maven.surefire.its.jiras.Surefire674BuildFailingWhenErrorsIT
[2019-04-16T23:14:10.720Z] [INFO] Running org.apache.maven.surefire.its.jiras.Surefire674BuildFailingWhenFailsafeErrorsIT
[2019-04-16T23:14:14.907Z] [INFO] Tests run: 1, Failures: 0, Errors: 0, Skipped: 0, Time elapsed:
4.424 s - in org.apache.maven.surefire.its.jiras.Surefire674BuildFailingWhenFailsafeErrorsIT
[2019-04-16T23:14:14.907Z] [INFO] Running org.apache.maven.surefire.its.jiras.Surefire685CommaSeparatedIncludesIT
[2019-04-16T23:14:20.170Z] [INFO] Tests run: 1, Failures: 0, Errors: 0, Skipped: 0, Time elapsed:
5.185 s - in org.apache.maven.surefire.its.jiras.Surefire685CommaSeparatedIncludesIT
[2019-04-16T23:14:20.170Z] [INFO] Running org.apache.maven.surefire.its.jiras.Surefire697NiceSummaryIT
[2019-04-16T23:14:25.437Z] [INFO] Tests run: 1, Failures: 0, Errors: 0, Skipped: 0, Time elapsed:
5.19 s - in org.apache.maven.surefire.its.jiras.Surefire697NiceSummaryIT
[2019-04-16T23:14:25.437Z] [INFO] Running org.apache.maven.surefire.its.jiras.Surefire705ParallelForkTimeoutIT
[2019-04-16T23:14:33.261Z] [INFO] Tests run: 1, Failures: 0, Errors: 0, Skipped: 0, Time elapsed:
7.734 s - in org.apache.maven.surefire.its.jiras.Surefire705ParallelForkTimeoutIT
[2019-04-16T23:14:33.261Z] [INFO] Running org.apache.maven.surefire.its.jiras.Surefire733AllOverrridesCapturedIT
[2019-04-16T23:14:38.542Z] [INFO] Tests run: 1, Failures: 0, Errors: 0, Skipped: 0, Time elapsed:
5.676 s - in org.apache.maven.surefire.its.jiras.Surefire733AllOverrridesCapturedIT
[2019-04-16T23:14:38.542Z] [INFO] Running org.apache.maven.surefire.its.jiras.Surefire735ForkFailWithRedirectConsoleOutputIT
[2019-04-16T23:14:48.028Z] [INFO] Tests run: 2, Failures: 0, Errors: 0, Skipped: 0, Time elapsed:
9 s - in org.apache.maven.surefire.its.jiras.Surefire735ForkFailWithRedirectConsoleOutputIT
[2019-04-16T23:14:48.028Z] [INFO] Running org.apache.maven.surefire.its.jiras.Surefire740TruncatedCommaIT
[2019-04-16T23:14:52.203Z] [INFO] Tests run: 1, Failures: 0, Errors: 0, Skipped: 0, Time elapsed:
4.458 s - in org.apache.maven.surefire.its.jiras.Surefire740TruncatedCommaIT
[2019-04-16T23:14:52.203Z] [INFO] Running org.apache.maven.surefire.its.jiras.Surefire747MethodParallelWithSuiteCountIT
[2019-04-16T23:15:17.149Z] [INFO] Tests run: 2, Failures: 0, Errors: 0, Skipped: 0, Time elapsed:
22.398 s - in org.apache.maven.surefire.its.jiras.Surefire747MethodParallelWithSuiteCountIT
[2019-04-16T23:15:17.149Z] [INFO] Running org.apache.maven.surefire.its.jiras.Surefire772BothReportsIT
[2019-04-16T23:15:24.974Z] [INFO] Tests run: 3, Failures: 0, Errors: 0, Skipped: 0, Time elapsed:
9.784 s - in org.apache.maven.surefire.its.jiras.Surefire772BothReportsIT
[2019-04-16T23:15:24.974Z] [INFO] Running org.apache.maven.surefire.its.jiras.Surefire772NoFailsafeReportsIT
[2019-04-16T23:15:38.090Z] [INFO] Tests run: 4, Failures: 0, Errors: 0, Skipped: 0, Time elapsed:
12.919 s - in org.apache.maven.surefire.its.jiras.Surefire772NoFailsafeReportsIT
[2019-04-16T23:15:38.090Z] [INFO] Running org.apache.maven.surefire.its.jiras.Surefire772NoSurefireReportsIT
[2019-04-16T23:15:51.358Z] [INFO] Tests run: 4, Failures: 0, Errors: 0, Skipped: 0, Time elapsed:
13.193 s - in org.apache.maven.surefire.its.jiras.Surefire772NoSurefireReportsIT
[2019-04-16T23:15:51.358Z] [INFO] Running org.apache.maven.surefire.its.jiras.Surefire772SpecifiedReportsIT
[2019-04-16T23:16:00.721Z] [INFO] Tests run: 3, Failures: 0, Errors: 0, Skipped: 0, Time elapsed:
9.603 s - in org.apache.maven.surefire.its.jiras.Surefire772SpecifiedReportsIT
[2019-04-16T23:16:00.721Z] [INFO] Running org.apache.maven.surefire.its.jiras.Surefire801ForkModeNoneClassLoaderIT
[2019-04-16T23:16:04.898Z] [INFO] Tests run: 1, Failures: 0, Errors: 0, Skipped: 0, Time elapsed:
4.572 s - in org.apache.maven.surefire.its.jiras.Surefire801ForkModeNoneClassLoaderIT
[2019-04-16T23:16:04.898Z] [INFO] Running org.apache.maven.surefire.its.jiras.Surefire803MultiFailsafeExecsIT
[2019-04-16T23:16:26.215Z] [INFO] Tests run: 2, Failures: 0, Errors: 0, Skipped: 0, Time elapsed:
19.241 s - in org.apache.maven.surefire.its.jiras.Surefire803MultiFailsafeExecsIT
[2019-04-16T23:16:26.215Z] [INFO] Running org.apache.maven.surefire.its.jiras.Surefire806SpecifiedTestControlsIT
[2019-04-16T23:16:29.411Z] [WARNING] Tests run: 3, Failures: 0, Errors: 0, Skipped: 2, Time
elapsed: 5.072 s - in org.apache.maven.surefire.its.jiras.Surefire806SpecifiedTestControlsIT
[2019-04-16T23:16:29.411Z] [INFO] Running org.apache.maven.surefire.its.jiras.Surefire809GroupExpressionsIT
[2019-04-16T23:17:03.690Z] [INFO] Tests run: 6, Failures: 0, Errors: 0, Skipped: 0, Time elapsed:
34.133 s - in org.apache.maven.surefire.its.jiras.Surefire809GroupExpressionsIT
[2019-04-16T23:17:03.690Z] [INFO] Running org.apache.maven.surefire.its.jiras.Surefire812Log4JClassLoaderIT
[2019-04-16T23:17:10.201Z] [INFO] Tests run: 1, Failures: 0, Errors: 0, Skipped: 0, Time elapsed:
6.495 s - in org.apache.maven.surefire.its.jiras.Surefire812Log4JClassLoaderIT
[2019-04-16T23:17:10.201Z] [INFO] Running org.apache.maven.surefire.its.jiras.Surefire817SystemExitIT
[2019-04-16T23:17:16.670Z] [INFO] Tests run: 1, Failures: 0, Errors: 0, Skipped: 0, Time elapsed:
6.406 s - in org.apache.maven.surefire.its.jiras.Surefire817SystemExitIT
[2019-04-16T23:17:16.670Z] [INFO] Running org.apache.maven.surefire.its.jiras.Surefire818NpeIgnoresTestsIT
[2019-04-16T23:17:23.136Z] [INFO] Tests run: 1, Failures: 0, Errors: 0, Skipped: 0, Time elapsed:
6.296 s - in org.apache.maven.surefire.its.jiras.Surefire818NpeIgnoresTestsIT
[2019-04-16T23:17:23.136Z] [INFO] Running org.apache.maven.surefire.its.jiras.Surefire828EmptyGroupExprIT
[2019-04-16T23:17:48.040Z] [INFO] Tests run: 4, Failures: 0, Errors: 0, Skipped: 0, Time elapsed:
23.82 s - in org.apache.maven.surefire.its.jiras.Surefire828EmptyGroupExprIT
[2019-04-16T23:17:48.040Z] [INFO] Running org.apache.maven.surefire.its.jiras.Surefire832ProviderSelectionIT
[2019-04-16T23:17:53.298Z] [INFO] Tests run: 1, Failures: 0, Errors: 0, Skipped: 0, Time elapsed:
6.193 s - in org.apache.maven.surefire.its.jiras.Surefire832ProviderSelectionIT
[2019-04-16T23:17:53.298Z] [INFO] Running org.apache.maven.surefire.its.jiras.Surefire839TestWithoutCategoriesIT
[2019-04-16T23:18:06.415Z] [INFO] Tests run: 2, Failures: 0, Errors: 0, Skipped: 0, Time elapsed:
12.872 s - in org.apache.maven.surefire.its.jiras.Surefire839TestWithoutCategoriesIT
[2019-04-16T23:18:06.415Z] [INFO] Running org.apache.maven.surefire.its.jiras.Surefire847AdditionalFailureIT
[2019-04-16T23:18:11.678Z] [INFO] Tests run: 1, Failures: 0, Errors: 0, Skipped: 0, Time elapsed:
6.508 s - in org.apache.maven.surefire.its.jiras.Surefire847AdditionalFailureIT
[2019-04-16T23:18:11.678Z] [INFO] Running org.apache.maven.surefire.its.jiras.Surefire855AllowFailsafeUseArtifactFileIT
[2019-04-16T23:18:59.045Z] [INFO] Tests run: 4, Failures: 0, Errors: 0, Skipped: 0, Time elapsed:
43.787 s - in org.apache.maven.surefire.its.jiras.Surefire855AllowFailsafeUseArtifactFileIT
[2019-04-16T23:18:59.045Z] [INFO] Running org.apache.maven.surefire.its.jiras.Surefire901MIssingResultfileWhenNoTestsIT
[2019-04-16T23:19:01.345Z] [INFO] Tests run: 1, Failures: 0, Errors: 0, Skipped: 0, Time elapsed:
5.113 s - in org.apache.maven.surefire.its.jiras.Surefire901MIssingResultfileWhenNoTestsIT
[2019-04-16T23:19:01.346Z] [INFO] Running org.apache.maven.surefire.its.jiras.Surefire907PerThreadWithoutThreadCountIT
[2019-04-16T23:19:05.521Z] [INFO] Tests run: 1, Failures: 0, Errors: 0, Skipped: 0, Time elapsed:
4.276 s - in org.apache.maven.surefire.its.jiras.Surefire907PerThreadWithoutThreadCountIT
[2019-04-16T23:19:05.521Z] [INFO] Running org.apache.maven.surefire.its.jiras.Surefire920TestFailureIgnoreWithTimeoutIT
[2019-04-16T23:19:21.027Z] [INFO] Tests run: 2, Failures: 0, Errors: 0, Skipped: 0, Time elapsed:
14.358 s - in org.apache.maven.surefire.its.jiras.Surefire920TestFailureIgnoreWithTimeoutIT
[2019-04-16T23:19:21.027Z] [INFO] Running org.apache.maven.surefire.its.jiras.Surefire926FailureWith2ProvidersIT
[2019-04-16T23:19:23.332Z] [INFO] Tests run: 1, Failures: 0, Errors: 0, Skipped: 0, Time elapsed:
4.051 s - in org.apache.maven.surefire.its.jiras.Surefire926FailureWith2ProvidersIT
[2019-04-16T23:19:23.332Z] [INFO] Running org.apache.maven.surefire.its.jiras.Surefire930TestNgSuiteXmlIT
[2019-04-16T23:19:31.173Z] [INFO] Tests run: 1, Failures: 0, Errors: 0, Skipped: 0, Time elapsed:
6.597 s - in org.apache.maven.surefire.its.jiras.Surefire930TestNgSuiteXmlIT
[2019-04-16T23:19:31.173Z] [INFO] Running org.apache.maven.surefire.its.jiras.Surefire943ReportContentIT
[2019-04-16T23:19:56.166Z] [INFO] Tests run: 2, Failures: 0, Errors: 0, Skipped: 0, Time elapsed:
25.886 s - in org.apache.maven.surefire.its.jiras.Surefire943ReportContentIT
[2019-04-16T23:19:56.166Z] [INFO] Running org.apache.maven.surefire.its.jiras.Surefire946KillMainProcessInReusableForkIT
[2019-04-16T23:20:21.326Z] [INFO] Tests run: 3, Failures: 0, Errors: 0, Skipped: 0, Time elapsed:
22.668 s - in org.apache.maven.surefire.its.jiras.Surefire946KillMainProcessInReusableForkIT
[2019-04-16T23:20:21.326Z] [INFO] Running org.apache.maven.surefire.its.jiras.Surefire972BizarreNoClassDefIT
[2019-04-16T23:20:26.590Z] [INFO] Tests run: 1, Failures: 0, Errors: 0, Skipped: 0, Time elapsed:
7.625 s - in org.apache.maven.surefire.its.jiras.Surefire972BizarreNoClassDefIT
[2019-04-16T23:20:26.590Z] [INFO] Running org.apache.maven.surefire.its.jiras.Surefire975DefaultVMEncodingIT
[2019-04-16T23:20:31.851Z] [INFO] Tests run: 1, Failures: 0, Errors: 0, Skipped: 0, Time elapsed:
5.665 s - in org.apache.maven.surefire.its.jiras.Surefire975DefaultVMEncodingIT
[2019-04-16T23:20:31.851Z] [INFO] Running org.apache.maven.surefire.its.jiras.Surefire979WrongClassLoaderIT
[2019-04-16T23:20:38.319Z] [INFO] Tests run: 1, Failures: 0, Errors: 0, Skipped: 0, Time elapsed:
5.425 s - in org.apache.maven.surefire.its.jiras.Surefire979WrongClassLoaderIT
[2019-04-16T23:20:38.319Z] [INFO] Running org.apache.maven.surefire.its.jiras.Surefire985ParameterizedRunnerAndCategoriesIT
[2019-04-16T23:20:42.694Z] [INFO] Tests run: 1, Failures: 0, Errors: 0, Skipped: 0, Time elapsed:
5.341 s - in org.apache.maven.surefire.its.jiras.Surefire985ParameterizedRunnerAndCategoriesIT
[2019-04-16T23:20:42.694Z] [INFO] Running org.apache.maven.surefire.its.jiras.Surefire995CategoryInheritanceIT
[2019-04-16T23:21:07.602Z] [INFO] Tests run: 5, Failures: 0, Errors: 0, Skipped: 0, Time elapsed:
25.109 s - in org.apache.maven.surefire.its.jiras.Surefire995CategoryInheritanceIT
[2019-04-16T23:21:08.316Z] [INFO] 
[2019-04-16T23:21:08.316Z] [INFO] Results:
[2019-04-16T23:21:08.316Z] [INFO] 
[2019-04-16T23:21:08.316Z] [WARNING] Tests run: 792, Failures: 0, Errors: 0, Skipped: 135
[2019-04-16T23:21:08.316Z] [INFO] 
[2019-04-16T23:21:08.316Z] [INFO] 
[2019-04-16T23:21:08.316Z] [INFO] --- maven-checkstyle-plugin:3.0.0:check (checkstyle-check)
@ surefire-its ---
[2019-04-16T23:21:09.030Z] [INFO] 
[2019-04-16T23:21:09.030Z] [INFO] --- maven-failsafe-plugin:3.0.0-M3:verify (default) @ surefire-its
---
[2019-04-16T23:21:09.030Z] [INFO] Failsafe report directory: /home/jenkins/jenkins-slave/workspace/_maven-surefire_release_3.0.0-M6@2/surefire-its/target/failsafe-reports
[2019-04-16T23:21:09.030Z] [INFO] 
[2019-04-16T23:21:09.030Z] [INFO] --- maven-install-plugin:2.5.2:install (default-install)
@ surefire-its ---
[2019-04-16T23:21:09.030Z] [INFO] Skipping artifact installation
[2019-04-16T23:21:09.030Z] [INFO] 
[2019-04-16T23:21:09.030Z] [INFO] --- jacoco-maven-plugin:0.8.3:report (default-cli) @ surefire-its
---
[2019-04-16T23:21:09.030Z] [INFO] Loading execution data file /home/jenkins/jenkins-slave/workspace/_maven-surefire_release_3.0.0-M6@2/surefire-its/target/jacoco.exec
[2019-04-16T23:21:09.030Z] [INFO] Analyzed bundle 'Maven Surefire Integration Tests' with
0 classes
[2019-04-16T23:21:09.030Z] [INFO] ------------------------------------------------------------------------
[2019-04-16T23:21:09.030Z] [INFO] Reactor Summary for Apache Maven Surefire 3.0.0-SNAPSHOT:
[2019-04-16T23:21:09.030Z] [INFO] 
[2019-04-16T23:21:09.030Z] [INFO] Apache Maven Surefire .............................. SUCCESS
[ 19.490 s]
[2019-04-16T23:21:09.030Z] [INFO] SureFire Logger API ................................ SUCCESS
[  4.710 s]
[2019-04-16T23:21:09.030Z] [INFO] SureFire API ....................................... SUCCESS
[ 14.863 s]
[2019-04-16T23:21:09.030Z] [INFO] SureFire Booter .................................... SUCCESS
[ 15.064 s]
[2019-04-16T23:21:09.030Z] [INFO] Maven Surefire Test-Grouping Support ............... SUCCESS
[  6.477 s]
[2019-04-16T23:21:09.030Z] [INFO] SureFire Providers ................................. SUCCESS
[  1.000 s]
[2019-04-16T23:21:09.030Z] [INFO] Shared JUnit3 Provider Code ........................ SUCCESS
[  4.403 s]
[2019-04-16T23:21:09.030Z] [INFO] Shared Java 5 Provider Base ........................ SUCCESS
[  5.297 s]
[2019-04-16T23:21:09.030Z] [INFO] Shared JUnit4 Provider Code ........................ SUCCESS
[  5.432 s]
[2019-04-16T23:21:09.030Z] [INFO] Shared JUnit48 Provider Code ....................... SUCCESS
[  6.204 s]
[2019-04-16T23:21:09.030Z] [INFO] SureFire JUnit Runner .............................. SUCCESS
[  4.724 s]
[2019-04-16T23:21:09.030Z] [INFO] SureFire JUnit4 Runner ............................. SUCCESS
[  5.056 s]
[2019-04-16T23:21:09.030Z] [INFO] Maven Surefire Common .............................. SUCCESS
[ 42.466 s]
[2019-04-16T23:21:09.030Z] [INFO] SureFire JUnitCore Runner .......................... SUCCESS
[02:22 min]
[2019-04-16T23:21:09.030Z] [INFO] SureFire JUnit Platform Runner ..................... SUCCESS
[ 11.555 s]
[2019-04-16T23:21:09.030Z] [INFO] SureFire TestNG Utils .............................. SUCCESS
[  4.977 s]
[2019-04-16T23:21:09.030Z] [INFO] SureFire TestNG Runner ............................. SUCCESS
[  5.420 s]
[2019-04-16T23:21:09.030Z] [INFO] ShadeFire JUnit3 Provider .......................... SUCCESS
[  1.698 s]
[2019-04-16T23:21:09.030Z] [INFO] Surefire Report Parser ............................. SUCCESS
[  6.463 s]
[2019-04-16T23:21:09.030Z] [INFO] Maven Surefire Plugin .............................. SUCCESS
[ 11.405 s]
[2019-04-16T23:21:09.030Z] [INFO] Maven Failsafe Plugin .............................. SUCCESS
[01:05 min]
[2019-04-16T23:21:09.030Z] [INFO] Maven Surefire Report Plugin ....................... SUCCESS
[ 17.174 s]
[2019-04-16T23:21:09.030Z] [INFO] Maven Surefire Integration Tests ................... SUCCESS
[  01:14 h]
[2019-04-16T23:21:09.030Z] [INFO] ------------------------------------------------------------------------
[2019-04-16T23:21:09.030Z] [INFO] BUILD SUCCESS
[2019-04-16T23:21:09.030Z] [INFO] ------------------------------------------------------------------------
[2019-04-16T23:21:09.030Z] [INFO] Total time:  01:21 h
[2019-04-16T23:21:09.030Z] [INFO] Finished at: 2019-04-16T23:21:08Z
[2019-04-16T23:21:09.030Z] [INFO] ------------------------------------------------------------------------
[Pipeline] }
[Pipeline] // withEnv
[Pipeline] }
[Pipeline] // stage
[Pipeline] openTasks
[2019-04-16T23:21:10.786Z] [TASKS] Scanning folder '/home/jenkins/jenkins-slave/workspace/_maven-surefire_release_3.0.0-M6@2'
for files matching the pattern '**/maven-failsafe-plugin/src/main/java,**/maven-surefire-common/src/main/java,**/maven-surefire-plugin/src/main/java,**/maven-surefire-report-plugin/src/main/java,**/surefire-api/src/main/java,**/surefire-booter/src/main/java,**/surefire-grouper/src/main/java,**/surefire-its/src/main/java,**/surefire-logger-api/src/main/java,**/surefire-providers/**/src/main/java,**/surefire-report-parser/src/main/java'
- excludes: null
[2019-04-16T23:21:10.786Z] [TASKS] Found 0 files to scan for tasks
[2019-04-16T23:21:10.786Z] [TASKS] Found 0 open tasks.
[2019-04-16T23:21:10.786Z] Skipping warnings blame since pipelines do not have an SCM link.%n
[Pipeline] jacoco
[2019-04-16T23:21:10.996Z] [JaCoCo plugin] Collecting JaCoCo coverage data...
[2019-04-16T23:21:10.996Z] [JaCoCo plugin] **/*.exec;**/maven-failsafe-plugin/target/classes,**/maven-surefire-common/target/classes,**/maven-surefire-plugin/target/classes,**/maven-surefire-report-plugin/target/classes,**/surefire-api/target/classes,**/surefire-booter/target/classes,**/surefire-grouper/target/classes,**/surefire-its/target/classes,**/surefire-logger-api/target/classes,**/surefire-providers/**/target/classes,**/surefire-report-parser/target/classes;**/maven-failsafe-plugin/src/main/java,**/maven-surefire-common/src/main/java,**/maven-surefire-plugin/src/main/java,**/maven-surefire-report-plugin/src/main/java,**/surefire-api/src/main/java,**/surefire-booter/src/main/java,**/surefire-grouper/src/main/java,**/surefire-its/src/main/java,**/surefire-logger-api/src/main/java,**/surefire-providers/**/src/main/java,**/surefire-report-parser/src/main/java;
locations are configured
[2019-04-16T23:21:11.949Z] [JaCoCo plugin] Number of found exec files for pattern **/*.exec:
20
[2019-04-16T23:21:17.415Z] [JaCoCo plugin] Saving matched execfiles:  /home/jenkins/jenkins-slave/workspace/_maven-surefire_release_3.0.0-M6@2/maven-failsafe-plugin/target/jacoco.exec
/home/jenkins/jenkins-slave/workspace/_maven-surefire_release_3.0.0-M6@2/maven-surefire-common/target/jacoco.exec
/home/jenkins/jenkins-slave/workspace/_maven-surefire_release_3.0.0-M6@2/maven-surefire-plugin/target/jacoco.exec
/home/jenkins/jenkins-slave/workspace/_maven-surefire_release_3.0.0-M6@2/maven-surefire-report-plugin/target/jacoco.exec
/home/jenkins/jenkins-slave/workspace/_maven-surefire_release_3.0.0-M6@2/surefire-api/target/jacoco.exec
/home/jenkins/jenkins-slave/workspace/_maven-surefire_release_3.0.0-M6@2/surefire-booter/target/jacoco.exec
/home/jenkins/jenkins-slave/workspace/_maven-surefire_release_3.0.0-M6@2/surefire-grouper/target/jacoco.exec
/home/jenkins/jenkins-slave/workspace/_maven-surefire_release_3.0.0-M6@2/surefire-its/target/jacoco-it.exec
/home/jenkins/jenkins-slave/workspace/_maven-surefire_release_3.0.0-M6@2/surefire-its/target/jacoco.exec
/home/jenkins/jenkins-slave/workspace/_maven-surefire_release_3.0.0-M6@2/surefire-providers/common-java5/target/jacoco.exec
/home/jenkins/jenkins-slave/workspace/_maven-surefire_release_3.0.0-M6@2/surefire-providers/common-junit3/target/jacoco.exec
/home/jenkins/jenkins-slave/workspace/_maven-surefire_release_3.0.0-M6@2/surefire-providers/common-junit4/target/jacoco.exec
/home/jenkins/jenkins-slave/workspace/_maven-surefire_release_3.0.0-M6@2/surefire-providers/common-junit48/target/jacoco.exec
/home/jenkins/jenkins-slave/workspace/_maven-surefire_release_3.0.0-M6@2/surefire-providers/surefire-junit-platform/target/jacoco.exec
/home/jenkins/jenkins-slave/workspace/_maven-surefire_release_3.0.0-M6@2/surefire-providers/surefire-junit3/target/jacoco.exec
/home/jenkins/jenkins-slave/workspace/_maven-surefire_release_3.0.0-M6@2/surefire-providers/surefire-junit4/target/jacoco.exec
/home/jenkins/jenkins-slave/workspace/_maven-surefire_release_3.0.0-M6@2/surefire-providers/surefire-junit47/target/jacoco.exec
/home/jenkins/jenkins-slave/workspace/_maven-surefire_release_3.0.0-M6@2/surefire-providers/surefire-testng-utils/target/jacoco.exec
/home/jenkins/jenkins-slave/workspace/_maven-surefire_release_3.0.0-M6@2/surefire-providers/surefire-testng/target/jacoco.exec
/home/jenkins/jenkins-slave/workspace/_maven-surefire_release_3.0.0-M6@2/surefire-report-parser/target/jacoco.exec
[2019-04-16T23:21:17.584Z] [JaCoCo plugin] Saving matched class directories for class-pattern:
**/maven-failsafe-plugin/target/classes,**/maven-surefire-common/target/classes,**/maven-surefire-plugin/target/classes,**/maven-surefire-report-plugin/target/classes,**/surefire-api/target/classes,**/surefire-booter/target/classes,**/surefire-grouper/target/classes,**/surefire-its/target/classes,**/surefire-logger-api/target/classes,**/surefire-providers/**/target/classes,**/surefire-report-parser/target/classes:

[2019-04-16T23:21:18.203Z] [JaCoCo plugin]  - /home/jenkins/jenkins-slave/workspace/_maven-surefire_release_3.0.0-M6@2/maven-failsafe-plugin/target/classes
4 files
[2019-04-16T23:21:18.365Z] [JaCoCo plugin]  - /home/jenkins/jenkins-slave/workspace/_maven-surefire_release_3.0.0-M6@2/maven-surefire-common/target/classes
136 files
[2019-04-16T23:21:18.534Z] [JaCoCo plugin]  - /home/jenkins/jenkins-slave/workspace/_maven-surefire_release_3.0.0-M6@2/maven-surefire-plugin/target/classes
2 files
[2019-04-16T23:21:18.748Z] [JaCoCo plugin]  - /home/jenkins/jenkins-slave/workspace/_maven-surefire_release_3.0.0-M6@2/maven-surefire-report-plugin/target/classes
10 files
[2019-04-16T23:21:18.934Z] [JaCoCo plugin]  - /home/jenkins/jenkins-slave/workspace/_maven-surefire_release_3.0.0-M6@2/surefire-api/target/classes
109 files
[2019-04-16T23:21:19.108Z] [JaCoCo plugin]  - /home/jenkins/jenkins-slave/workspace/_maven-surefire_release_3.0.0-M6@2/surefire-booter/target/classes
38 files
[2019-04-16T23:21:19.321Z] [JaCoCo plugin]  - /home/jenkins/jenkins-slave/workspace/_maven-surefire_release_3.0.0-M6@2/surefire-grouper/target/classes
17 files
[2019-04-16T23:21:19.482Z] [JaCoCo plugin]  - /home/jenkins/jenkins-slave/workspace/_maven-surefire_release_3.0.0-M6@2/surefire-its/target/classes
0 files
[2019-04-16T23:21:19.643Z] [JaCoCo plugin]  - /home/jenkins/jenkins-slave/workspace/_maven-surefire_release_3.0.0-M6@2/surefire-logger-api/target/classes
6 files
[2019-04-16T23:21:19.803Z] [JaCoCo plugin]  - /home/jenkins/jenkins-slave/workspace/_maven-surefire_release_3.0.0-M6@2/surefire-providers/common-java5/target/classes
5 files
[2019-04-16T23:21:19.971Z] [JaCoCo plugin]  - /home/jenkins/jenkins-slave/workspace/_maven-surefire_release_3.0.0-M6@2/surefire-providers/common-junit3/target/classes
2 files
[2019-04-16T23:21:20.136Z] [JaCoCo plugin]  - /home/jenkins/jenkins-slave/workspace/_maven-surefire_release_3.0.0-M6@2/surefire-providers/common-junit4/target/classes
13 files
[2019-04-16T23:21:20.300Z] [JaCoCo plugin]  - /home/jenkins/jenkins-slave/workspace/_maven-surefire_release_3.0.0-M6@2/surefire-providers/common-junit48/target/classes
10 files
[2019-04-16T23:21:20.464Z] [JaCoCo plugin]  - /home/jenkins/jenkins-slave/workspace/_maven-surefire_release_3.0.0-M6@2/surefire-providers/surefire-junit-platform/target/classes
5 files
[2019-04-16T23:21:20.626Z] [JaCoCo plugin]  - /home/jenkins/jenkins-slave/workspace/_maven-surefire_release_3.0.0-M6@2/surefire-providers/surefire-junit3/target/classes
7 files
[2019-04-16T23:21:20.820Z] [JaCoCo plugin]  - /home/jenkins/jenkins-slave/workspace/_maven-surefire_release_3.0.0-M6@2/surefire-providers/surefire-junit4/target/classes
4 files
[2019-04-16T23:21:20.980Z] [JaCoCo plugin]  - /home/jenkins/jenkins-slave/workspace/_maven-surefire_release_3.0.0-M6@2/surefire-providers/surefire-junit47/target/classes
53 files
[2019-04-16T23:21:21.156Z] [JaCoCo plugin]  - /home/jenkins/jenkins-slave/workspace/_maven-surefire_release_3.0.0-M6@2/surefire-providers/surefire-testng-utils/target/classes
6 files
[2019-04-16T23:21:21.318Z] [JaCoCo plugin]  - /home/jenkins/jenkins-slave/workspace/_maven-surefire_release_3.0.0-M6@2/surefire-providers/surefire-testng/target/classes
23 files
[2019-04-16T23:21:22.280Z] [JaCoCo plugin]  - /home/jenkins/jenkins-slave/workspace/_maven-surefire_release_3.0.0-M6@2/surefire-report-parser/target/classes
4 files
[2019-04-16T23:21:22.280Z] [JaCoCo plugin] Saving matched source directories for source-pattern:
**/maven-failsafe-plugin/src/main/java,**/maven-surefire-common/src/main/java,**/maven-surefire-plugin/src/main/java,**/maven-surefire-report-plugin/src/main/java,**/surefire-api/src/main/java,**/surefire-booter/src/main/java,**/surefire-grouper/src/main/java,**/surefire-its/src/main/java,**/surefire-logger-api/src/main/java,**/surefire-providers/**/src/main/java,**/surefire-report-parser/src/main/java:

[2019-04-16T23:21:22.280Z] [JaCoCo plugin] Source Inclusions: **/*.java
[2019-04-16T23:21:22.446Z] [JaCoCo plugin] Source Exclusions: 
[2019-04-16T23:21:22.788Z] [JaCoCo plugin] - /home/jenkins/jenkins-slave/workspace/_maven-surefire_release_3.0.0-M6@2/maven-failsafe-plugin/src/main/java
3 files
[2019-04-16T23:21:22.947Z] [JaCoCo plugin] - /home/jenkins/jenkins-slave/workspace/_maven-surefire_release_3.0.0-M6@2/maven-surefire-common/src/main/java
78 files
[2019-04-16T23:21:23.112Z] [JaCoCo plugin] - /home/jenkins/jenkins-slave/workspace/_maven-surefire_release_3.0.0-M6@2/maven-surefire-plugin/src/main/java
1 files
[2019-04-16T23:21:23.315Z] [JaCoCo plugin] - /home/jenkins/jenkins-slave/workspace/_maven-surefire_release_3.0.0-M6@2/maven-surefire-report-plugin/src/main/java
7 files
[2019-04-16T23:21:23.496Z] [JaCoCo plugin] - /home/jenkins/jenkins-slave/workspace/_maven-surefire_release_3.0.0-M6@2/surefire-api/src/main/java
83 files
[2019-04-16T23:21:23.656Z] [JaCoCo plugin] - /home/jenkins/jenkins-slave/workspace/_maven-surefire_release_3.0.0-M6@2/surefire-booter/src/main/java
23 files
[2019-04-16T23:21:23.816Z] [JaCoCo plugin] - /home/jenkins/jenkins-slave/workspace/_maven-surefire_release_3.0.0-M6@2/surefire-grouper/src/main/java
6 files
[2019-04-16T23:21:23.976Z] [JaCoCo plugin] - /home/jenkins/jenkins-slave/workspace/_maven-surefire_release_3.0.0-M6@2/surefire-logger-api/src/main/java
6 files
[2019-04-16T23:21:24.135Z] [JaCoCo plugin] - /home/jenkins/jenkins-slave/workspace/_maven-surefire_release_3.0.0-M6@2/surefire-providers/common-java5/src/main/java
5 files
[2019-04-16T23:21:24.299Z] [JaCoCo plugin] - /home/jenkins/jenkins-slave/workspace/_maven-surefire_release_3.0.0-M6@2/surefire-providers/common-junit3/src/main/java
2 files
[2019-04-16T23:21:24.462Z] [JaCoCo plugin] - /home/jenkins/jenkins-slave/workspace/_maven-surefire_release_3.0.0-M6@2/surefire-providers/common-junit4/src/main/java
10 files
[2019-04-16T23:21:24.621Z] [JaCoCo plugin] - /home/jenkins/jenkins-slave/workspace/_maven-surefire_release_3.0.0-M6@2/surefire-providers/common-junit48/src/main/java
10 files
[2019-04-16T23:21:24.786Z] [JaCoCo plugin] - /home/jenkins/jenkins-slave/workspace/_maven-surefire_release_3.0.0-M6@2/surefire-providers/surefire-junit-platform/src/main/java
4 files
[2019-04-16T23:21:24.945Z] [JaCoCo plugin] - /home/jenkins/jenkins-slave/workspace/_maven-surefire_release_3.0.0-M6@2/surefire-providers/surefire-junit3/src/main/java
6 files
[2019-04-16T23:21:25.136Z] [JaCoCo plugin] - /home/jenkins/jenkins-slave/workspace/_maven-surefire_release_3.0.0-M6@2/surefire-providers/surefire-junit4/src/main/java
2 files
[2019-04-16T23:21:25.295Z] [JaCoCo plugin] - /home/jenkins/jenkins-slave/workspace/_maven-surefire_release_3.0.0-M6@2/surefire-providers/surefire-junit47/src/main/java
39 files
[2019-04-16T23:21:25.466Z] [JaCoCo plugin] - /home/jenkins/jenkins-slave/workspace/_maven-surefire_release_3.0.0-M6@2/surefire-providers/surefire-testng-utils/src/main/java
6 files
[2019-04-16T23:21:25.628Z] [JaCoCo plugin] - /home/jenkins/jenkins-slave/workspace/_maven-surefire_release_3.0.0-M6@2/surefire-providers/surefire-testng/src/main/java
17 files
[2019-04-16T23:21:25.628Z] [JaCoCo plugin] - /home/jenkins/jenkins-slave/workspace/_maven-surefire_release_3.0.0-M6@2/surefire-report-parser/src/main/java
4 files
[2019-04-16T23:21:25.628Z] [JaCoCo plugin] Loading inclusions files..
[2019-04-16T23:21:25.628Z] [JaCoCo plugin] inclusions: []
[2019-04-16T23:21:25.628Z] [JaCoCo plugin] exclusions: []
[2019-04-16T23:21:25.710Z] [JaCoCo plugin] Thresholds: JacocoHealthReportThresholds [minClass=0,
maxClass=0, minMethod=0, maxMethod=0, minLine=0, maxLine=0, minBranch=0, maxBranch=0, minInstruction=0,
maxInstruction=0, minComplexity=0, maxComplexity=0]
[2019-04-16T23:21:25.710Z] [JaCoCo plugin] Publishing the results..
[2019-04-16T23:21:25.779Z] [JaCoCo plugin] Loading packages..
[2019-04-16T23:21:25.784Z] [JaCoCo plugin] Done.
[2019-04-16T23:21:25.784Z] [JaCoCo plugin] Overall coverage: class: 65, method: 48, line:
48, branch: 39, instruction: 47
[Pipeline] junit
[2019-04-16T23:21:25.966Z] Recording test results
[Pipeline] cleanWs
[2019-04-16T23:21:28.294Z] [WS-CLEANUP] Deleting project workspace...
[2019-04-16T23:21:28.294Z] [WS-CLEANUP] Deferred wipeout is used...
[2019-04-16T23:21:28.615Z] [WS-CLEANUP] done
[Pipeline] }
[Pipeline] // ws
[Pipeline] }
[Pipeline] // timestamps
[Pipeline] }
[Pipeline] // node
[Pipeline] }
[Pipeline] // parallel
[Pipeline] echo
hudson.AbortException: hudson.AbortException: Error cloning remote repo 'origin'
[Pipeline] echo
Build result: FAILURE
[Pipeline] jiraIssueSelector
[Pipeline] emailext
Mime
  • Unnamed multipart/mixed (inline, None, 0 bytes)
View raw message