maven-notifications mailing list archives

Site index · List index
Message view « Date » · « Thread »
Top « Date » · « Thread »
From Apache Jenkins Server <jenk...@builds.apache.org>
Subject Build unstable in Jenkins: Maven TLP » maven-shade-plugin » MSHADE-306 #6
Date Thu, 16 May 2019 12:34:51 GMT
See https://builds.apache.org/job/maven-box/job/maven-shade-plugin/job/MSHADE-306/6/

No changes.

6 tests failed.
FAILED:  org.apache.maven.plugins.shade.DefaultShaderTest.windows-jdk7-m3.5.x_build / Build
windows-jdk7-m3.5.x_build / testOverlappingResourcesAreLogged

Error Message:
[Processing JAR src\test\jars\test-project-1.0-SNAPSHOT.jar, Processing JAR src\test\jars\plexus-utils-1.4.1.jar,
We have a duplicate META-INF/MANIFEST.MF in src\test\jars\plexus-utils-1.4.1.jar]

Stack Trace:
junit.framework.AssertionFailedError: [Processing JAR src\test\jars\test-project-1.0-SNAPSHOT.jar,
Processing JAR src\test\jars\plexus-utils-1.4.1.jar, We have a duplicate META-INF/MANIFEST.MF
in src\test\jars\plexus-utils-1.4.1.jar]
	at org.apache.maven.plugins.shade.DefaultShaderTest.testOverlappingResourcesAreLogged(DefaultShaderTest.java:122)


FAILED:  org.apache.maven.plugins.shade.DefaultShaderTest.windows-jdk7-m3.2.x_build / Build
windows-jdk7-m3.2.x_build / testOverlappingResourcesAreLogged

Error Message:
[Processing JAR src\test\jars\test-project-1.0-SNAPSHOT.jar, Processing JAR src\test\jars\plexus-utils-1.4.1.jar,
We have a duplicate META-INF/MANIFEST.MF in src\test\jars\plexus-utils-1.4.1.jar]

Stack Trace:
junit.framework.AssertionFailedError: [Processing JAR src\test\jars\test-project-1.0-SNAPSHOT.jar,
Processing JAR src\test\jars\plexus-utils-1.4.1.jar, We have a duplicate META-INF/MANIFEST.MF
in src\test\jars\plexus-utils-1.4.1.jar]
	at org.apache.maven.plugins.shade.DefaultShaderTest.testOverlappingResourcesAreLogged(DefaultShaderTest.java:122)


FAILED:  org.apache.maven.plugins.shade.DefaultShaderTest.windows-jdk7-m3.3.x_build / Build
windows-jdk7-m3.3.x_build / testOverlappingResourcesAreLogged

Error Message:
[Processing JAR src\test\jars\test-project-1.0-SNAPSHOT.jar, Processing JAR src\test\jars\plexus-utils-1.4.1.jar,
We have a duplicate META-INF/MANIFEST.MF in src\test\jars\plexus-utils-1.4.1.jar]

Stack Trace:
junit.framework.AssertionFailedError: [Processing JAR src\test\jars\test-project-1.0-SNAPSHOT.jar,
Processing JAR src\test\jars\plexus-utils-1.4.1.jar, We have a duplicate META-INF/MANIFEST.MF
in src\test\jars\plexus-utils-1.4.1.jar]
	at org.apache.maven.plugins.shade.DefaultShaderTest.testOverlappingResourcesAreLogged(DefaultShaderTest.java:122)


FAILED:  org.apache.maven.plugins.shade.DefaultShaderTest.windows-jdk11-m3.6.x_build / Build
windows-jdk11-m3.6.x_build / testOverlappingResourcesAreLogged

Error Message:
[Processing JAR src\test\jars\test-project-1.0-SNAPSHOT.jar, Processing JAR src\test\jars\plexus-utils-1.4.1.jar,
We have a duplicate META-INF/MANIFEST.MF in src\test\jars\plexus-utils-1.4.1.jar]

Stack Trace:
junit.framework.AssertionFailedError: [Processing JAR src\test\jars\test-project-1.0-SNAPSHOT.jar,
Processing JAR src\test\jars\plexus-utils-1.4.1.jar, We have a duplicate META-INF/MANIFEST.MF
in src\test\jars\plexus-utils-1.4.1.jar]
	at org.apache.maven.plugins.shade.DefaultShaderTest.testOverlappingResourcesAreLogged(DefaultShaderTest.java:122)


FAILED:  org.apache.maven.plugins.shade.DefaultShaderTest.windows-jdk8-m3.6.x_build / Build
windows-jdk8-m3.6.x_build / testOverlappingResourcesAreLogged

Error Message:
[Processing JAR src\test\jars\test-project-1.0-SNAPSHOT.jar, Processing JAR src\test\jars\plexus-utils-1.4.1.jar,
We have a duplicate META-INF/MANIFEST.MF in src\test\jars\plexus-utils-1.4.1.jar]

Stack Trace:
junit.framework.AssertionFailedError: [Processing JAR src\test\jars\test-project-1.0-SNAPSHOT.jar,
Processing JAR src\test\jars\plexus-utils-1.4.1.jar, We have a duplicate META-INF/MANIFEST.MF
in src\test\jars\plexus-utils-1.4.1.jar]
	at org.apache.maven.plugins.shade.DefaultShaderTest.testOverlappingResourcesAreLogged(DefaultShaderTest.java:122)


FAILED:  org.apache.maven.plugins.shade.DefaultShaderTest.windows-jdk12-m3.6.x_build / Build
windows-jdk12-m3.6.x_build / testOverlappingResourcesAreLogged

Error Message:
[Processing JAR src\test\jars\test-project-1.0-SNAPSHOT.jar, Processing JAR src\test\jars\plexus-utils-1.4.1.jar,
We have a duplicate META-INF/MANIFEST.MF in src\test\jars\plexus-utils-1.4.1.jar]

Stack Trace:
junit.framework.AssertionFailedError: [Processing JAR src\test\jars\test-project-1.0-SNAPSHOT.jar,
Processing JAR src\test\jars\plexus-utils-1.4.1.jar, We have a duplicate META-INF/MANIFEST.MF
in src\test\jars\plexus-utils-1.4.1.jar]
	at org.apache.maven.plugins.shade.DefaultShaderTest.testOverlappingResourcesAreLogged(DefaultShaderTest.java:122)




Build log:
[...truncated 5607 lines...]
[Pipeline] // dir
[Pipeline] }
[TASKS] Scanning folder 'f:\jenkins\jenkins-slave\workspace\ox_maven-shade-plugin_MSHADE-306@2@2'
for files matching the pattern 'windows-jdk11-m3.6.x_build\src\main\java\**\*' - excludes:
null
[TASKS] Found 32 files to scan for tasks
[TASKS] Found 2 open tasks.
Skipping warnings blame since pipelines do not have an SCM link.%n
[withMaven] junitPublisher - Archive test results for Maven artifact org.apache.maven.plugins:maven-shade-plugin:maven-plugin:3.2.2-SNAPSHOT
generated by maven-surefire-plugin:test (default-test): linux-jdk11-m3.6.x_build/target/surefire-reports/*.xml
Recording test results
[TASKS] Computing warning deltas based on reference build #5
[withMaven] artifactsPublisher - Archive artifact linux-jdk12-m3.6.x_build/pom.xml under org/apache/maven/plugins/maven-shade-plugin/3.2.2-SNAPSHOT/maven-shade-plugin-3.2.2-SNAPSHOT.pom
[withMaven] artifactsPublisher - Archive artifact linux-jdk12-m3.6.x_build/target/maven-shade-plugin-3.2.2-SNAPSHOT.jar
under org/apache/maven/plugins/maven-shade-plugin/3.2.2-SNAPSHOT/maven-shade-plugin-3.2.2-SNAPSHOT.jar
[withMaven] artifactsPublisher - Archive artifact linux-jdk12-m3.6.x_build/target/maven-shade-plugin-3.2.2-SNAPSHOT-tests.jar
under org/apache/maven/plugins/maven-shade-plugin/3.2.2-SNAPSHOT/maven-shade-plugin-3.2.2-SNAPSHOT-tests.jar
[withMaven] junitPublisher - Archive test results for Maven artifact org.apache.maven.plugins:maven-shade-plugin:maven-plugin:3.2.2-SNAPSHOT
generated by maven-surefire-plugin:test (default-test): linux-jdk12-m3.6.x_build/target/surefire-reports/*.xml
Recording test results
[withMaven] invokerPublisher - Archive invoker results for Maven artifact MavenArtifact{org.apache.maven.plugins:maven-shade-plugin:maven-plugin:3.2.2-SNAPSHOT(version:
3.2.2-SNAPSHOT, snapshot:false) } generated by PluginInvocation{org.apache.maven.plugins:maven-invoker-plugin:3.1.0@integration-test
 integration-test}: windows-jdk11-m3.6.x_build\target\invoker-reports\*.xml
[withMaven] openTasksPublisher - Scan Tasks for Maven artifact org.apache.maven.plugins:maven-shade-plugin:maven-plugin:3.2.2-SNAPSHOT
in source directory linux-jdk11-m3.6.x_build/src/main/java
[TASKS] Scanning folder '/home/jenkins/jenkins-slave/workspace/ox_maven-shade-plugin_MSHADE-306@3'
for files matching the pattern 'linux-jdk11-m3.6.x_build/src/main/java/**/*' - excludes: null
[TASKS] Found 32 files to scan for tasks
[TASKS] Found 2 open tasks.
Skipping warnings blame since pipelines do not have an SCM link.%n
[TASKS] Computing warning deltas based on reference build #5
[withMaven] invokerPublisher - Archive invoker results for Maven artifact MavenArtifact{org.apache.maven.plugins:maven-shade-plugin:maven-plugin:3.2.2-SNAPSHOT(version:
3.2.2-SNAPSHOT, snapshot:false) } generated by PluginInvocation{org.apache.maven.plugins:maven-invoker-plugin:3.1.0@integration-test
 integration-test}: linux-jdk11-m3.6.x_build/target/invoker-reports/*.xml
[INFO]           reloc-abs-resource-path-exclude\pom.xml .......... SUCCESS (8.0 s)
[INFO] Building: reloc-anno\pom.xml
[withMaven] openTasksPublisher - Scan Tasks for Maven artifact org.apache.maven.plugins:maven-shade-plugin:maven-plugin:3.2.2-SNAPSHOT
in source directory linux-jdk12-m3.6.x_build/src/main/java
[withMaven] Publishers: Generated Artifacts Publisher: 171 ms, Junit Publisher: 880 ms, Open
Task Scanner Publisher: 131 ms, Invoker Publisher: 18500 ms, Pipeline Graph Publisher: 1 ms
[Pipeline] // withMaven
[TASKS] Scanning folder '/home/jenkins/jenkins-slave/workspace/ox_maven-shade-plugin_MSHADE-306@2@2'
for files matching the pattern 'linux-jdk12-m3.6.x_build/src/main/java/**/*' - excludes: null
[TASKS] Found 32 files to scan for tasks
[TASKS] Found 2 open tasks.
Skipping warnings blame since pipelines do not have an SCM link.%n
[TASKS] Computing warning deltas based on reference build #5
[Pipeline] cleanWs
[WS-CLEANUP] Deleting project workspace...
[WS-CLEANUP] Deferred wipeout is used...
[withMaven] invokerPublisher - Archive invoker results for Maven artifact MavenArtifact{org.apache.maven.plugins:maven-shade-plugin:maven-plugin:3.2.2-SNAPSHOT(version:
3.2.2-SNAPSHOT, snapshot:false) } generated by PluginInvocation{org.apache.maven.plugins:maven-invoker-plugin:3.1.0@integration-test
 integration-test}: linux-jdk12-m3.6.x_build/target/invoker-reports/*.xml
[WS-CLEANUP] done
[Pipeline] }
[Pipeline] // stage
[Pipeline] }
[INFO]           reloc-anno\pom.xml ............................... SUCCESS (7.3 s)
[INFO] Building: reloc-class-from-string-pool\pom.xml
[Pipeline] // ws
[Pipeline] }
[Pipeline] // node
[Pipeline] }
[INFO]           reloc-anno\pom.xml ............................... SUCCESS (7.1 s)
[INFO] Building: reloc-class-from-string-pool\pom.xml
[INFO]           reloc-class-from-string-pool\pom.xml ............. SUCCESS (7.5 s)
[INFO] Building: reloc-enum-ref-from-anno\pom.xml
[withMaven] Publishers: Generated Artifacts Publisher: 199 ms, Junit Publisher: 882 ms, Open
Task Scanner Publisher: 125 ms, Invoker Publisher: 13192 ms
[Pipeline] // withMaven
[Pipeline] cleanWs
[WS-CLEANUP] Deleting project workspace...
[WS-CLEANUP] Deferred wipeout is used...
[WS-CLEANUP] done
[Pipeline] }
[Pipeline] // stage
[Pipeline] }
[Pipeline] // ws
[Pipeline] }
[Pipeline] // node
[Pipeline] }
[withMaven] Publishers: Generated Artifacts Publisher: 193 ms, Junit Publisher: 1668 ms, Open
Task Scanner Publisher: 142 ms, Invoker Publisher: 13225 ms, Pipeline Graph Publisher: 1 ms
[Pipeline] // withMaven
[Pipeline] cleanWs
[WS-CLEANUP] Deleting project workspace...
[WS-CLEANUP] Deferred wipeout is used...
[WS-CLEANUP] done
[Pipeline] }
[Pipeline] // stage
[Pipeline] }
[Pipeline] // ws
[Pipeline] }
[INFO]           reloc-class-from-string-pool\pom.xml ............. SUCCESS (6.8 s)
[INFO] Building: reloc-enum-ref-from-anno\pom.xml
[Pipeline] // node
[Pipeline] }
[INFO]           reloc-enum-ref-from-anno\pom.xml ................. SUCCESS (7.4 s)
[INFO] Building: reloc-includes-excludes\pom.xml
[INFO]           reloc-enum-ref-from-anno\pom.xml ................. SUCCESS (6.9 s)
[INFO] Building: reloc-includes-excludes\pom.xml
[INFO] run post-build script verify.bsh
[INFO]           reloc-includes-excludes\pom.xml .................. SUCCESS (7.6 s)
[INFO] Building: rerun-with-reloc\pom.xml
[INFO] run post-build script verify.bsh
[INFO]           reloc-includes-excludes\pom.xml .................. SUCCESS (6.8 s)
[INFO] Building: rerun-with-reloc\pom.xml
[INFO]           rerun-with-reloc\pom.xml ......................... SUCCESS (8.2 s)
[INFO] Building: rerun-without-reloc\pom.xml
[INFO]           rerun-with-reloc\pom.xml ......................... SUCCESS (7.3 s)
[INFO] Building: rerun-without-reloc\pom.xml
[INFO]           rerun-without-reloc\pom.xml ...................... SUCCESS (7.4 s)
[INFO] Building: services-resource-transformer\pom.xml
[INFO]           rerun-without-reloc\pom.xml ...................... SUCCESS (7.2 s)
[INFO] Building: services-resource-transformer\pom.xml
[withMaven] Publishers: Generated Artifacts Publisher: 977 ms, Junit Publisher: 5821 ms, Open
Task Scanner Publisher: 479 ms, Invoker Publisher: 44422 ms, Pipeline Graph Publisher: 2 ms
[Pipeline] // withMaven
[Pipeline] cleanWs
[WS-CLEANUP] Deleting project workspace...
[WS-CLEANUP] Deferred wipeout is used...
[WS-CLEANUP] done
[Pipeline] }
[Pipeline] // stage
[Pipeline] }
[Pipeline] // ws
[Pipeline] }
[Pipeline] // node
[Pipeline] }
[INFO] run post-build script verify.bsh
[INFO]           services-resource-transformer\pom.xml ............ SUCCESS (7.2 s)
[INFO] Building: services-resource-transformer-with-reloc-includes-excludes\pom.xml
[INFO] run post-build script verify.bsh
[INFO]           services-resource-transformer\pom.xml ............ SUCCESS (6.6 s)
[INFO] Building: services-resource-transformer-with-reloc-includes-excludes\pom.xml
[INFO] run post-build script verify.bsh
[INFO]           services-resource-transformer-with-reloc-includes-excludes\pom.xml SUCCESS
(7.2 s)
[INFO] Building: shadePomDependency\pom.xml
[INFO] run post-build script verify.bsh
[INFO]           services-resource-transformer-with-reloc-includes-excludes\pom.xml SUCCESS
(6.7 s)
[INFO] Building: shadePomDependency\pom.xml
[INFO]           shadePomDependency\pom.xml ....................... SUCCESS (8.4 s)
[INFO] Building: shading-with-java-10-sources\pom.xml
[INFO]           shadePomDependency\pom.xml ....................... SUCCESS (7.8 s)
[INFO] Building: shading-with-java-10-sources\pom.xml
[INFO]           shading-with-java-10-sources\pom.xml ............. SKIPPED due to JRE version
[INFO] Building: shading-with-java-11-sources\pom.xml
[INFO]           shading-with-java-11-sources\pom.xml ............. SKIPPED due to JRE version
[INFO] Building: shading-with-java-8-sources\pom.xml
[INFO] run post-build script verify.groovy
[INFO]           shading-with-java-8-sources\pom.xml .............. SUCCESS (9.2 s)
[INFO] Building: users-shader-impl\pom.xml
[INFO] run post-build script verify.groovy
[INFO]           shading-with-java-10-sources\pom.xml ............. SUCCESS (10.2 s)
[INFO] Building: shading-with-java-11-sources\pom.xml
[INFO] run post-build script verify.groovy
[INFO]           users-shader-impl\pom.xml ........................ SUCCESS (7.8 s)
[INFO] Building: xml-transformer-ignores-dtd\pom.xml
[INFO] run post-build script verify.groovy
[INFO]           shading-with-java-11-sources\pom.xml ............. SUCCESS (10.5 s)
[INFO] Building: shading-with-java-8-sources\pom.xml
[INFO] run post-build script verify.bsh
[INFO]           xml-transformer-ignores-dtd\pom.xml .............. SUCCESS (5.8 s)
[INFO] 
[INFO] --- maven-checkstyle-plugin:3.0.0:check (checkstyle-check) @ maven-shade-plugin ---
[INFO] There are 3 errors reported by Checkstyle 6.18 with config/maven_checks.xml ruleset.
[INFO] Ignored 3 errors, 0 violation remaining.
[INFO] 
[INFO] --- maven-invoker-plugin:3.1.0:verify (integration-test) @ maven-shade-plugin ---
[INFO] -------------------------------------------------
[INFO] Build Summary:
[INFO]   Passed: 58, Failed: 0, Errors: 0, Skipped: 3
[INFO] -------------------------------------------------
[INFO] ------------------------------------------------------------------------
[INFO] BUILD SUCCESS
[INFO] ------------------------------------------------------------------------
[INFO] Total time:  08:12 min
[INFO] Finished at: 2019-05-16T05:34:08-07:00
[INFO] ------------------------------------------------------------------------
[INFO] [jenkins-event-spy] Generated F:\jenkins\jenkins-slave\workspace\ox_maven-shade-plugin_MSHADE-306@2@tmp\withMavendf8a29bd\maven-spy-20190516-052555-2024286442809810689581.log
Picked up JAVA_TOOL_OPTIONS: -Dmaven.ext.class.path="f:\jenkins\jenkins-slave\workspace\ox_maven-shade-plugin_MSHADE-306@2@tmp\withMavendf8a29bd\pipeline-maven-spy.jar"
-Dorg.jenkinsci.plugins.pipeline.maven.reportsFolder="f:\jenkins\jenkins-slave\workspace\ox_maven-shade-plugin_MSHADE-306@2@tmp\withMavendf8a29bd"

[Pipeline] }
[Pipeline] // dir
[Pipeline] }
[withMaven] artifactsPublisher - Archive artifact windows-jdk8-m3.6.x_build\pom.xml under
org\apache\maven\plugins\maven-shade-plugin\3.2.2-SNAPSHOT\maven-shade-plugin-3.2.2-SNAPSHOT.pom
[withMaven] artifactsPublisher - Archive artifact windows-jdk8-m3.6.x_build\target\maven-shade-plugin-3.2.2-SNAPSHOT.jar
under org\apache\maven\plugins\maven-shade-plugin\3.2.2-SNAPSHOT\maven-shade-plugin-3.2.2-SNAPSHOT.jar
[withMaven] artifactsPublisher - Archive artifact windows-jdk8-m3.6.x_build\target\maven-shade-plugin-3.2.2-SNAPSHOT-tests.jar
under org\apache\maven\plugins\maven-shade-plugin\3.2.2-SNAPSHOT\maven-shade-plugin-3.2.2-SNAPSHOT-tests.jar
[withMaven] junitPublisher - Archive test results for Maven artifact org.apache.maven.plugins:maven-shade-plugin:maven-plugin:3.2.2-SNAPSHOT
generated by maven-surefire-plugin:test (default-test): windows-jdk8-m3.6.x_build\target\surefire-reports\*.xml
Recording test results
[withMaven] openTasksPublisher - Scan Tasks for Maven artifact org.apache.maven.plugins:maven-shade-plugin:maven-plugin:3.2.2-SNAPSHOT
in source directory windows-jdk8-m3.6.x_build\src\main\java
[TASKS] Scanning folder 'f:\jenkins\jenkins-slave\workspace\ox_maven-shade-plugin_MSHADE-306@2'
for files matching the pattern 'windows-jdk8-m3.6.x_build\src\main\java\**\*' - excludes:
null
[TASKS] Found 32 files to scan for tasks
[TASKS] Found 2 open tasks.
Skipping warnings blame since pipelines do not have an SCM link.%n
[TASKS] Computing warning deltas based on reference build #5
[withMaven] invokerPublisher - Archive invoker results for Maven artifact MavenArtifact{org.apache.maven.plugins:maven-shade-plugin:maven-plugin:3.2.2-SNAPSHOT(version:
3.2.2-SNAPSHOT, snapshot:false) } generated by PluginInvocation{org.apache.maven.plugins:maven-invoker-plugin:3.1.0@integration-test
 integration-test}: windows-jdk8-m3.6.x_build\target\invoker-reports\*.xml
[INFO] run post-build script verify.groovy
[INFO]           shading-with-java-8-sources\pom.xml .............. SUCCESS (8.5 s)
[INFO] Building: users-shader-impl\pom.xml
[INFO] run post-build script verify.groovy
[INFO]           users-shader-impl\pom.xml ........................ SUCCESS (9.1 s)
[INFO] Building: xml-transformer-ignores-dtd\pom.xml
[INFO] run post-build script verify.bsh
[INFO]           xml-transformer-ignores-dtd\pom.xml .............. SUCCESS (7.0 s)
[INFO] 
[INFO] --- maven-checkstyle-plugin:3.0.0:check (checkstyle-check) @ maven-shade-plugin ---
[INFO] There are 3 errors reported by Checkstyle 6.18 with config/maven_checks.xml ruleset.
[INFO] Ignored 3 errors, 0 violation remaining.
[INFO] 
[INFO] --- maven-invoker-plugin:3.1.0:verify (integration-test) @ maven-shade-plugin ---
[INFO] -------------------------------------------------
[INFO] Build Summary:
[INFO]   Passed: 60, Failed: 0, Errors: 0, Skipped: 1
[INFO] -------------------------------------------------
[INFO] ------------------------------------------------------------------------
[INFO] BUILD SUCCESS
[INFO] ------------------------------------------------------------------------
[INFO] Total time:  08:43 min
[INFO] Finished at: 2019-05-16T12:34:29Z
[INFO] ------------------------------------------------------------------------
[INFO] [jenkins-event-spy] Generated F:\jenkins\jenkins-slave\workspace\ox_maven-shade-plugin_MSHADE-306@2@tmp\withMaven6449430d\maven-spy-20190516-122545-5522260664814650474766.log
[Pipeline] }
[Pipeline] // dir
[Pipeline] }
[withMaven] artifactsPublisher - Archive artifact windows-jdk12-m3.6.x_build\pom.xml under
org\apache\maven\plugins\maven-shade-plugin\3.2.2-SNAPSHOT\maven-shade-plugin-3.2.2-SNAPSHOT.pom
[withMaven] artifactsPublisher - Archive artifact windows-jdk12-m3.6.x_build\target\maven-shade-plugin-3.2.2-SNAPSHOT.jar
under org\apache\maven\plugins\maven-shade-plugin\3.2.2-SNAPSHOT\maven-shade-plugin-3.2.2-SNAPSHOT.jar
[withMaven] artifactsPublisher - Archive artifact windows-jdk12-m3.6.x_build\target\maven-shade-plugin-3.2.2-SNAPSHOT-tests.jar
under org\apache\maven\plugins\maven-shade-plugin\3.2.2-SNAPSHOT\maven-shade-plugin-3.2.2-SNAPSHOT-tests.jar
[withMaven] junitPublisher - Archive test results for Maven artifact org.apache.maven.plugins:maven-shade-plugin:maven-plugin:3.2.2-SNAPSHOT
generated by maven-surefire-plugin:test (default-test): windows-jdk12-m3.6.x_build\target\surefire-reports\*.xml
Recording test results
[withMaven] openTasksPublisher - Scan Tasks for Maven artifact org.apache.maven.plugins:maven-shade-plugin:maven-plugin:3.2.2-SNAPSHOT
in source directory windows-jdk12-m3.6.x_build\src\main\java
[TASKS] Scanning folder 'f:\jenkins\jenkins-slave\workspace\ox_maven-shade-plugin_MSHADE-306@2'
for files matching the pattern 'windows-jdk12-m3.6.x_build\src\main\java\**\*' - excludes:
null
[TASKS] Found 32 files to scan for tasks
[TASKS] Found 2 open tasks.
Skipping warnings blame since pipelines do not have an SCM link.%n
[TASKS] Computing warning deltas based on reference build #5
[withMaven] invokerPublisher - Archive invoker results for Maven artifact MavenArtifact{org.apache.maven.plugins:maven-shade-plugin:maven-plugin:3.2.2-SNAPSHOT(version:
3.2.2-SNAPSHOT, snapshot:false) } generated by PluginInvocation{org.apache.maven.plugins:maven-invoker-plugin:3.1.0@integration-test
 integration-test}: windows-jdk12-m3.6.x_build\target\invoker-reports\*.xml
[withMaven] Publishers: Generated Artifacts Publisher: 227 ms, Junit Publisher: 924 ms, Open
Task Scanner Publisher: 158 ms, Invoker Publisher: 21776 ms, Pipeline Graph Publisher: 1 ms
[Pipeline] // withMaven
[Pipeline] cleanWs
[WS-CLEANUP] Deleting project workspace...
[WS-CLEANUP] Deferred wipeout is used...
[WS-CLEANUP] done
[Pipeline] }
[Pipeline] // stage
[Pipeline] }
[Pipeline] // ws
[Pipeline] }
[Pipeline] // node
[Pipeline] }
[withMaven] Publishers: Generated Artifacts Publisher: 188 ms, Junit Publisher: 913 ms, Open
Task Scanner Publisher: 135 ms, Invoker Publisher: 18569 ms, Pipeline Graph Publisher: 18
ms
[Pipeline] // withMaven
[Pipeline] cleanWs
[WS-CLEANUP] Deleting project workspace...
[WS-CLEANUP] Deferred wipeout is used...
[WS-CLEANUP] done
[Pipeline] }
[Pipeline] // stage
[Pipeline] }
[Pipeline] // ws
[Pipeline] }
[Pipeline] // node
[Pipeline] }
[Pipeline] // parallel
[Pipeline] stage
[Pipeline] { (Notifications)
[Pipeline] echo
Build result: UNSTABLE
[Pipeline] jiraIssueSelector
[Pipeline] emailext
Mime
  • Unnamed multipart/mixed (inline, None, 0 bytes)
View raw message