maven-notifications mailing list archives

Site index · List index
Message view « Date » · « Thread »
Top « Date » · « Thread »
From Apache Jenkins Server <jenk...@builds.apache.org>
Subject Build failed in Jenkins: Maven TLP » maven-jar-plugin » MJAR-262 #6
Date Wed, 08 May 2019 19:06:21 GMT
See https://builds.apache.org/job/maven-box/job/maven-jar-plugin/job/MJAR-262/6/

Changes:

* WIP - MJAR-262 - Upgrade several dependencies.
* WIP - MJAR-262 - Upgrade several dependencies.
* WIP - MJAR-262 - Upgrade several dependencies.
* WIP - MJAR-262 - Upgrade several dependencies.
* WIP - MJAR-262 - Upgrade several dependencies.
* WIP - MJAR-262 - Upgrade several dependencies.
* WIP - MJAR-262 - Upgrade several dependencies.
* WIP - MJAR-262 - Upgrade several dependencies.
* WIP - MJAR-262 - Upgrade several dependencies.
* WIP - MJAR-262 - Upgrade several dependencies.
* WIP - MJAR-262 - Upgrade several dependencies.
* WIP - MJAR-262 - Upgrade several dependencies.

All tests passed

Build log:
[...truncated 299912 lines...]
[INFO] [DEBUG] Configuring mojo org.apache.maven.plugins:maven-jar-plugin:3.1.2-SNAPSHOT:jar
from plugin realm ClassRealm[plugin>org.apache.maven.plugins:maven-jar-plugin:3.1.2-SNAPSHOT,
parent: sun.misc.Launcher$AppClassLoader@33909752]
[INFO] [DEBUG] Configuring mojo 'org.apache.maven.plugins:maven-jar-plugin:3.1.2-SNAPSHOT:jar'
with basic configurator -->
[INFO] [DEBUG]   (f) classesDirectory = F:\jenkins\jenkins-slave\workspace\en-box_maven-jar-plugin_MJAR-262@2@2\windows-jdk8-m3.6.x_build\target\it\project-004\target\classes
[INFO] [DEBUG]   (f) classifier = service
[INFO] [DEBUG]   (f) finalName = maven-jar-plugin-test-project-004-99.0
[INFO] [DEBUG]   (f) forceCreation = false
[INFO] [DEBUG]   (f) includes = [**/service/*]
[INFO] [DEBUG]   (f) outputDirectory = F:\jenkins\jenkins-slave\workspace\en-box_maven-jar-plugin_MJAR-262@2@2\windows-jdk8-m3.6.x_build\target\it\project-004\target
[INFO] [DEBUG]   (f) project = MavenProject: org.apache.maven.plugins:maven-jar-plugin-test-project-004:99.0
@ F:\jenkins\jenkins-slave\workspace\en-box_maven-jar-plugin_MJAR-262@2@2\windows-jdk8-m3.6.x_build\target\it\project-004\pom.xml
[INFO] [DEBUG]   (f) session = org.apache.maven.execution.MavenSession@352c308
[INFO] [DEBUG]   (f) skipIfEmpty = false
[INFO] [DEBUG]   (f) useDefaultManifestFile = false
[INFO] [DEBUG] -- end configuration --
[INFO] [DEBUG] isUp2date: false (Destination F:\jenkins\jenkins-slave\workspace\en-box_maven-jar-plugin_MJAR-262@2@2\windows-jdk8-m3.6.x_build\target\it\project-004\target\maven-jar-plugin-test-project-004-99.0-service.jar
not found.)
[INFO] [INFO] Building jar: F:\jenkins\jenkins-slave\workspace\en-box_maven-jar-plugin_MJAR-262@2@2\windows-jdk8-m3.6.x_build\target\it\project-004\target\maven-jar-plugin-test-project-004-99.0-service.jar
[INFO] [DEBUG] adding directory META-INF/
[INFO] [DEBUG] adding entry META-INF/MANIFEST.MF
[INFO] [DEBUG] adding directory service/
[INFO] [DEBUG] adding directory service/impl/
[INFO] [DEBUG] adding entry service/TestInterface.class
[INFO] [DEBUG] adding directory META-INF/maven/
[INFO] [DEBUG] adding directory META-INF/maven/org.apache.maven.plugins/
[INFO] [DEBUG] adding directory META-INF/maven/org.apache.maven.plugins/maven-jar-plugin-test-project-004/
[INFO] [DEBUG] adding entry META-INF/maven/org.apache.maven.plugins/maven-jar-plugin-test-project-004/pom.xml
[INFO] [DEBUG] adding entry META-INF/maven/org.apache.maven.plugins/maven-jar-plugin-test-project-004/pom.properties
[INFO] [INFO] ------------------------------------------------------------------------
[INFO] [INFO] BUILD SUCCESS
[INFO] [INFO] ------------------------------------------------------------------------
[INFO] [INFO] Total time:  4.935 s
[INFO] [INFO] Finished at: 2019-05-08T12:06:07-07:00
[INFO] [INFO] ------------------------------------------------------------------------
[INFO] Picked up JAVA_TOOL_OPTIONS: -Dmaven.ext.class.path="f:\jenkins\jenkins-slave\workspace\en-box_maven-jar-plugin_MJAR-262@2@2@tmp\withMavenf3283e70\pipeline-maven-spy.jar"
-Dorg.jenkinsci.plugins.pipeline.maven.reportsFolder="f:\jenkins\jenkins-slave\workspace\en-box_maven-jar-plugin_MJAR-262@2@2@tmp\withMavenf3283e70"

[INFO] run post-build script verify.bsh
[INFO] Running post-build script: f:\jenkins\jenkins-slave\workspace\en-box_maven-jar-plugin_MJAR-262@2@2\windows-jdk8-m3.6.x_build\target\it\project-004\verify.bsh
[INFO] Finished post-build script: f:\jenkins\jenkins-slave\workspace\en-box_maven-jar-plugin_MJAR-262@2@2\windows-jdk8-m3.6.x_build\target\it\project-004\verify.bsh
[INFO]           project-004\pom.xml .............................. SUCCESS (8.5 s)
[INFO] 
[INFO] --- maven-checkstyle-plugin:3.0.0:check (checkstyle-check) @ maven-jar-plugin ---
[INFO] 
[INFO] --- maven-invoker-plugin:3.1.0:verify (integration-test) @ maven-jar-plugin ---
[INFO] -------------------------------------------------
[INFO] Build Summary:
[INFO]   Passed: 24, Failed: 2, Errors: 0, Skipped: 1
[INFO] -------------------------------------------------
[ERROR] The following builds failed:
[ERROR] *  manifest-content\pom.xml
[ERROR] *  MJAR-228\pom.xml
[INFO] -------------------------------------------------
[INFO] ------------------------------------------------------------------------
[INFO] BUILD FAILURE
[INFO] ------------------------------------------------------------------------
[INFO] Total time: 05:12 min
[INFO] Finished at: 2019-05-08T12:06:08-07:00
[INFO] Final Memory: 53M/507M
[INFO] ------------------------------------------------------------------------
[INFO] [jenkins-event-spy] Generated F:\jenkins\jenkins-slave\workspace\en-box_maven-jar-plugin_MJAR-262@3@tmp\withMavenf33596d6\maven-spy-20190508-120055-301635124711858057196.log
[ERROR] Failed to execute goal org.apache.maven.plugins:maven-invoker-plugin:3.1.0:verify
(integration-test) on project maven-jar-plugin: 2 builds failed. See console output above
for details. -> [Help 1]
org.apache.maven.lifecycle.LifecycleExecutionException: Failed to execute goal org.apache.maven.plugins:maven-invoker-plugin:3.1.0:verify
(integration-test) on project maven-jar-plugin: 2 builds failed. See console output above
for details.
    at org.apache.maven.lifecycle.internal.MojoExecutor.execute (MojoExecutor.java:213)
    at org.apache.maven.lifecycle.internal.MojoExecutor.execute (MojoExecutor.java:154)
    at org.apache.maven.lifecycle.internal.MojoExecutor.execute (MojoExecutor.java:146)
    at org.apache.maven.lifecycle.internal.LifecycleModuleBuilder.buildProject (LifecycleModuleBuilder.java:117)
    at org.apache.maven.lifecycle.internal.LifecycleModuleBuilder.buildProject (LifecycleModuleBuilder.java:81)
    at org.apache.maven.lifecycle.internal.builder.singlethreaded.SingleThreadedBuilder.build
(SingleThreadedBuilder.java:51)
    at org.apache.maven.lifecycle.internal.LifecycleStarter.execute (LifecycleStarter.java:128)
    at org.apache.maven.DefaultMaven.doExecute (DefaultMaven.java:309)
    at org.apache.maven.DefaultMaven.doExecute (DefaultMaven.java:194)
    at org.apache.maven.DefaultMaven.execute (DefaultMaven.java:107)
    at org.apache.maven.cli.MavenCli.execute (MavenCli.java:955)
    at org.apache.maven.cli.MavenCli.doMain (MavenCli.java:290)
    at org.apache.maven.cli.MavenCli.main (MavenCli.java:194)
    at sun.reflect.NativeMethodAccessorImpl.invoke0 (Native Method)
    at sun.reflect.NativeMethodAccessorImpl.invoke (NativeMethodAccessorImpl.java:57)
    at sun.reflect.DelegatingMethodAccessorImpl.invoke (DelegatingMethodAccessorImpl.java:43)
    at java.lang.reflect.Method.invoke (Method.java:606)
    at org.codehaus.plexus.classworlds.launcher.Launcher.launchEnhanced (Launcher.java:289)
    at org.codehaus.plexus.classworlds.launcher.Launcher.launch (Launcher.java:229)
    at org.codehaus.plexus.classworlds.launcher.Launcher.mainWithExitCode (Launcher.java:415)
    at org.codehaus.plexus.classworlds.launcher.Launcher.main (Launcher.java:356)
Caused by: org.apache.maven.plugin.MojoFailureException: 2 builds failed. See console output
above for details.
    at org.apache.maven.plugins.invoker.InvokerSession.handleFailures (InvokerSession.java:260)
    at org.apache.maven.plugins.invoker.VerifyMojo.execute (VerifyMojo.java:137)
    at org.apache.maven.plugin.DefaultBuildPluginManager.executeMojo (DefaultBuildPluginManager.java:134)
    at org.apache.maven.lifecycle.internal.MojoExecutor.execute (MojoExecutor.java:208)
    at org.apache.maven.lifecycle.internal.MojoExecutor.execute (MojoExecutor.java:154)
    at org.apache.maven.lifecycle.internal.MojoExecutor.execute (MojoExecutor.java:146)
    at org.apache.maven.lifecycle.internal.LifecycleModuleBuilder.buildProject (LifecycleModuleBuilder.java:117)
    at org.apache.maven.lifecycle.internal.LifecycleModuleBuilder.buildProject (LifecycleModuleBuilder.java:81)
    at org.apache.maven.lifecycle.internal.builder.singlethreaded.SingleThreadedBuilder.build
(SingleThreadedBuilder.java:51)
    at org.apache.maven.lifecycle.internal.LifecycleStarter.execute (LifecycleStarter.java:128)
    at org.apache.maven.DefaultMaven.doExecute (DefaultMaven.java:309)
    at org.apache.maven.DefaultMaven.doExecute (DefaultMaven.java:194)
    at org.apache.maven.DefaultMaven.execute (DefaultMaven.java:107)
    at org.apache.maven.cli.MavenCli.execute (MavenCli.java:955)
    at org.apache.maven.cli.MavenCli.doMain (MavenCli.java:290)
    at org.apache.maven.cli.MavenCli.main (MavenCli.java:194)
    at sun.reflect.NativeMethodAccessorImpl.invoke0 (Native Method)
    at sun.reflect.NativeMethodAccessorImpl.invoke (NativeMethodAccessorImpl.java:57)
    at sun.reflect.DelegatingMethodAccessorImpl.invoke (DelegatingMethodAccessorImpl.java:43)
    at java.lang.reflect.Method.invoke (Method.java:606)
    at org.codehaus.plexus.classworlds.launcher.Launcher.launchEnhanced (Launcher.java:289)
    at org.codehaus.plexus.classworlds.launcher.Launcher.launch (Launcher.java:229)
    at org.codehaus.plexus.classworlds.launcher.Launcher.mainWithExitCode (Launcher.java:415)
    at org.codehaus.plexus.classworlds.launcher.Launcher.main (Launcher.java:356)
[ERROR] 
[ERROR] Re-run Maven using the -X switch to enable full debug logging.
[ERROR] 
[ERROR] For more information about the errors and possible solutions, please read the following
articles:
[ERROR] [Help 1] http://cwiki.apache.org/confluence/display/MAVEN/MojoFailureException
Picked up JAVA_TOOL_OPTIONS: -Dmaven.ext.class.path="f:\jenkins\jenkins-slave\workspace\en-box_maven-jar-plugin_MJAR-262@3@tmp\withMavenf33596d6\pipeline-maven-spy.jar"
-Dorg.jenkinsci.plugins.pipeline.maven.reportsFolder="f:\jenkins\jenkins-slave\workspace\en-box_maven-jar-plugin_MJAR-262@3@tmp\withMavenf33596d6"

[Pipeline] }
[Pipeline] // dir
[Pipeline] }
[Fast Archiver] No prior successful build to compare, so performing full copy of artifacts
[withMaven] junitPublisher - Archive test results for Maven artifact org.apache.maven.plugins:maven-jar-plugin:maven-plugin:3.1.2-SNAPSHOT
generated by maven-surefire-plugin:test (default-test): windows-jdk7-m3.5.x_build\target\surefire-reports\*.xml
Recording test results
[withMaven] openTasksPublisher - Scan Tasks for Maven artifact org.apache.maven.plugins:maven-jar-plugin:maven-plugin:3.1.2-SNAPSHOT
in source directory windows-jdk7-m3.5.x_build\src\main\java
[TASKS] Scanning folder 'f:\jenkins\jenkins-slave\workspace\en-box_maven-jar-plugin_MJAR-262@3'
for files matching the pattern 'windows-jdk7-m3.5.x_build\src\main\java\**\*' - excludes:
null
[TASKS] Found 3 files to scan for tasks
[TASKS] Found 1 open tasks.
Skipping warnings blame since pipelines do not have an SCM link.%n
[withMaven] invokerPublisher - Archive invoker results for Maven artifact MavenArtifact{org.apache.maven.plugins:maven-jar-plugin:maven-plugin:3.1.2-SNAPSHOT(version:
3.1.2-SNAPSHOT, snapshot:false) } generated by PluginInvocation{org.apache.maven.plugins:maven-invoker-plugin:3.1.0@integration-test
 integration-test}: windows-jdk7-m3.5.x_build\target\invoker-reports\*.xml
[INFO] 
[INFO] --- maven-invoker-plugin:3.1.0:verify (integration-test) @ maven-jar-plugin ---
[INFO] -------------------------------------------------
[INFO] Build Summary:
[INFO]   Passed: 24, Failed: 2, Errors: 0, Skipped: 1
[INFO] -------------------------------------------------
[ERROR] The following builds failed:
[ERROR] *  manifest-content\pom.xml
[ERROR] *  MJAR-228\pom.xml
[INFO] -------------------------------------------------
[INFO] ------------------------------------------------------------------------
[INFO] BUILD FAILURE
[INFO] ------------------------------------------------------------------------
[INFO] Total time:  05:23 min
[INFO] Finished at: 2019-05-08T12:06:10-07:00
[INFO] ------------------------------------------------------------------------
[INFO] [jenkins-event-spy] Generated F:\jenkins\jenkins-slave\workspace\en-box_maven-jar-plugin_MJAR-262@2@2@tmp\withMavenf3283e70\maven-spy-20190508-120046-6783644659119000520547.log
[ERROR] Failed to execute goal org.apache.maven.plugins:maven-invoker-plugin:3.1.0:verify
(integration-test) on project maven-jar-plugin: 2 builds failed. See console output above
for details. -> [Help 1]
org.apache.maven.lifecycle.LifecycleExecutionException: Failed to execute goal org.apache.maven.plugins:maven-invoker-plugin:3.1.0:verify
(integration-test) on project maven-jar-plugin: 2 builds failed. See console output above
for details.
    at org.apache.maven.lifecycle.internal.MojoExecutor.execute (MojoExecutor.java:215)
    at org.apache.maven.lifecycle.internal.MojoExecutor.execute (MojoExecutor.java:156)
    at org.apache.maven.lifecycle.internal.MojoExecutor.execute (MojoExecutor.java:148)
    at org.apache.maven.lifecycle.internal.LifecycleModuleBuilder.buildProject (LifecycleModuleBuilder.java:117)
    at org.apache.maven.lifecycle.internal.LifecycleModuleBuilder.buildProject (LifecycleModuleBuilder.java:81)
    at org.apache.maven.lifecycle.internal.builder.singlethreaded.SingleThreadedBuilder.build
(SingleThreadedBuilder.java:56)
    at org.apache.maven.lifecycle.internal.LifecycleStarter.execute (LifecycleStarter.java:128)
    at org.apache.maven.DefaultMaven.doExecute (DefaultMaven.java:305)
    at org.apache.maven.DefaultMaven.doExecute (DefaultMaven.java:192)
    at org.apache.maven.DefaultMaven.execute (DefaultMaven.java:105)
    at org.apache.maven.cli.MavenCli.execute (MavenCli.java:956)
    at org.apache.maven.cli.MavenCli.doMain (MavenCli.java:288)
    at org.apache.maven.cli.MavenCli.main (MavenCli.java:192)
    at sun.reflect.NativeMethodAccessorImpl.invoke0 (Native Method)
    at sun.reflect.NativeMethodAccessorImpl.invoke (NativeMethodAccessorImpl.java:62)
    at sun.reflect.DelegatingMethodAccessorImpl.invoke (DelegatingMethodAccessorImpl.java:43)
    at java.lang.reflect.Method.invoke (Method.java:498)
    at org.codehaus.plexus.classworlds.launcher.Launcher.launchEnhanced (Launcher.java:289)
    at org.codehaus.plexus.classworlds.launcher.Launcher.launch (Launcher.java:229)
    at org.codehaus.plexus.classworlds.launcher.Launcher.mainWithExitCode (Launcher.java:415)
    at org.codehaus.plexus.classworlds.launcher.Launcher.main (Launcher.java:356)
Caused by: org.apache.maven.plugin.MojoFailureException: 2 builds failed. See console output
above for details.
    at org.apache.maven.plugins.invoker.InvokerSession.handleFailures (InvokerSession.java:260)
    at org.apache.maven.plugins.invoker.VerifyMojo.execute (VerifyMojo.java:137)
    at org.apache.maven.plugin.DefaultBuildPluginManager.executeMojo (DefaultBuildPluginManager.java:137)
    at org.apache.maven.lifecycle.internal.MojoExecutor.execute (MojoExecutor.java:210)
    at org.apache.maven.lifecycle.internal.MojoExecutor.execute (MojoExecutor.java:156)
    at org.apache.maven.lifecycle.internal.MojoExecutor.execute (MojoExecutor.java:148)
    at org.apache.maven.lifecycle.internal.LifecycleModuleBuilder.buildProject (LifecycleModuleBuilder.java:117)
    at org.apache.maven.lifecycle.internal.LifecycleModuleBuilder.buildProject (LifecycleModuleBuilder.java:81)
    at org.apache.maven.lifecycle.internal.builder.singlethreaded.SingleThreadedBuilder.build
(SingleThreadedBuilder.java:56)
    at org.apache.maven.lifecycle.internal.LifecycleStarter.execute (LifecycleStarter.java:128)
    at org.apache.maven.DefaultMaven.doExecute (DefaultMaven.java:305)
    at org.apache.maven.DefaultMaven.doExecute (DefaultMaven.java:192)
    at org.apache.maven.DefaultMaven.execute (DefaultMaven.java:105)
    at org.apache.maven.cli.MavenCli.execute (MavenCli.java:956)
    at org.apache.maven.cli.MavenCli.doMain (MavenCli.java:288)
    at org.apache.maven.cli.MavenCli.main (MavenCli.java:192)
    at sun.reflect.NativeMethodAccessorImpl.invoke0 (Native Method)
    at sun.reflect.NativeMethodAccessorImpl.invoke (NativeMethodAccessorImpl.java:62)
    at sun.reflect.DelegatingMethodAccessorImpl.invoke (DelegatingMethodAccessorImpl.java:43)
    at java.lang.reflect.Method.invoke (Method.java:498)
    at org.codehaus.plexus.classworlds.launcher.Launcher.launchEnhanced (Launcher.java:289)
    at org.codehaus.plexus.classworlds.launcher.Launcher.launch (Launcher.java:229)
    at org.codehaus.plexus.classworlds.launcher.Launcher.mainWithExitCode (Launcher.java:415)
    at org.codehaus.plexus.classworlds.launcher.Launcher.main (Launcher.java:356)
[ERROR] 
[ERROR] Re-run Maven using the -X switch to enable full debug logging.
[ERROR] 
[ERROR] For more information about the errors and possible solutions, please read the following
articles:
[ERROR] [Help 1] http://cwiki.apache.org/confluence/display/MAVEN/MojoFailureException
Picked up JAVA_TOOL_OPTIONS: -Dmaven.ext.class.path="f:\jenkins\jenkins-slave\workspace\en-box_maven-jar-plugin_MJAR-262@2@2@tmp\withMavenf3283e70\pipeline-maven-spy.jar"
-Dorg.jenkinsci.plugins.pipeline.maven.reportsFolder="f:\jenkins\jenkins-slave\workspace\en-box_maven-jar-plugin_MJAR-262@2@2@tmp\withMavenf3283e70"

[Pipeline] }
[Pipeline] // dir
[Pipeline] }
[Fast Archiver] No prior successful build to compare, so performing full copy of artifacts
[withMaven] junitPublisher - Archive test results for Maven artifact org.apache.maven.plugins:maven-jar-plugin:maven-plugin:3.1.2-SNAPSHOT
generated by maven-surefire-plugin:test (default-test): windows-jdk8-m3.6.x_build\target\surefire-reports\*.xml
Recording test results
[withMaven] openTasksPublisher - Scan Tasks for Maven artifact org.apache.maven.plugins:maven-jar-plugin:maven-plugin:3.1.2-SNAPSHOT
in source directory windows-jdk8-m3.6.x_build\src\main\java
[TASKS] Scanning folder 'f:\jenkins\jenkins-slave\workspace\en-box_maven-jar-plugin_MJAR-262@2@2'
for files matching the pattern 'windows-jdk8-m3.6.x_build\src\main\java\**\*' - excludes:
null
[TASKS] Found 3 files to scan for tasks
[TASKS] Found 1 open tasks.
Skipping warnings blame since pipelines do not have an SCM link.%n
[withMaven] invokerPublisher - Archive invoker results for Maven artifact MavenArtifact{org.apache.maven.plugins:maven-jar-plugin:maven-plugin:3.1.2-SNAPSHOT(version:
3.1.2-SNAPSHOT, snapshot:false) } generated by PluginInvocation{org.apache.maven.plugins:maven-invoker-plugin:3.1.0@integration-test
 integration-test}: windows-jdk8-m3.6.x_build\target\invoker-reports\*.xml
[withMaven] Publishers: Generated Artifacts Publisher: 24 ms, Junit Publisher: 103 ms, Open
Task Scanner Publisher: 96 ms, Invoker Publisher: 6588 ms
[Pipeline] // withMaven
[Pipeline] cleanWs
[WS-CLEANUP] Deleting project workspace...
[WS-CLEANUP] Deferred wipeout is used...
[WS-CLEANUP] done
[Pipeline] cleanWs
[WS-CLEANUP] Deleting project workspace...
[WS-CLEANUP] Deferred wipeout is used...
[WS-CLEANUP] done
[Pipeline] }
[Pipeline] // stage
[Pipeline] }
[Pipeline] // ws
[Pipeline] }
[Pipeline] // node
[Pipeline] }
Failed in branch windows-jdk7-m3.5.x_build
[withMaven] Publishers: Generated Artifacts Publisher: 17 ms, Junit Publisher: 94 ms, Open
Task Scanner Publisher: 76 ms, Invoker Publisher: 7080 ms
[Pipeline] // withMaven
[Pipeline] cleanWs
[WS-CLEANUP] Deleting project workspace...
[WS-CLEANUP] Deferred wipeout is used...
[WS-CLEANUP] done
[Pipeline] cleanWs
[WS-CLEANUP] Deleting project workspace...
[WS-CLEANUP] Deferred wipeout is used...
[WS-CLEANUP] done
[Pipeline] }
[Pipeline] // stage
[Pipeline] }
[Pipeline] // ws
[Pipeline] }
[Pipeline] // node
[Pipeline] }
Failed in branch windows-jdk8-m3.6.x_build
[Pipeline] // parallel
[Pipeline] stage
[Pipeline] { (Notifications)
[Pipeline] echo
Build result: FAILURE
[Pipeline] jiraIssueSelector
[Pipeline] jiraComment
[Pipeline] emailext
Mime
  • Unnamed multipart/mixed (inline, None, 0 bytes)
View raw message