maven-notifications mailing list archives

Site index · List index
Message view « Date » · « Thread »
Top « Date » · « Thread »
From Apache Jenkins Server <jenk...@builds.apache.org>
Subject Build failed in Jenkins: Maven TLP » maven-jar-plugin » MJAR-262 #7
Date Wed, 08 May 2019 19:47:31 GMT
See https://builds.apache.org/job/maven-box/job/maven-jar-plugin/job/MJAR-262/7/

Changes:

* Removed entry based on deprecation of IMPLEMENTATION_VENDOR_ID and

All tests passed

Build log:
[...truncated 150116 lines...]
Running on windows-2012-2 in f:\jenkins\jenkins-slave\workspace\en-box_maven-jar-plugin_MJAR-262
[Pipeline] {
[Pipeline] pwd
[Pipeline] ws
Running in f:\jenkins\jenkins-slave\workspace\en-box_maven-jar-plugin_MJAR-262@2
[Pipeline] {
[Pipeline] stage
[Pipeline] { (Checkout windows-jdk11-m3.6.x_build)
[Pipeline] dir
Running in f:\jenkins\jenkins-slave\workspace\en-box_maven-jar-plugin_MJAR-262@2\windows-jdk11-m3.6.x_build
[Pipeline] {
[Pipeline] checkout
[Pipeline] }
[Pipeline] // dir
[Pipeline] }
[Pipeline] // stage
[Pipeline] stage
[Pipeline] { (Build windows-jdk11-m3.6.x_build)
[Pipeline] withMaven
[withMaven] Options: [org.jenkinsci.plugins.pipeline.maven.publishers.GeneratedArtifactsPublisher[disabled=false],
JunitTestsPublisher[disabled=false,healthScaleFactor=,keepLongStdio=false,ignoreAttachments=false],
org.jenkinsci.plugins.pipeline.maven.publishers.FindbugsAnalysisPublisher[disabled='false',
healthy='', unHealthy='', thresholdLimit='low'], org.jenkinsci.plugins.pipeline.maven.publishers.TasksScannerPublisher[disabled='false',
healthy='', unHealthy='', thresholdLimit='low'], org.jenkinsci.plugins.pipeline.maven.publishers.DependenciesFingerprintPublisher[disabled=false,
scopes=[compile, provided, runtime], versions={snapshot:true, release:false}], org.jenkinsci.plugins.pipeline.maven.publishers.InvokerRunsPublisher[disabled=false],
org.jenkinsci.plugins.pipeline.maven.publishers.PipelineGraphPublisher[disabled=false, scopes=[compile,
provided, runtime], versions={snapshot:true, release:false}, skipDownstreamTriggers=false,
lifecycleThreshold=deploy, ignoreUpstreamTriggers=false], org.jenkinsci.plugins.pipeline.maven.publishers.MavenLinkerPublisher2[disabled=false]]
[withMaven] Available options: 
[withMaven] using JDK installation JDK 11 (latest)
[withMaven] using Maven installation 'Maven 3.6.0 (Windows)'
[Pipeline] {
[Pipeline] dir
Running in f:\jenkins\jenkins-slave\workspace\en-box_maven-jar-plugin_MJAR-262@2\windows-jdk11-m3.6.x_build
[Pipeline] {
[Pipeline] isUnix
[Pipeline] bat

f:\jenkins\jenkins-slave\workspace\en-box_maven-jar-plugin_MJAR-262@2\windows-jdk11-m3.6.x_build>mvn
-P+run-its -Dmaven.test.failure.ignore=true -Dfindbugs.failOnError=false -e clean verify 
----- withMaven Wrapper script -----
Picked up JAVA_TOOL_OPTIONS: -Dmaven.ext.class.path="f:\jenkins\jenkins-slave\workspace\en-box_maven-jar-plugin_MJAR-262@2@tmp\withMaven113782d0\pipeline-maven-spy.jar"
-Dorg.jenkinsci.plugins.pipeline.maven.reportsFolder="f:\jenkins\jenkins-slave\workspace\en-box_maven-jar-plugin_MJAR-262@2@tmp\withMaven113782d0"

[INFO] [jenkins-event-spy] Generate F:\jenkins\jenkins-slave\workspace\en-box_maven-jar-plugin_MJAR-262@2@tmp\withMavena6719eaf\maven-spy-20190508-124725-137819424967171314135.log.tmp
...
[INFO] Error stacktraces are turned on.
[INFO] Scanning for projects...
[INFO] ------------------------------------------------------------------------
[INFO] BUILD FAILURE
[INFO] ------------------------------------------------------------------------
[INFO] Total time:  0.216 s
[INFO] Finished at: 2019-05-08T12:47:25-07:00
[INFO] ------------------------------------------------------------------------
[WARNING] The requested profile "run-its" could not be activated because it does not exist.
[INFO] [jenkins-event-spy] Generated F:\jenkins\jenkins-slave\workspace\en-box_maven-jar-plugin_MJAR-262@2@tmp\withMavena6719eaf\maven-spy-20190508-124725-137819424967171314135.log
[ERROR] The goal you specified requires a project to execute but there is no POM in this directory
(f:\jenkins\jenkins-slave\workspace\en-box_maven-jar-plugin_MJAR-262@2\windows-jdk8-m3.6.x_build).
Please verify you invoked Maven from the correct directory. -> [Help 1]
org.apache.maven.lifecycle.MissingProjectException: The goal you specified requires a project
to execute but there is no POM in this directory (f:\jenkins\jenkins-slave\workspace\en-box_maven-jar-plugin_MJAR-262@2\windows-jdk8-m3.6.x_build).
Please verify you invoked Maven from the correct directory.
    at org.apache.maven.lifecycle.internal.LifecycleStarter.execute (LifecycleStarter.java:84)
    at org.apache.maven.DefaultMaven.doExecute (DefaultMaven.java:305)
    at org.apache.maven.DefaultMaven.doExecute (DefaultMaven.java:192)
    at org.apache.maven.DefaultMaven.execute (DefaultMaven.java:105)
    at org.apache.maven.cli.MavenCli.execute (MavenCli.java:956)
    at org.apache.maven.cli.MavenCli.doMain (MavenCli.java:288)
    at org.apache.maven.cli.MavenCli.main (MavenCli.java:192)
    at sun.reflect.NativeMethodAccessorImpl.invoke0 (Native Method)
    at sun.reflect.NativeMethodAccessorImpl.invoke (NativeMethodAccessorImpl.java:62)
    at sun.reflect.DelegatingMethodAccessorImpl.invoke (DelegatingMethodAccessorImpl.java:43)
    at java.lang.reflect.Method.invoke (Method.java:498)
    at org.codehaus.plexus.classworlds.launcher.Launcher.launchEnhanced (Launcher.java:289)
    at org.codehaus.plexus.classworlds.launcher.Launcher.launch (Launcher.java:229)
    at org.codehaus.plexus.classworlds.launcher.Launcher.mainWithExitCode (Launcher.java:415)
    at org.codehaus.plexus.classworlds.launcher.Launcher.main (Launcher.java:356)
[ERROR] 
[ERROR] Re-run Maven using the -X switch to enable full debug logging.
[ERROR] 
[ERROR] For more information about the errors and possible solutions, please read the following
articles:
[ERROR] [Help 1] http://cwiki.apache.org/confluence/display/MAVEN/MissingProjectException
Picked up JAVA_TOOL_OPTIONS: -Dmaven.ext.class.path="f:\jenkins\jenkins-slave\workspace\en-box_maven-jar-plugin_MJAR-262@2@tmp\withMavena6719eaf\pipeline-maven-spy.jar"
-Dorg.jenkinsci.plugins.pipeline.maven.reportsFolder="f:\jenkins\jenkins-slave\workspace\en-box_maven-jar-plugin_MJAR-262@2@tmp\withMavena6719eaf"

[Pipeline] }
Apache Maven 3.6.0 (97c98ec64a1fdfee7767ce5ffb20918da4f719f3; 2018-10-24T18:41:47Z)
Maven home: F:\jenkins\tools\maven\apache-maven-3.6.0\bin\..
Java version: 11, vendor: Oracle Corporation, runtime: f:\jenkins\tools\java\latest11
Default locale: en_US, platform encoding: Cp1252
OS name: "windows server 2012 r2", version: "6.3", arch: "amd64", family: "windows"
[Pipeline] // dir
[Pipeline] }
[Fast Archiver] No prior successful build to compare, so performing full copy of artifacts
[withMaven] Publishers: Generated Artifacts Publisher: 17 ms
[Pipeline] // withMaven
[Pipeline] cleanWs
[WS-CLEANUP] Deleting project workspace...
[WS-CLEANUP] Deferred wipeout is used...
[WS-CLEANUP] done
[Pipeline] cleanWs
[WS-CLEANUP] Deleting project workspace...
[WS-CLEANUP] Deferred wipeout is used...
[WS-CLEANUP] done
[Pipeline] }
[Pipeline] // stage
[Pipeline] }
[Pipeline] // ws
[Pipeline] }
[Pipeline] // node
Running on windows-2016-2 in f:\jenkins\jenkins-slave\workspace\en-box_maven-jar-plugin_MJAR-262
[Pipeline] }
Failed in branch windows-jdk8-m3.6.x_build
[Pipeline] {
[Pipeline] pwd
[Pipeline] ws
Running in f:\jenkins\jenkins-slave\workspace\en-box_maven-jar-plugin_MJAR-262@2
[Pipeline] {
[Pipeline] stage
[Pipeline] { (Checkout windows-jdk12-m3.6.x_build)
[Pipeline] dir
Running in f:\jenkins\jenkins-slave\workspace\en-box_maven-jar-plugin_MJAR-262@2\windows-jdk12-m3.6.x_build
[Pipeline] {
[Pipeline] checkout
[Pipeline] }
[Pipeline] // dir
[Pipeline] }
[Pipeline] // stage
[Pipeline] stage
[Pipeline] { (Build windows-jdk12-m3.6.x_build)
[Pipeline] withMaven
[withMaven] Options: [org.jenkinsci.plugins.pipeline.maven.publishers.GeneratedArtifactsPublisher[disabled=false],
JunitTestsPublisher[disabled=false,healthScaleFactor=,keepLongStdio=false,ignoreAttachments=false],
org.jenkinsci.plugins.pipeline.maven.publishers.FindbugsAnalysisPublisher[disabled='false',
healthy='', unHealthy='', thresholdLimit='low'], org.jenkinsci.plugins.pipeline.maven.publishers.TasksScannerPublisher[disabled='false',
healthy='', unHealthy='', thresholdLimit='low'], org.jenkinsci.plugins.pipeline.maven.publishers.DependenciesFingerprintPublisher[disabled=false,
scopes=[compile, provided, runtime], versions={snapshot:true, release:false}], org.jenkinsci.plugins.pipeline.maven.publishers.InvokerRunsPublisher[disabled=false],
org.jenkinsci.plugins.pipeline.maven.publishers.PipelineGraphPublisher[disabled=false, scopes=[compile,
provided, runtime], versions={snapshot:true, release:false}, skipDownstreamTriggers=false,
lifecycleThreshold=deploy, ignoreUpstreamTriggers=false], org.jenkinsci.plugins.pipeline.maven.publishers.MavenLinkerPublisher2[disabled=false]]
[withMaven] Available options: 
[withMaven] using JDK installation JDK 12 (latest)
[withMaven] using Maven installation 'Maven 3.6.0 (Windows)'
[Pipeline] {
[Pipeline] dir
Running in f:\jenkins\jenkins-slave\workspace\en-box_maven-jar-plugin_MJAR-262@2\windows-jdk12-m3.6.x_build
[Pipeline] {
[Pipeline] isUnix
[Pipeline] bat
[INFO] [jenkins-event-spy] Generate F:\jenkins\jenkins-slave\workspace\en-box_maven-jar-plugin_MJAR-262@2@tmp\withMaven113782d0\maven-spy-20190508-194726-65710450278012242957594.log.tmp
...
[INFO] Error stacktraces are turned on.
[INFO] Scanning for projects...

f:\jenkins\jenkins-slave\workspace\en-box_maven-jar-plugin_MJAR-262@2\windows-jdk12-m3.6.x_build>mvn
-P+run-its -Dmaven.test.failure.ignore=true -Dfindbugs.failOnError=false -e clean verify 
----- withMaven Wrapper script -----
Picked up JAVA_TOOL_OPTIONS: -Dmaven.ext.class.path="f:\jenkins\jenkins-slave\workspace\en-box_maven-jar-plugin_MJAR-262@2@tmp\withMavenba7557cc\pipeline-maven-spy.jar"
-Dorg.jenkinsci.plugins.pipeline.maven.reportsFolder="f:\jenkins\jenkins-slave\workspace\en-box_maven-jar-plugin_MJAR-262@2@tmp\withMavenba7557cc"

[INFO] ------------------------------------------------------------------------
[INFO] BUILD FAILURE
[INFO] ------------------------------------------------------------------------
[INFO] Total time:  0.161 s
[INFO] Finished at: 2019-05-08T19:47:27Z
[INFO] ------------------------------------------------------------------------
[WARNING] The requested profile "run-its" could not be activated because it does not exist.
[INFO] [jenkins-event-spy] Generated F:\jenkins\jenkins-slave\workspace\en-box_maven-jar-plugin_MJAR-262@2@tmp\withMaven113782d0\maven-spy-20190508-194726-65710450278012242957594.log
[ERROR] The goal you specified requires a project to execute but there is no POM in this directory
(f:\jenkins\jenkins-slave\workspace\en-box_maven-jar-plugin_MJAR-262@2\windows-jdk11-m3.6.x_build).
Please verify you invoked Maven from the correct directory. -> [Help 1]
org.apache.maven.lifecycle.MissingProjectException: The goal you specified requires a project
to execute but there is no POM in this directory (f:\jenkins\jenkins-slave\workspace\en-box_maven-jar-plugin_MJAR-262@2\windows-jdk11-m3.6.x_build).
Please verify you invoked Maven from the correct directory.
    at org.apache.maven.lifecycle.internal.LifecycleStarter.execute (LifecycleStarter.java:84)
    at org.apache.maven.DefaultMaven.doExecute (DefaultMaven.java:305)
    at org.apache.maven.DefaultMaven.doExecute (DefaultMaven.java:192)
    at org.apache.maven.DefaultMaven.execute (DefaultMaven.java:105)
    at org.apache.maven.cli.MavenCli.execute (MavenCli.java:956)
    at org.apache.maven.cli.MavenCli.doMain (MavenCli.java:288)
    at org.apache.maven.cli.MavenCli.main (MavenCli.java:192)
    at jdk.internal.reflect.NativeMethodAccessorImpl.invoke0 (Native Method)
    at jdk.internal.reflect.NativeMethodAccessorImpl.invoke (NativeMethodAccessorImpl.java:62)
    at jdk.internal.reflect.DelegatingMethodAccessorImpl.invoke (DelegatingMethodAccessorImpl.java:43)
    at java.lang.reflect.Method.invoke (Method.java:566)
    at org.codehaus.plexus.classworlds.launcher.Launcher.launchEnhanced (Launcher.java:289)
    at org.codehaus.plexus.classworlds.launcher.Launcher.launch (Launcher.java:229)
    at org.codehaus.plexus.classworlds.launcher.Launcher.mainWithExitCode (Launcher.java:415)
    at org.codehaus.plexus.classworlds.launcher.Launcher.main (Launcher.java:356)
[ERROR] 
[ERROR] Re-run Maven using the -X switch to enable full debug logging.
[ERROR] 
[ERROR] For more information about the errors and possible solutions, please read the following
articles:
[ERROR] [Help 1] http://cwiki.apache.org/confluence/display/MAVEN/MissingProjectException
[Pipeline] }
Apache Maven 3.6.0 (97c98ec64a1fdfee7767ce5ffb20918da4f719f3; 2018-10-24T11:41:47-07:00)
Maven home: F:\jenkins\tools\maven\apache-maven-3.6.0\bin\..
Java version: 12, vendor: Oracle Corporation, runtime: f:\jenkins\tools\java\latest12
Default locale: en_US, platform encoding: Cp1252
OS name: "windows server 2016", version: "10.0", arch: "amd64", family: "windows"
[Pipeline] // dir
[Pipeline] }
[Fast Archiver] No prior successful build to compare, so performing full copy of artifacts
[withMaven] Publishers: Generated Artifacts Publisher: 17 ms
[Pipeline] // withMaven
[Pipeline] cleanWs
[WS-CLEANUP] Deleting project workspace...
[WS-CLEANUP] Deferred wipeout is used...
[WS-CLEANUP] done
[Pipeline] cleanWs
[WS-CLEANUP] Deleting project workspace...
[WS-CLEANUP] Deferred wipeout is used...
[WS-CLEANUP] done
[Pipeline] }
[Pipeline] // stage
[Pipeline] }
[Pipeline] // ws
[Pipeline] }
[Pipeline] // node
[Pipeline] }
Failed in branch windows-jdk11-m3.6.x_build
[INFO] [jenkins-event-spy] Generate F:\jenkins\jenkins-slave\workspace\en-box_maven-jar-plugin_MJAR-262@2@tmp\withMavenba7557cc\maven-spy-20190508-124729-80111895110315730999269.log.tmp
...
[INFO] Error stacktraces are turned on.
[INFO] Scanning for projects...
[INFO] ------------------------------------------------------------------------
[INFO] BUILD FAILURE
[INFO] ------------------------------------------------------------------------
[INFO] Total time:  0.168 s
[INFO] Finished at: 2019-05-08T12:47:30-07:00
[INFO] ------------------------------------------------------------------------
[WARNING] The requested profile "run-its" could not be activated because it does not exist.
[INFO] [jenkins-event-spy] Generated F:\jenkins\jenkins-slave\workspace\en-box_maven-jar-plugin_MJAR-262@2@tmp\withMavenba7557cc\maven-spy-20190508-124729-80111895110315730999269.log
[ERROR] The goal you specified requires a project to execute but there is no POM in this directory
(f:\jenkins\jenkins-slave\workspace\en-box_maven-jar-plugin_MJAR-262@2\windows-jdk12-m3.6.x_build).
Please verify you invoked Maven from the correct directory. -> [Help 1]
org.apache.maven.lifecycle.MissingProjectException: The goal you specified requires a project
to execute but there is no POM in this directory (f:\jenkins\jenkins-slave\workspace\en-box_maven-jar-plugin_MJAR-262@2\windows-jdk12-m3.6.x_build).
Please verify you invoked Maven from the correct directory.
    at org.apache.maven.lifecycle.internal.LifecycleStarter.execute (LifecycleStarter.java:84)
    at org.apache.maven.DefaultMaven.doExecute (DefaultMaven.java:305)
    at org.apache.maven.DefaultMaven.doExecute (DefaultMaven.java:192)
    at org.apache.maven.DefaultMaven.execute (DefaultMaven.java:105)
    at org.apache.maven.cli.MavenCli.execute (MavenCli.java:956)
    at org.apache.maven.cli.MavenCli.doMain (MavenCli.java:288)
    at org.apache.maven.cli.MavenCli.main (MavenCli.java:192)
    at jdk.internal.reflect.NativeMethodAccessorImpl.invoke0 (Native Method)
    at jdk.internal.reflect.NativeMethodAccessorImpl.invoke (NativeMethodAccessorImpl.java:62)
    at jdk.internal.reflect.DelegatingMethodAccessorImpl.invoke (DelegatingMethodAccessorImpl.java:43)
    at java.lang.reflect.Method.invoke (Method.java:567)
    at org.codehaus.plexus.classworlds.launcher.Launcher.launchEnhanced (Launcher.java:289)
    at org.codehaus.plexus.classworlds.launcher.Launcher.launch (Launcher.java:229)
    at org.codehaus.plexus.classworlds.launcher.Launcher.mainWithExitCode (Launcher.java:415)
    at org.codehaus.plexus.classworlds.launcher.Launcher.main (Launcher.java:356)
[ERROR] 
[ERROR] Re-run Maven using the -X switch to enable full debug logging.
[ERROR] 
[ERROR] For more information about the errors and possible solutions, please read the following
articles:
[ERROR] [Help 1] http://cwiki.apache.org/confluence/display/MAVEN/MissingProjectException
[Pipeline] }
[Pipeline] // dir
[Pipeline] }
[Fast Archiver] No prior successful build to compare, so performing full copy of artifacts
[withMaven] Publishers: Generated Artifacts Publisher: 16 ms
[Pipeline] // withMaven
[Pipeline] cleanWs
[WS-CLEANUP] Deleting project workspace...
[WS-CLEANUP] Deferred wipeout is used...
[WS-CLEANUP] done
[Pipeline] cleanWs
[WS-CLEANUP] Deleting project workspace...
[WS-CLEANUP] Deferred wipeout is used...
[WS-CLEANUP] done
[Pipeline] }
[Pipeline] // stage
[Pipeline] }
[Pipeline] // ws
[Pipeline] }
[Pipeline] // node
[Pipeline] }
Failed in branch windows-jdk12-m3.6.x_build
[Pipeline] // parallel
[Pipeline] stage
[Pipeline] { (Notifications)
[Pipeline] echo
Build result: FAILURE
[Pipeline] jiraIssueSelector
[Pipeline] emailext
Mime
  • Unnamed multipart/mixed (inline, None, 0 bytes)
View raw message