maven-notifications mailing list archives

Site index · List index
Message view « Date » · « Thread »
Top « Date » · « Thread »
From Apache Jenkins Server <jenk...@builds.apache.org>
Subject Build unstable in Jenkins: Maven TLP » maven-shade-plugin » MSHADE-306 #5
Date Thu, 16 May 2019 09:24:19 GMT
See https://builds.apache.org/job/maven-box/job/maven-shade-plugin/job/MSHADE-306/5/

Changes:

* [MNG-6573] Use Maven 3.6.0 as default
* H39 has weird issues, exclude it for now
* Fix no access to currentBuild.rawBuild

6 tests failed.
FAILED:  org.apache.maven.plugins.shade.DefaultShaderTest.windows-jdk7-m3.2.x_build / Build
windows-jdk7-m3.2.x_build / testOverlappingResourcesAreLogged

Error Message:
[Processing JAR src\test\jars\test-project-1.0-SNAPSHOT.jar, Processing JAR src\test\jars\plexus-utils-1.4.1.jar,
We have a duplicate META-INF/MANIFEST.MF in src\test\jars\plexus-utils-1.4.1.jar]

Stack Trace:
junit.framework.AssertionFailedError: [Processing JAR src\test\jars\test-project-1.0-SNAPSHOT.jar,
Processing JAR src\test\jars\plexus-utils-1.4.1.jar, We have a duplicate META-INF/MANIFEST.MF
in src\test\jars\plexus-utils-1.4.1.jar]
	at org.apache.maven.plugins.shade.DefaultShaderTest.testOverlappingResourcesAreLogged(DefaultShaderTest.java:122)


FAILED:  org.apache.maven.plugins.shade.DefaultShaderTest.windows-jdk8-m3.6.x_build / Build
windows-jdk8-m3.6.x_build / testOverlappingResourcesAreLogged

Error Message:
[Processing JAR src\test\jars\test-project-1.0-SNAPSHOT.jar, Processing JAR src\test\jars\plexus-utils-1.4.1.jar,
We have a duplicate META-INF/MANIFEST.MF in src\test\jars\plexus-utils-1.4.1.jar]

Stack Trace:
junit.framework.AssertionFailedError: [Processing JAR src\test\jars\test-project-1.0-SNAPSHOT.jar,
Processing JAR src\test\jars\plexus-utils-1.4.1.jar, We have a duplicate META-INF/MANIFEST.MF
in src\test\jars\plexus-utils-1.4.1.jar]
	at org.apache.maven.plugins.shade.DefaultShaderTest.testOverlappingResourcesAreLogged(DefaultShaderTest.java:122)


FAILED:  org.apache.maven.plugins.shade.DefaultShaderTest.windows-jdk7-m3.3.x_build / Build
windows-jdk7-m3.3.x_build / testOverlappingResourcesAreLogged

Error Message:
[Processing JAR src\test\jars\test-project-1.0-SNAPSHOT.jar, Processing JAR src\test\jars\plexus-utils-1.4.1.jar,
We have a duplicate META-INF/MANIFEST.MF in src\test\jars\plexus-utils-1.4.1.jar]

Stack Trace:
junit.framework.AssertionFailedError: [Processing JAR src\test\jars\test-project-1.0-SNAPSHOT.jar,
Processing JAR src\test\jars\plexus-utils-1.4.1.jar, We have a duplicate META-INF/MANIFEST.MF
in src\test\jars\plexus-utils-1.4.1.jar]
	at org.apache.maven.plugins.shade.DefaultShaderTest.testOverlappingResourcesAreLogged(DefaultShaderTest.java:122)


FAILED:  org.apache.maven.plugins.shade.DefaultShaderTest.windows-jdk12-m3.6.x_build / Build
windows-jdk12-m3.6.x_build / testOverlappingResourcesAreLogged

Error Message:
[Processing JAR src\test\jars\test-project-1.0-SNAPSHOT.jar, Processing JAR src\test\jars\plexus-utils-1.4.1.jar,
We have a duplicate META-INF/MANIFEST.MF in src\test\jars\plexus-utils-1.4.1.jar]

Stack Trace:
junit.framework.AssertionFailedError: [Processing JAR src\test\jars\test-project-1.0-SNAPSHOT.jar,
Processing JAR src\test\jars\plexus-utils-1.4.1.jar, We have a duplicate META-INF/MANIFEST.MF
in src\test\jars\plexus-utils-1.4.1.jar]
	at org.apache.maven.plugins.shade.DefaultShaderTest.testOverlappingResourcesAreLogged(DefaultShaderTest.java:122)


FAILED:  org.apache.maven.plugins.shade.DefaultShaderTest.windows-jdk11-m3.6.x_build / Build
windows-jdk11-m3.6.x_build / testOverlappingResourcesAreLogged

Error Message:
[Processing JAR src\test\jars\test-project-1.0-SNAPSHOT.jar, Processing JAR src\test\jars\plexus-utils-1.4.1.jar,
We have a duplicate META-INF/MANIFEST.MF in src\test\jars\plexus-utils-1.4.1.jar]

Stack Trace:
junit.framework.AssertionFailedError: [Processing JAR src\test\jars\test-project-1.0-SNAPSHOT.jar,
Processing JAR src\test\jars\plexus-utils-1.4.1.jar, We have a duplicate META-INF/MANIFEST.MF
in src\test\jars\plexus-utils-1.4.1.jar]
	at org.apache.maven.plugins.shade.DefaultShaderTest.testOverlappingResourcesAreLogged(DefaultShaderTest.java:122)


FAILED:  org.apache.maven.plugins.shade.DefaultShaderTest.windows-jdk7-m3.5.x_build / Build
windows-jdk7-m3.5.x_build / testOverlappingResourcesAreLogged

Error Message:
[Processing JAR src\test\jars\test-project-1.0-SNAPSHOT.jar, Processing JAR src\test\jars\plexus-utils-1.4.1.jar,
We have a duplicate META-INF/MANIFEST.MF in src\test\jars\plexus-utils-1.4.1.jar]

Stack Trace:
junit.framework.AssertionFailedError: [Processing JAR src\test\jars\test-project-1.0-SNAPSHOT.jar,
Processing JAR src\test\jars\plexus-utils-1.4.1.jar, We have a duplicate META-INF/MANIFEST.MF
in src\test\jars\plexus-utils-1.4.1.jar]
	at org.apache.maven.plugins.shade.DefaultShaderTest.testOverlappingResourcesAreLogged(DefaultShaderTest.java:122)




Build log:
[...truncated 5608 lines...]
[Pipeline] // node
[Pipeline] }
[INFO] run post-build script verify.bsh
[INFO]           reloc-includes-excludes\pom.xml .................. SUCCESS (6.5 s)
[INFO] Building: rerun-with-reloc\pom.xml
[INFO]           reloc-abs-resource-path-exclude\pom.xml .......... SUCCESS (8.0 s)
[INFO] Building: reloc-anno\pom.xml
[INFO]           rerun-with-reloc\pom.xml ......................... SUCCESS (8.9 s)
[INFO] Building: rerun-without-reloc\pom.xml
[INFO]           rerun-with-reloc\pom.xml ......................... SUCCESS (7.1 s)
[INFO] Building: rerun-without-reloc\pom.xml
[INFO]           reloc-anno\pom.xml ............................... SUCCESS (7.4 s)
[INFO] Building: reloc-class-from-string-pool\pom.xml
[INFO]           rerun-without-reloc\pom.xml ...................... SUCCESS (7.8 s)
[INFO] Building: services-resource-transformer\pom.xml
[INFO]           rerun-without-reloc\pom.xml ...................... SUCCESS (6.1 s)
[INFO] Building: services-resource-transformer\pom.xml
[INFO]           reloc-class-from-string-pool\pom.xml ............. SUCCESS (7.4 s)
[INFO] Building: reloc-enum-ref-from-anno\pom.xml
[INFO] run post-build script verify.bsh
[INFO]           services-resource-transformer\pom.xml ............ SUCCESS (7.2 s)
[INFO] Building: services-resource-transformer-with-reloc-includes-excludes\pom.xml
[INFO] run post-build script verify.bsh
[INFO]           services-resource-transformer\pom.xml ............ SUCCESS (6.9 s)
[INFO] Building: services-resource-transformer-with-reloc-includes-excludes\pom.xml
[withMaven] Publishers: Generated Artifacts Publisher: 988 ms, Junit Publisher: 5669 ms, Open
Task Scanner Publisher: 470 ms, Invoker Publisher: 44197 ms, Pipeline Graph Publisher: 1 ms
[Pipeline] // withMaven
[Pipeline] cleanWs
[WS-CLEANUP] Deleting project workspace...
[WS-CLEANUP] Deferred wipeout is used...
[WS-CLEANUP] done
[Pipeline] }
[Pipeline] // stage
[Pipeline] }
[Pipeline] // ws
[Pipeline] }
[Pipeline] // node
[Pipeline] }
[INFO] run post-build script verify.bsh
[INFO]           services-resource-transformer-with-reloc-includes-excludes\pom.xml SUCCESS
(7.4 s)
[INFO] Building: shadePomDependency\pom.xml
[INFO]           reloc-enum-ref-from-anno\pom.xml ................. SUCCESS (7.4 s)
[INFO] Building: reloc-includes-excludes\pom.xml
[INFO] run post-build script verify.bsh
[INFO]           services-resource-transformer-with-reloc-includes-excludes\pom.xml SUCCESS
(6.4 s)
[INFO] Building: shadePomDependency\pom.xml
[INFO] run post-build script verify.bsh
[INFO]           reloc-includes-excludes\pom.xml .................. SUCCESS (7.8 s)
[INFO] Building: rerun-with-reloc\pom.xml
[INFO]           shadePomDependency\pom.xml ....................... SUCCESS (8.9 s)
[INFO] Building: shading-with-java-10-sources\pom.xml
[INFO]           shadePomDependency\pom.xml ....................... SUCCESS (7.9 s)
[INFO] Building: shading-with-java-10-sources\pom.xml
[INFO]           rerun-with-reloc\pom.xml ......................... SUCCESS (7.9 s)
[INFO] Building: rerun-without-reloc\pom.xml
[INFO] run post-build script verify.groovy
[INFO]           shading-with-java-10-sources\pom.xml ............. SUCCESS (9.7 s)
[INFO] Building: shading-with-java-11-sources\pom.xml
[INFO] run post-build script verify.groovy
[INFO]           shading-with-java-10-sources\pom.xml ............. SUCCESS (11.2 s)
[INFO] Building: shading-with-java-11-sources\pom.xml
[INFO]           rerun-without-reloc\pom.xml ...................... SUCCESS (6.9 s)
[INFO] Building: services-resource-transformer\pom.xml
[INFO] run post-build script verify.groovy
[INFO]           shading-with-java-11-sources\pom.xml ............. SUCCESS (6.6 s)
[INFO] Building: shading-with-java-8-sources\pom.xml
[INFO] run post-build script verify.bsh
[INFO]           services-resource-transformer\pom.xml ............ SUCCESS (6.9 s)
[INFO] Building: services-resource-transformer-with-reloc-includes-excludes\pom.xml
[INFO] run post-build script verify.groovy
[INFO]           shading-with-java-11-sources\pom.xml ............. SUCCESS (8.8 s)
[INFO] Building: shading-with-java-8-sources\pom.xml
[INFO] run post-build script verify.groovy
[INFO]           shading-with-java-8-sources\pom.xml .............. SUCCESS (6.5 s)
[INFO] Building: users-shader-impl\pom.xml
[INFO] run post-build script verify.bsh
[INFO]           services-resource-transformer-with-reloc-includes-excludes\pom.xml SUCCESS
(7.3 s)
[INFO] Building: shadePomDependency\pom.xml
[INFO] run post-build script verify.groovy
[INFO]           shading-with-java-8-sources\pom.xml .............. SUCCESS (8.4 s)
[INFO] Building: users-shader-impl\pom.xml
[INFO] run post-build script verify.groovy
[INFO]           users-shader-impl\pom.xml ........................ SUCCESS (6.9 s)
[INFO] Building: xml-transformer-ignores-dtd\pom.xml
[INFO] run post-build script verify.bsh
[INFO]           xml-transformer-ignores-dtd\pom.xml .............. SUCCESS (5.4 s)
[INFO] 
[INFO] --- maven-checkstyle-plugin:3.0.0:check (checkstyle-check) @ maven-shade-plugin ---
[INFO]           shadePomDependency\pom.xml ....................... SUCCESS (8.0 s)
[INFO] Building: shading-with-java-10-sources\pom.xml
[INFO]           shading-with-java-10-sources\pom.xml ............. SKIPPED due to JRE version
[INFO] Building: shading-with-java-11-sources\pom.xml
[INFO]           shading-with-java-11-sources\pom.xml ............. SKIPPED due to JRE version
[INFO] Building: shading-with-java-8-sources\pom.xml
[INFO]           shading-with-java-8-sources\pom.xml .............. SKIPPED due to JRE version
[INFO] Building: users-shader-impl\pom.xml
[INFO] run post-build script verify.groovy
[INFO]           users-shader-impl\pom.xml ........................ SUCCESS (8.4 s)
[INFO] Building: xml-transformer-ignores-dtd\pom.xml
[INFO] There are 3 errors reported by Checkstyle 6.18 with config/maven_checks.xml ruleset.
[INFO] Ignored 3 errors, 0 violation remaining.
[INFO] 
[INFO] --- maven-invoker-plugin:3.1.0:verify (integration-test) @ maven-shade-plugin ---
[INFO] -------------------------------------------------
[INFO] Build Summary:
[INFO]   Passed: 60, Failed: 0, Errors: 0, Skipped: 1
[INFO] -------------------------------------------------
[INFO] ------------------------------------------------------------------------
[INFO] BUILD SUCCESS
[INFO] ------------------------------------------------------------------------
[INFO] Total time:  08:41 min
[INFO] Finished at: 2019-05-16T02:23:36-07:00
[INFO] ------------------------------------------------------------------------
[INFO] [jenkins-event-spy] Generated F:\jenkins\jenkins-slave\workspace\ox_maven-shade-plugin_MSHADE-306@2@tmp\withMavenfc4f7e99\maven-spy-20190516-021454-931863392843796201853.log
[Pipeline] }
[Pipeline] // dir
[Pipeline] }
[withMaven] artifactsPublisher - Archive artifact windows-jdk12-m3.6.x_build\pom.xml under
org\apache\maven\plugins\maven-shade-plugin\3.2.2-SNAPSHOT\maven-shade-plugin-3.2.2-SNAPSHOT.pom
[withMaven] artifactsPublisher - Archive artifact windows-jdk12-m3.6.x_build\target\maven-shade-plugin-3.2.2-SNAPSHOT.jar
under org\apache\maven\plugins\maven-shade-plugin\3.2.2-SNAPSHOT\maven-shade-plugin-3.2.2-SNAPSHOT.jar
[withMaven] artifactsPublisher - Archive artifact windows-jdk12-m3.6.x_build\target\maven-shade-plugin-3.2.2-SNAPSHOT-tests.jar
under org\apache\maven\plugins\maven-shade-plugin\3.2.2-SNAPSHOT\maven-shade-plugin-3.2.2-SNAPSHOT-tests.jar
[withMaven] junitPublisher - Archive test results for Maven artifact org.apache.maven.plugins:maven-shade-plugin:maven-plugin:3.2.2-SNAPSHOT
generated by maven-surefire-plugin:test (default-test): windows-jdk12-m3.6.x_build\target\surefire-reports\*.xml
Recording test results
[withMaven] openTasksPublisher - Scan Tasks for Maven artifact org.apache.maven.plugins:maven-shade-plugin:maven-plugin:3.2.2-SNAPSHOT
in source directory windows-jdk12-m3.6.x_build\src\main\java
[TASKS] Scanning folder 'f:\jenkins\jenkins-slave\workspace\ox_maven-shade-plugin_MSHADE-306@2'
for files matching the pattern 'windows-jdk12-m3.6.x_build\src\main\java\**\*' - excludes:
null
[TASKS] Found 32 files to scan for tasks
[TASKS] Found 2 open tasks.
Skipping warnings blame since pipelines do not have an SCM link.%n
[TASKS] Computing warning deltas based on reference build #4
[withMaven] invokerPublisher - Archive invoker results for Maven artifact MavenArtifact{org.apache.maven.plugins:maven-shade-plugin:maven-plugin:3.2.2-SNAPSHOT(version:
3.2.2-SNAPSHOT, snapshot:false) } generated by PluginInvocation{org.apache.maven.plugins:maven-invoker-plugin:3.1.0@integration-test
 integration-test}: windows-jdk12-m3.6.x_build\target\invoker-reports\*.xml
[INFO] run post-build script verify.bsh
[INFO]           xml-transformer-ignores-dtd\pom.xml .............. SUCCESS (7.2 s)
[INFO] 
[INFO] --- maven-checkstyle-plugin:3.0.0:check (checkstyle-check) @ maven-shade-plugin ---
[INFO] run post-build script verify.groovy
[INFO]           users-shader-impl\pom.xml ........................ SUCCESS (10.4 s)
[INFO] Building: xml-transformer-ignores-dtd\pom.xml
[INFO] There are 3 errors reported by Checkstyle 6.18 with config/maven_checks.xml ruleset.
[INFO] Ignored 3 errors, 0 violation remaining.
[INFO] 
[INFO] --- maven-invoker-plugin:3.1.0:verify (integration-test) @ maven-shade-plugin ---
[INFO] -------------------------------------------------
[INFO] Build Summary:
[INFO]   Passed: 60, Failed: 0, Errors: 0, Skipped: 1
[INFO] -------------------------------------------------
[INFO] ------------------------------------------------------------------------
[INFO] BUILD SUCCESS
[INFO] ------------------------------------------------------------------------
[INFO] Total time:  08:56 min
[INFO] Finished at: 2019-05-16T09:23:43Z
[INFO] ------------------------------------------------------------------------
[INFO] [jenkins-event-spy] Generated F:\jenkins\jenkins-slave\workspace\ox_maven-shade-plugin_MSHADE-306@2@tmp\withMaven8b2b0145\maven-spy-20190516-091446-412711674949814595521.log
[Pipeline] }
[Pipeline] // dir
[Pipeline] }
[withMaven] artifactsPublisher - Archive artifact windows-jdk11-m3.6.x_build\pom.xml under
org\apache\maven\plugins\maven-shade-plugin\3.2.2-SNAPSHOT\maven-shade-plugin-3.2.2-SNAPSHOT.pom
[withMaven] artifactsPublisher - Archive artifact windows-jdk11-m3.6.x_build\target\maven-shade-plugin-3.2.2-SNAPSHOT.jar
under org\apache\maven\plugins\maven-shade-plugin\3.2.2-SNAPSHOT\maven-shade-plugin-3.2.2-SNAPSHOT.jar
[withMaven] artifactsPublisher - Archive artifact windows-jdk11-m3.6.x_build\target\maven-shade-plugin-3.2.2-SNAPSHOT-tests.jar
under org\apache\maven\plugins\maven-shade-plugin\3.2.2-SNAPSHOT\maven-shade-plugin-3.2.2-SNAPSHOT-tests.jar
[withMaven] junitPublisher - Archive test results for Maven artifact org.apache.maven.plugins:maven-shade-plugin:maven-plugin:3.2.2-SNAPSHOT
generated by maven-surefire-plugin:test (default-test): windows-jdk11-m3.6.x_build\target\surefire-reports\*.xml
Recording test results
[withMaven] openTasksPublisher - Scan Tasks for Maven artifact org.apache.maven.plugins:maven-shade-plugin:maven-plugin:3.2.2-SNAPSHOT
in source directory windows-jdk11-m3.6.x_build\src\main\java
[TASKS] Scanning folder 'f:\jenkins\jenkins-slave\workspace\ox_maven-shade-plugin_MSHADE-306@2'
for files matching the pattern 'windows-jdk11-m3.6.x_build\src\main\java\**\*' - excludes:
null
[TASKS] Found 32 files to scan for tasks
[TASKS] Found 2 open tasks.
Skipping warnings blame since pipelines do not have an SCM link.%n
[TASKS] Computing warning deltas based on reference build #4
[withMaven] invokerPublisher - Archive invoker results for Maven artifact MavenArtifact{org.apache.maven.plugins:maven-shade-plugin:maven-plugin:3.2.2-SNAPSHOT(version:
3.2.2-SNAPSHOT, snapshot:false) } generated by PluginInvocation{org.apache.maven.plugins:maven-invoker-plugin:3.1.0@integration-test
 integration-test}: windows-jdk11-m3.6.x_build\target\invoker-reports\*.xml
[INFO] run post-build script verify.bsh
[INFO]           xml-transformer-ignores-dtd\pom.xml .............. SUCCESS (6.6 s)
[INFO] 
[INFO] --- maven-checkstyle-plugin:3.0.0:check (checkstyle-check) @ maven-shade-plugin ---
[INFO] There are 3 errors reported by Checkstyle 6.18 with config/maven_checks.xml ruleset.
[INFO] Ignored 3 errors, 0 violation remaining.
[INFO] 
[INFO] --- maven-invoker-plugin:3.1.0:verify (integration-test) @ maven-shade-plugin ---
[INFO] -------------------------------------------------
[INFO] Build Summary:
[INFO]   Passed: 52, Failed: 0, Errors: 0, Skipped: 9
[INFO] -------------------------------------------------
[INFO] ------------------------------------------------------------------------
[INFO] BUILD SUCCESS
[INFO] ------------------------------------------------------------------------
[INFO] Total time: 08:56 min
[INFO] Finished at: 2019-05-16T02:23:53-07:00
[INFO] Final Memory: 43M/276M
[INFO] ------------------------------------------------------------------------
[INFO] [jenkins-event-spy] Generated F:\jenkins\jenkins-slave\workspace\ox_maven-shade-plugin_MSHADE-306@2@tmp\withMaven66b12840\maven-spy-20190516-021455-3572044813553733422707.log
Picked up JAVA_TOOL_OPTIONS: -Dmaven.ext.class.path="f:\jenkins\jenkins-slave\workspace\ox_maven-shade-plugin_MSHADE-306@2@tmp\withMaven66b12840\pipeline-maven-spy.jar"
-Dorg.jenkinsci.plugins.pipeline.maven.reportsFolder="f:\jenkins\jenkins-slave\workspace\ox_maven-shade-plugin_MSHADE-306@2@tmp\withMaven66b12840"

[Pipeline] }
[Pipeline] // dir
[Pipeline] }
[withMaven] artifactsPublisher - Archive artifact windows-jdk7-m3.5.x_build\pom.xml under
org\apache\maven\plugins\maven-shade-plugin\3.2.2-SNAPSHOT\maven-shade-plugin-3.2.2-SNAPSHOT.pom
[withMaven] artifactsPublisher - Archive artifact windows-jdk7-m3.5.x_build\target\maven-shade-plugin-3.2.2-SNAPSHOT.jar
under org\apache\maven\plugins\maven-shade-plugin\3.2.2-SNAPSHOT\maven-shade-plugin-3.2.2-SNAPSHOT.jar
[withMaven] artifactsPublisher - Archive artifact windows-jdk7-m3.5.x_build\target\maven-shade-plugin-3.2.2-SNAPSHOT-tests.jar
under org\apache\maven\plugins\maven-shade-plugin\3.2.2-SNAPSHOT\maven-shade-plugin-3.2.2-SNAPSHOT-tests.jar
[withMaven] junitPublisher - Archive test results for Maven artifact org.apache.maven.plugins:maven-shade-plugin:maven-plugin:3.2.2-SNAPSHOT
generated by maven-surefire-plugin:test (default-test): windows-jdk7-m3.5.x_build\target\surefire-reports\*.xml
Recording test results
[withMaven] openTasksPublisher - Scan Tasks for Maven artifact org.apache.maven.plugins:maven-shade-plugin:maven-plugin:3.2.2-SNAPSHOT
in source directory windows-jdk7-m3.5.x_build\src\main\java
[TASKS] Scanning folder 'f:\jenkins\jenkins-slave\workspace\ox_maven-shade-plugin_MSHADE-306@2'
for files matching the pattern 'windows-jdk7-m3.5.x_build\src\main\java\**\*' - excludes:
null
[TASKS] Found 32 files to scan for tasks
[TASKS] Found 2 open tasks.
Skipping warnings blame since pipelines do not have an SCM link.%n
[TASKS] Computing warning deltas based on reference build #4
[withMaven] invokerPublisher - Archive invoker results for Maven artifact MavenArtifact{org.apache.maven.plugins:maven-shade-plugin:maven-plugin:3.2.2-SNAPSHOT(version:
3.2.2-SNAPSHOT, snapshot:false) } generated by PluginInvocation{org.apache.maven.plugins:maven-invoker-plugin:3.1.0@integration-test
 integration-test}: windows-jdk7-m3.5.x_build\target\invoker-reports\*.xml
[withMaven] Publishers: Generated Artifacts Publisher: 178 ms, Junit Publisher: 879 ms, Open
Task Scanner Publisher: 124 ms, Invoker Publisher: 19850 ms, Pipeline Graph Publisher: 1 ms
[Pipeline] // withMaven
[Pipeline] cleanWs
[WS-CLEANUP] Deleting project workspace...
[WS-CLEANUP] Deferred wipeout is used...
[WS-CLEANUP] done
[Pipeline] }
[Pipeline] // stage
[Pipeline] }
[Pipeline] // ws
[Pipeline] }
[Pipeline] // node
[Pipeline] }
[withMaven] Publishers: Generated Artifacts Publisher: 206 ms, Junit Publisher: 892 ms, Open
Task Scanner Publisher: 135 ms, Invoker Publisher: 19622 ms
[Pipeline] // withMaven
[Pipeline] cleanWs
[WS-CLEANUP] Deleting project workspace...
[WS-CLEANUP] Deferred wipeout is used...
[WS-CLEANUP] done
[Pipeline] }
[Pipeline] // stage
[Pipeline] }
[Pipeline] // ws
[Pipeline] }
[Pipeline] // node
[Pipeline] }
[withMaven] Publishers: Generated Artifacts Publisher: 194 ms, Junit Publisher: 874 ms, Open
Task Scanner Publisher: 155 ms, Invoker Publisher: 21403 ms, Pipeline Graph Publisher: 1 ms
[Pipeline] // withMaven
[Pipeline] cleanWs
[WS-CLEANUP] Deleting project workspace...
[WS-CLEANUP] Deferred wipeout is used...
[WS-CLEANUP] done
[Pipeline] }
[Pipeline] // stage
[Pipeline] }
[Pipeline] // ws
[Pipeline] }
[Pipeline] // node
[Pipeline] }
[Pipeline] // parallel
[Pipeline] stage
[Pipeline] { (Notifications)
[Pipeline] echo
Build result: UNSTABLE
[Pipeline] jiraIssueSelector
[Pipeline] jiraComment
[Pipeline] emailext
Mime
  • Unnamed multipart/mixed (inline, None, 0 bytes)
View raw message