maven-notifications mailing list archives

Site index · List index
Message view « Date » · « Thread »
Top « Date » · « Thread »
From Apache Jenkins Server <jenk...@builds.apache.org>
Subject Build failed in Jenkins: Maven TLP » maven-release » failOnSnapshot #1
Date Fri, 10 May 2019 22:39:52 GMT
See https://builds.apache.org/job/maven-box/job/maven-release/job/failOnSnapshot/1/

No changes.

All tests passed

Build log:
[...truncated 20806 lines...]
[INFO] --- maven-enforcer-plugin:1.4.1:enforce (ban-known-bad-maven-versions) @ maven-release-oddeven-policy
---
[INFO] 
[INFO] --- apache-rat-plugin:0.12:check (rat-check) @ maven-release-oddeven-policy ---
[INFO] Enabled default license matchers.
[INFO] Will parse SCM ignores for exclusions...
[INFO] Finished adding exclusions from SCM ignore files.
[INFO] 61 implicit excludes (use -debug for more details).
[INFO] Exclude: .repository
[INFO] Exclude: Jenkinsfile
[INFO] Exclude: .repository/**
[INFO] Exclude: .maven/spy.log
[INFO] Exclude: dependency-reduced-pom.xml
[INFO] Exclude: .java-version
[INFO] 4 resources included (use -debug for more details)
[INFO] Rat check: Summary over all files. Unapproved: 0, unknown: 0, generated: 0, approved:
4 licenses.
[INFO] 
[INFO] --- maven-remote-resources-plugin:1.5:process (process-resource-bundles) @ maven-release-oddeven-policy
---
[INFO] 
[INFO] --- maven-resources-plugin:3.1.0:resources (default-resources) @ maven-release-oddeven-policy
---
[INFO] Using 'UTF-8' encoding to copy filtered resources.
[INFO] skip non existing resourceDirectory F:\jenkins\jenkins-slave\workspace\box_maven-release_failOnSnapshot@3\windows-jdk8-m3.6.x_build\maven-release-policies\maven-release-oddeven-policy\src\main\resources
[INFO] Copying 3 resources
[INFO] 
[INFO] --- maven-compiler-plugin:3.7.0:compile (default-compile) @ maven-release-oddeven-policy
---
[INFO] Changes detected - recompiling the module!
[INFO] Compiling 2 source files to F:\jenkins\jenkins-slave\workspace\box_maven-release_failOnSnapshot@3\windows-jdk8-m3.6.x_build\maven-release-policies\maven-release-oddeven-policy\target\classes
[INFO] 
[INFO] --- plexus-component-metadata:1.7.1:generate-metadata (process-classes) @ maven-release-oddeven-policy
---
[INFO] Discovered 1 component descriptors(s)
[INFO] 
[INFO] --- maven-resources-plugin:3.1.0:testResources (default-testResources) @ maven-release-oddeven-policy
---
[INFO] Using 'UTF-8' encoding to copy filtered resources.
[INFO] skip non existing resourceDirectory F:\jenkins\jenkins-slave\workspace\box_maven-release_failOnSnapshot@3\windows-jdk8-m3.6.x_build\maven-release-policies\maven-release-oddeven-policy\src\test\resources
[INFO] Copying 3 resources
[INFO] 
[INFO] --- maven-compiler-plugin:3.7.0:testCompile (default-testCompile) @ maven-release-oddeven-policy
---
[INFO] Changes detected - recompiling the module!
[INFO] Compiling 1 source file to F:\jenkins\jenkins-slave\workspace\box_maven-release_failOnSnapshot@3\windows-jdk8-m3.6.x_build\maven-release-policies\maven-release-oddeven-policy\target\test-classes
[INFO] 
[INFO] --- maven-surefire-plugin:2.22.0:test (default-test) @ maven-release-oddeven-policy
---
[INFO] Surefire report directory: F:\jenkins\jenkins-slave\workspace\box_maven-release_failOnSnapshot@3\windows-jdk8-m3.6.x_build\maven-release-policies\maven-release-oddeven-policy\target\surefire-reports
[INFO] 
[INFO] -------------------------------------------------------
[INFO]  T E S T S
[INFO] -------------------------------------------------------
[INFO] Running org.apache.maven.shared.release.policy.oddeven.OddEvenVersionPolicyTestCase
[INFO] Tests run: 3, Failures: 0, Errors: 0, Skipped: 0, Time elapsed: 0.156 s - in org.apache.maven.shared.release.policy.oddeven.OddEvenVersionPolicyTestCase
[INFO] 
[INFO] Results:
[INFO] 
[INFO] Tests run: 3, Failures: 0, Errors: 0, Skipped: 0
[INFO] 
[INFO] 
[INFO] --- maven-jar-plugin:3.1.0:jar (default-jar) @ maven-release-oddeven-policy ---
[INFO] Building jar: F:\jenkins\jenkins-slave\workspace\box_maven-release_failOnSnapshot@3\windows-jdk8-m3.6.x_build\maven-release-policies\maven-release-oddeven-policy\target\maven-release-oddeven-policy-3.0.0-SNAPSHOT.jar
[INFO] 
[INFO] --- maven-site-plugin:3.7.1:attach-descriptor (attach-descriptor) @ maven-release-oddeven-policy
---
[INFO] Skipping because packaging 'jar' is not pom.
[INFO] 
[INFO] --- maven-checkstyle-plugin:3.0.0:check (checkstyle-check) @ maven-release-oddeven-policy
---
[INFO] 
[INFO] --------< org.apache.maven.release:maven-release-semver-policy >--------
[INFO] Building Maven Release SemVer Policy 3.0.0-SNAPSHOT                [6/6]
[INFO] --------------------------------[ jar ]---------------------------------
[INFO] 
[INFO] --- maven-clean-plugin:3.1.0:clean (default-clean) @ maven-release-semver-policy ---
[INFO] 
[INFO] --- maven-enforcer-plugin:1.4.1:enforce (enforce-maven-version) @ maven-release-semver-policy
---
[INFO] 
[INFO] --- maven-enforcer-plugin:1.4.1:enforce (enforce-bytecode-version) @ maven-release-semver-policy
---
[INFO] 
[INFO] --- maven-enforcer-plugin:1.4.1:enforce (ban-known-bad-maven-versions) @ maven-release-semver-policy
---
[INFO] 
[INFO] --- apache-rat-plugin:0.12:check (rat-check) @ maven-release-semver-policy ---
[INFO] Enabled default license matchers.
[INFO] Will parse SCM ignores for exclusions...
[INFO] Finished adding exclusions from SCM ignore files.
[INFO] 61 implicit excludes (use -debug for more details).
[INFO] Exclude: .repository
[INFO] Exclude: Jenkinsfile
[INFO] Exclude: .repository/**
[INFO] Exclude: .maven/spy.log
[INFO] Exclude: dependency-reduced-pom.xml
[INFO] Exclude: .java-version
[INFO] 3 resources included (use -debug for more details)
[INFO] Rat check: Summary over all files. Unapproved: 0, unknown: 0, generated: 0, approved:
3 licenses.
[INFO] 
[INFO] --- maven-remote-resources-plugin:1.5:process (process-resource-bundles) @ maven-release-semver-policy
---
[INFO] 
[INFO] --- maven-resources-plugin:3.1.0:resources (default-resources) @ maven-release-semver-policy
---
[INFO] Using 'UTF-8' encoding to copy filtered resources.
[INFO] skip non existing resourceDirectory F:\jenkins\jenkins-slave\workspace\box_maven-release_failOnSnapshot@3\windows-jdk8-m3.6.x_build\maven-release-policies\maven-release-semver-policy\src\main\resources
[INFO] Copying 3 resources
[INFO] 
[INFO] --- maven-compiler-plugin:3.7.0:compile (default-compile) @ maven-release-semver-policy
---
[INFO] Changes detected - recompiling the module!
[INFO] Compiling 1 source file to F:\jenkins\jenkins-slave\workspace\box_maven-release_failOnSnapshot@3\windows-jdk8-m3.6.x_build\maven-release-policies\maven-release-semver-policy\target\classes
[INFO] 
[INFO] --- plexus-component-metadata:1.7.1:generate-metadata (process-classes) @ maven-release-semver-policy
---
[INFO] Discovered 1 component descriptors(s)
[INFO] 
[INFO] --- maven-resources-plugin:3.1.0:testResources (default-testResources) @ maven-release-semver-policy
---
[INFO] Using 'UTF-8' encoding to copy filtered resources.
[INFO] skip non existing resourceDirectory F:\jenkins\jenkins-slave\workspace\box_maven-release_failOnSnapshot@3\windows-jdk8-m3.6.x_build\maven-release-policies\maven-release-semver-policy\src\test\resources
[INFO] Copying 3 resources
[INFO] 
[INFO] --- maven-compiler-plugin:3.7.0:testCompile (default-testCompile) @ maven-release-semver-policy
---
[INFO] Changes detected - recompiling the module!
[INFO] Compiling 1 source file to F:\jenkins\jenkins-slave\workspace\box_maven-release_failOnSnapshot@3\windows-jdk8-m3.6.x_build\maven-release-policies\maven-release-semver-policy\target\test-classes
[INFO] 
[INFO] --- maven-surefire-plugin:2.22.0:test (default-test) @ maven-release-semver-policy
---
[INFO] Surefire report directory: F:\jenkins\jenkins-slave\workspace\box_maven-release_failOnSnapshot@3\windows-jdk8-m3.6.x_build\maven-release-policies\maven-release-semver-policy\target\surefire-reports
[INFO] 
[INFO] -------------------------------------------------------
[INFO]  T E S T S
[INFO] -------------------------------------------------------
[INFO] Running org.apache.maven.shared.release.policy.semver.SemVerVersionPolicyTest
[INFO] Tests run: 2, Failures: 0, Errors: 0, Skipped: 0, Time elapsed: 0.125 s - in org.apache.maven.shared.release.policy.semver.SemVerVersionPolicyTest
[INFO] 
[INFO] Results:
[INFO] 
[INFO] Tests run: 2, Failures: 0, Errors: 0, Skipped: 0
[INFO] 
[INFO] 
[INFO] --- maven-jar-plugin:3.1.0:jar (default-jar) @ maven-release-semver-policy ---
[INFO] Building jar: F:\jenkins\jenkins-slave\workspace\box_maven-release_failOnSnapshot@3\windows-jdk8-m3.6.x_build\maven-release-policies\maven-release-semver-policy\target\maven-release-semver-policy-3.0.0-SNAPSHOT.jar
[INFO] 
[INFO] --- maven-site-plugin:3.7.1:attach-descriptor (attach-descriptor) @ maven-release-semver-policy
---
[INFO] Skipping because packaging 'jar' is not pom.
[INFO] 
[INFO] --- maven-checkstyle-plugin:3.0.0:check (checkstyle-check) @ maven-release-semver-policy
---
[INFO] ------------------------------------------------------------------------
[INFO] Reactor Summary for Maven Release 3.0.0-SNAPSHOT:
[INFO] 
[INFO] Maven Release ...................................... SUCCESS [ 12.311 s]
[INFO] Maven Release APIs ................................. SUCCESS [  9.243 s]
[INFO] Maven Release Manager .............................. SUCCESS [02:20 min]
[INFO] Maven Release Plugin ............................... SUCCESS [08:47 min]
[INFO] Maven Release Odd-Even Policy ...................... SUCCESS [  1.746 s]
[INFO] Maven Release SemVer Policy ........................ SUCCESS [  2.462 s]
[INFO] ------------------------------------------------------------------------
[INFO] BUILD SUCCESS
[INFO] ------------------------------------------------------------------------
[INFO] Total time:  11:35 min
[INFO] Finished at: 2019-05-10T20:12:11Z
[INFO] ------------------------------------------------------------------------
[INFO] [jenkins-event-spy] Generated F:\jenkins\jenkins-slave\workspace\box_maven-release_failOnSnapshot@3@tmp\withMaven074619af\maven-spy-20190510-200036-2182398248702028553038.log
Picked up JAVA_TOOL_OPTIONS: -Dmaven.ext.class.path="f:\jenkins\jenkins-slave\workspace\box_maven-release_failOnSnapshot@3@tmp\withMaven074619af\pipeline-maven-spy.jar"
-Dorg.jenkinsci.plugins.pipeline.maven.reportsFolder="f:\jenkins\jenkins-slave\workspace\box_maven-release_failOnSnapshot@3@tmp\withMaven074619af"

[Pipeline] }
[Pipeline] // dir
[Pipeline] }
[withMaven] artifactsPublisher - Archive artifact windows-jdk8-m3.6.x_build\pom.xml under
org\apache\maven\release\maven-release\3.0.0-SNAPSHOT\maven-release-3.0.0-SNAPSHOT.pom
[withMaven] artifactsPublisher - Archive artifact windows-jdk8-m3.6.x_build\target\maven-release-3.0.0-SNAPSHOT-site.xml
under org\apache\maven\release\maven-release\3.0.0-SNAPSHOT\maven-release-3.0.0-SNAPSHOT-site.xml
[withMaven] artifactsPublisher - Archive artifact windows-jdk8-m3.6.x_build\maven-release-api\pom.xml
under org\apache\maven\release\maven-release-api\3.0.0-SNAPSHOT\maven-release-api-3.0.0-SNAPSHOT.pom
[withMaven] artifactsPublisher - Archive artifact windows-jdk8-m3.6.x_build\maven-release-api\target\maven-release-api-3.0.0-SNAPSHOT.jar
under org\apache\maven\release\maven-release-api\3.0.0-SNAPSHOT\maven-release-api-3.0.0-SNAPSHOT.jar
[withMaven] artifactsPublisher - Archive artifact windows-jdk8-m3.6.x_build\maven-release-manager\pom.xml
under org\apache\maven\release\maven-release-manager\3.0.0-SNAPSHOT\maven-release-manager-3.0.0-SNAPSHOT.pom
[withMaven] artifactsPublisher - Archive artifact windows-jdk8-m3.6.x_build\maven-release-manager\target\maven-release-manager-3.0.0-SNAPSHOT.jar
under org\apache\maven\release\maven-release-manager\3.0.0-SNAPSHOT\maven-release-manager-3.0.0-SNAPSHOT.jar
[withMaven] artifactsPublisher - Archive artifact windows-jdk8-m3.6.x_build\maven-release-plugin\pom.xml
under org\apache\maven\plugins\maven-release-plugin\3.0.0-SNAPSHOT\maven-release-plugin-3.0.0-SNAPSHOT.pom
[withMaven] artifactsPublisher - Archive artifact windows-jdk8-m3.6.x_build\maven-release-plugin\target\maven-release-plugin-3.0.0-SNAPSHOT.jar
under org\apache\maven\plugins\maven-release-plugin\3.0.0-SNAPSHOT\maven-release-plugin-3.0.0-SNAPSHOT.jar
[withMaven] artifactsPublisher - Archive artifact windows-jdk8-m3.6.x_build\maven-release-policies\maven-release-oddeven-policy\pom.xml
under org\apache\maven\release\maven-release-oddeven-policy\3.0.0-SNAPSHOT\maven-release-oddeven-policy-3.0.0-SNAPSHOT.pom
[withMaven] artifactsPublisher - Archive artifact windows-jdk8-m3.6.x_build\maven-release-policies\maven-release-oddeven-policy\target\maven-release-oddeven-policy-3.0.0-SNAPSHOT.jar
under org\apache\maven\release\maven-release-oddeven-policy\3.0.0-SNAPSHOT\maven-release-oddeven-policy-3.0.0-SNAPSHOT.jar
[withMaven] artifactsPublisher - Archive artifact windows-jdk8-m3.6.x_build\maven-release-policies\maven-release-semver-policy\pom.xml
under org\apache\maven\release\maven-release-semver-policy\3.0.0-SNAPSHOT\maven-release-semver-policy-3.0.0-SNAPSHOT.pom
[withMaven] artifactsPublisher - Archive artifact windows-jdk8-m3.6.x_build\maven-release-policies\maven-release-semver-policy\target\maven-release-semver-policy-3.0.0-SNAPSHOT.jar
under org\apache\maven\release\maven-release-semver-policy\3.0.0-SNAPSHOT\maven-release-semver-policy-3.0.0-SNAPSHOT.jar
[Fast Archiver] No prior successful build to compare, so performing full copy of artifacts
[withMaven] junitPublisher - Archive test results for Maven artifact org.apache.maven.release:maven-release-api:jar:3.0.0-SNAPSHOT
generated by maven-surefire-plugin:test (default-test): windows-jdk8-m3.6.x_build\maven-release-api\target\surefire-reports\*.xml
Recording test results
None of the test reports contained any result
[withMaven] junitPublisher - Archive test results for Maven artifact org.apache.maven.release:maven-release-manager:jar:3.0.0-SNAPSHOT
generated by maven-surefire-plugin:test (default-test): windows-jdk8-m3.6.x_build\maven-release-manager\target\surefire-reports\*.xml
Recording test results
[withMaven] junitPublisher - Archive test results for Maven artifact org.apache.maven.plugins:maven-release-plugin:maven-plugin:3.0.0-SNAPSHOT
generated by maven-surefire-plugin:test (default-test): windows-jdk8-m3.6.x_build\maven-release-plugin\target\surefire-reports\*.xml
Recording test results
[withMaven] junitPublisher - Archive test results for Maven artifact org.apache.maven.release:maven-release-oddeven-policy:jar:3.0.0-SNAPSHOT
generated by maven-surefire-plugin:test (default-test): windows-jdk8-m3.6.x_build\maven-release-policies\maven-release-oddeven-policy\target\surefire-reports\*.xml
Recording test results
[withMaven] junitPublisher - Archive test results for Maven artifact org.apache.maven.release:maven-release-semver-policy:jar:3.0.0-SNAPSHOT
generated by maven-surefire-plugin:test (default-test): windows-jdk8-m3.6.x_build\maven-release-policies\maven-release-semver-policy\target\surefire-reports\*.xml
Recording test results
[withMaven] junitPublisher - Archive test results for Maven artifact org.apache.maven.release:maven-release-manager:jar:3.0.0-SNAPSHOT
generated by maven-failsafe-plugin:integration-test (default): windows-jdk8-m3.6.x_build\maven-release-manager\target\failsafe-reports\*.xml
Recording test results
[withMaven] openTasksPublisher - Scan Tasks for Maven artifact org.apache.maven.release:maven-release-api:jar:3.0.0-SNAPSHOT
in source directory windows-jdk8-m3.6.x_build\maven-release-api\src\main\java
[withMaven] openTasksPublisher - Scan Tasks for Maven artifact org.apache.maven.release:maven-release-manager:jar:3.0.0-SNAPSHOT
in source directory windows-jdk8-m3.6.x_build\maven-release-manager\src\main\java
[withMaven] openTasksPublisher - Scan Tasks for Maven artifact org.apache.maven.plugins:maven-release-plugin:maven-plugin:3.0.0-SNAPSHOT
in source directory windows-jdk8-m3.6.x_build\maven-release-plugin\src\main\java
[withMaven] openTasksPublisher - Scan Tasks for Maven artifact org.apache.maven.release:maven-release-oddeven-policy:jar:3.0.0-SNAPSHOT
in source directory windows-jdk8-m3.6.x_build\maven-release-policies\maven-release-oddeven-policy\src\main\java
[withMaven] openTasksPublisher - Scan Tasks for Maven artifact org.apache.maven.release:maven-release-semver-policy:jar:3.0.0-SNAPSHOT
in source directory windows-jdk8-m3.6.x_build\maven-release-policies\maven-release-semver-policy\src\main\java
[TASKS] Scanning folder 'f:\jenkins\jenkins-slave\workspace\box_maven-release_failOnSnapshot@3'
for files matching the pattern 'windows-jdk8-m3.6.x_build\maven-release-api\src\main\java\**\*,windows-jdk8-m3.6.x_build\maven-release-manager\src\main\java\**\*,windows-jdk8-m3.6.x_build\maven-release-plugin\src\main\java\**\*,windows-jdk8-m3.6.x_build\maven-release-policies\maven-release-oddeven-policy\src\main\java\**\*,windows-jdk8-m3.6.x_build\maven-release-policies\maven-release-semver-policy\src\main\java\**\*'
- excludes: null
[TASKS] Found 130 files to scan for tasks
[TASKS] Found 21 open tasks.
Skipping warnings blame since pipelines do not have an SCM link.%n
[withMaven] invokerPublisher - Archive invoker results for Maven artifact MavenArtifact{org.apache.maven.plugins:maven-release-plugin:maven-plugin:3.0.0-SNAPSHOT(version:
3.0.0-SNAPSHOT, snapshot:false) } generated by PluginInvocation{org.apache.maven.plugins:maven-invoker-plugin:3.2.0@run
 integration-test-prepare}: windows-jdk8-m3.6.x_build\maven-release-plugin\target\invoker-reports\*.xml
[withMaven] Publishers: Generated Artifacts Publisher: 552 ms, Junit Publisher: 3817 ms, Open
Task Scanner Publisher: 821 ms, Dependencies Fingerprint Publisher: 150 ms, Invoker Publisher:
13262 ms, Pipeline Graph Publisher: 5 ms
[Pipeline] // withMaven
[Pipeline] cleanWs
[WS-CLEANUP] Deleting project workspace...
[WS-CLEANUP] Deferred wipeout is used...
[WS-CLEANUP] done
[Pipeline] }
[Pipeline] // stage
[Pipeline] }
[Pipeline] // ws
[Pipeline] }
[Pipeline] // node
[Pipeline] }
[INFO]   The build exited with code 1. See /home/jenkins/jenkins-slave/workspace/box_maven-release_failOnSnapshot@2/linux-jdk7-m3.3.x_build/maven-release-plugin/target/it/setup/maven-project-naming-stub-policy/build.log
for details.
[INFO]           setup/maven-project-naming-stub-policy/pom.xml ... FAILED (1803.0 s)
[INFO] Building: setup/maven-scm-provider-stub/pom.xml
[INFO]   The build exited with code 1. See /home/jenkins/jenkins-slave/workspace/box_maven-release_failOnSnapshot@2/linux-jdk7-m3.3.x_build/maven-release-plugin/target/it/setup/maven-scm-provider-stub/build.log
for details.
[INFO]           setup/maven-scm-provider-stub/pom.xml ............ FAILED (1802.8 s)
[INFO] Building: setup/maven-project-version-stub-policy/pom.xml
[INFO]   The build exited with code 1. See /home/jenkins/jenkins-slave/workspace/box_maven-release_failOnSnapshot@2/linux-jdk7-m3.3.x_build/maven-release-plugin/target/it/setup/maven-project-version-stub-policy/build.log
for details.
[INFO]           setup/maven-project-version-stub-policy/pom.xml .. FAILED (1802.8 s)
[INFO] Building: setup/maven-scm-provider-dummy/pom.xml
[INFO]   The build exited with code 1. See /home/jenkins/jenkins-slave/workspace/box_maven-release_failOnSnapshot@2/linux-jdk7-m3.3.x_build/maven-release-plugin/target/it/setup/maven-scm-provider-dummy/build.log
for details.
[INFO]           setup/maven-scm-provider-dummy/pom.xml ........... FAILED (1802.8 s)
[INFO] Building: setup/maven-wagon-provider-dummy/pom.xml
[INFO]   The build exited with code 1. See /home/jenkins/jenkins-slave/workspace/box_maven-release_failOnSnapshot@2/linux-jdk7-m3.3.x_build/maven-release-plugin/target/it/setup/maven-wagon-provider-dummy/build.log
for details.
[INFO]           setup/maven-wagon-provider-dummy/pom.xml ......... FAILED (1802.6 s)
[INFO] Setup done.
[INFO] Building: projects/branch/MRELEASE-745/pom.xml
Aborted by rfscholte
Sending interrupt signal to process
Sending interrupt signal to process
[INFO] run post-build script verify.groovy
script returned exit code 143
[Pipeline] }
[Pipeline] // dir
[Pipeline] }
[withMaven] One or multiple Maven executions have been ignored by the Jenkins Pipeline Maven
Plugin because they have been interrupted before completion (1). See Pipeline Maven Plugin
FAQ for more details.
[Pipeline] // withMaven
[Pipeline] cleanWs
[WS-CLEANUP] Deleting project workspace...
[WS-CLEANUP] Deferred wipeout is used...
[WS-CLEANUP] done
[Pipeline] cleanWs
[WS-CLEANUP] Deleting project workspace...
[WS-CLEANUP] Deferred wipeout is used...
[WS-CLEANUP] done
[Pipeline] }
[Pipeline] // stage
[Pipeline] }
[Pipeline] // ws
[Pipeline] }
[Pipeline] // node
[Pipeline] }
Failed in branch linux-jdk7-m3.3.x_build
[Pipeline] // parallel
[Pipeline] stage
[Pipeline] { (Notifications)
[Pipeline] echo
Build result: FAILURE
[Pipeline] jiraIssueSelector
[Pipeline] emailext
Mime
  • Unnamed multipart/mixed (inline, None, 0 bytes)
View raw message