maven-notifications mailing list archives

Site index · List index
Message view « Date » · « Thread »
Top « Date » · « Thread »
From Apache Jenkins Server <jenk...@builds.apache.org>
Subject Build failed in Jenkins: Maven TLP » maven-surefire » SUREFIRE-1617 #19
Date Thu, 09 May 2019 19:07:04 GMT
See https://builds.apache.org/job/maven-box/job/maven-surefire/job/SUREFIRE-1617/19/

Changes:

* investigating
* investigating
* investigating
* investigating
* investigating
* investigating
* investigating
* investigating

1 tests failed.
FAILED:  org.apache.maven.surefire.its.UmlautDirIT.surefire1617WithColonInProjectDir

Error Message:
Exit code was non-zero: 1; command line and log = 
/home/jenkins/tools/maven/apache-maven-3.6.0/bin/mvn -e --batch-mode -Dmaven.repo.local=/home/jenkins/jenkins-slave/workspace/box_maven-surefire_SUREFIRE-1617@2/.m2 org.apache.maven.plugins:maven-clean-plugin:clean -Dsurefire.version=3.0.0-SNAPSHOT -Djacoco.agent=-javaagent:/home/jenkins/jenkins-slave/workspace/box_maven-surefire_SUREFIRE-1617@2/.m2/org/jacoco/org.jacoco.agent/0.8.3/org.jacoco.agent-0.8.3-runtime.jar=destfile=/home/jenkins/jenkins-slave/workspace/box_maven-surefire_SUREFIRE-1617@2/surefire-its/target/jacoco-it.exec,append=true,includes=**/failsafe/*:**/failsafe/**/*:**/surefire/*:**/surefire/**/*,inclnolocationclasses=true,jmx=false -Dhttps.protocols=TLSv1,TLSv1.1,TLSv1.2 test
[INFO] Error stacktraces are turned on.
[INFO] Scanning for projects...
[INFO] Downloading from central: https://repo.maven.apache.org/maven2/org/apache/maven/plugins/maven-clean-plugin/3.0.0/maven-clean-plugin-3.0.0.pom
[INFO] Downloaded from central: https://repo.maven.apache.org/maven2/org/apache/maven/plugins/maven-clean-plugin/3.0.0/maven-clean-plugin-3.0.0.pom (4.8 kB at 16 kB/s)
[INFO] Downloading from central: https://repo.maven.apache.org/maven2/org/apache/maven/plugins/maven-plugins/28/maven-plugins-28.pom
[INFO] Downloaded from central: https://repo.maven.apache.org/maven2/org/apache/maven/plugins/maven-plugins/28/maven-plugins-28.pom (12 kB at 633 kB/s)
[INFO] Downloading from central: https://repo.maven.apache.org/maven2/org/apache/maven/plugins/maven-clean-plugin/3.0.0/maven-clean-plugin-3.0.0.jar
[INFO] Downloaded from central: https://repo.maven.apache.org/maven2/org/apache/maven/plugins/maven-clean-plugin/3.0.0/maven-clean-plugin-3.0.0.jar (31 kB at 1.5 MB/s)
[INFO] 
[INFO] ------< org.apache.maven.plugins.surefire:junit-path-with-umlaut >------
[INFO] Building Test path with Ümlaut 1.0-SNAPSHOT
[INFO] --------------------------------[ jar ]---------------------------------
[INFO] Downloading from central: https://repo.maven.apache.org/maven2/org/apache/maven/plugins/maven-resources-plugin/2.6/maven-resources-plugin-2.6.pom
[INFO] Downloaded from central: https://repo.maven.apache.org/maven2/org/apache/maven/plugins/maven-resources-plugin/2.6/maven-resources-plugin-2.6.pom (8.1 kB at 507 kB/s)
[INFO] Downloading from central: https://repo.maven.apache.org/maven2/org/apache/maven/plugins/maven-plugins/23/maven-plugins-23.pom
[INFO] Downloaded from central: https://repo.maven.apache.org/maven2/org/apache/maven/plugins/maven-plugins/23/maven-plugins-23.pom (9.2 kB at 657 kB/s)
[INFO] Downloading from central: https://repo.maven.apache.org/maven2/org/apache/maven/plugins/maven-resources-plugin/2.6/maven-resources-plugin-2.6.jar
[INFO] Downloaded from central: https://repo.maven.apache.org/maven2/org/apache/maven/plugins/maven-resources-plugin/2.6/maven-resources-plugin-2.6.jar (30 kB at 1.7 MB/s)
[INFO] Downloading from central: https://repo.maven.apache.org/maven2/org/apache/maven/plugins/maven-compiler-plugin/3.8.1/maven-compiler-plugin-3.8.1.pom
[INFO] Downloaded from central: https://repo.maven.apache.org/maven2/org/apache/maven/plugins/maven-compiler-plugin/3.8.1/maven-compiler-plugin-3.8.1.pom (12 kB at 891 kB/s)
[INFO] Downloading from central: https://repo.maven.apache.org/maven2/org/apache/maven/plugins/maven-compiler-plugin/3.8.1/maven-compiler-plugin-3.8.1.jar
[INFO] Downloaded from central: https://repo.maven.apache.org/maven2/org/apache/maven/plugins/maven-compiler-plugin/3.8.1/maven-compiler-plugin-3.8.1.jar (62 kB at 2.8 MB/s)
[INFO] 
[INFO] --- maven-clean-plugin:3.0.0:clean (default-cli) @ junit-path-with-umlaut ---
[INFO] 
[INFO] --- maven-resources-plugin:2.6:resources (default-resources) @ junit-path-with-umlaut ---
[INFO] Downloading from central: https://repo.maven.apache.org/maven2/org/codehaus/plexus/plexus-interpolation/1.13/plexus-interpolation-1.13.pom
[INFO] Downloaded from central: https://repo.maven.apache.org/maven2/org/codehaus/plexus/plexus-interpolation/1.13/plexus-interpolation-1.13.pom (890 B at 59 kB/s)
[INFO] Downloading from central: https://repo.maven.apache.org/maven2/org/apache/maven/maven-plugin-api/2.0.6/maven-plugin-api-2.0.6.jar
[INFO] Downloading from central: https://repo.maven.apache.org/maven2/org/apache/maven/maven-profile/2.0.6/maven-profile-2.0.6.jar
[INFO] Downloading from central: https://repo.maven.apache.org/maven2/org/apache/maven/maven-project/2.0.6/maven-project-2.0.6.jar
[INFO] Downloading from central: https://repo.maven.apache.org/maven2/org/apache/maven/maven-artifact-manager/2.0.6/maven-artifact-manager-2.0.6.jar
[INFO] Downloading from central: https://repo.maven.apache.org/maven2/org/apache/maven/maven-plugin-registry/2.0.6/maven-plugin-registry-2.0.6.jar
[INFO] Downloaded from central: https://repo.maven.apache.org/maven2/org/apache/maven/maven-plugin-api/2.0.6/maven-plugin-api-2.0.6.jar (13 kB at 612 kB/s)
[INFO] Downloading from central: https://repo.maven.apache.org/maven2/org/apache/maven/maven-core/2.0.6/maven-core-2.0.6.jar
[INFO] Downloaded from central: https://repo.maven.apache.org/maven2/org/apache/maven/maven-plugin-registry/2.0.6/maven-plugin-registry-2.0.6.jar (29 kB at 567 kB/s)
[INFO] Downloading from central: https://repo.maven.apache.org/maven2/org/apache/maven/maven-plugin-parameter-documenter/2.0.6/maven-plugin-parameter-documenter-2.0.6.jar
[INFO] Downloaded from central: https://repo.maven.apache.org/maven2/org/apache/maven/maven-profile/2.0.6/maven-profile-2.0.6.jar (35 kB at 653 kB/s)
[INFO] Downloading from central: https://repo.maven.apache.org/maven2/org/apache/maven/reporting/maven-reporting-api/2.0.6/maven-reporting-api-2.0.6.jar
[INFO] Downloaded from central: https://repo.maven.apache.org/maven2/org/apache/maven/maven-artifact-manager/2.0.6/maven-artifact-manager-2.0.6.jar (57 kB at 1.0 MB/s)
[INFO] Downloading from central: https://repo.maven.apache.org/maven2/org/apache/maven/doxia/doxia-sink-api/1.0-alpha-7/doxia-sink-api-1.0-alpha-7.jar
[INFO] Downloaded from central: https://repo.maven.apache.org/maven2/org/apache/maven/maven-project/2.0.6/maven-project-2.0.6.jar (116 kB at 1.8 MB/s)
[INFO] Downloading from central: https://repo.maven.apache.org/maven2/org/apache/maven/maven-repository-metadata/2.0.6/maven-repository-metadata-2.0.6.jar
[INFO] Downloaded from central: https://repo.maven.apache.org/maven2/org/apache/maven/maven-core/2.0.6/maven-core-2.0.6.jar (152 kB at 2.3 MB/s)
[INFO] Downloading from central: https://repo.maven.apache.org/maven2/org/apache/maven/maven-error-diagnostics/2.0.6/maven-error-diagnostics-2.0.6.jar
[INFO] Downloaded from central: https://repo.maven.apache.org/maven2/org/apache/maven/reporting/maven-reporting-api/2.0.6/maven-reporting-api-2.0.6.jar (9.9 kB at 146 kB/s)
[INFO] Downloading from central: https://repo.maven.apache.org/maven2/commons-cli/commons-cli/1.0/commons-cli-1.0.jar
[INFO] Downloaded from central: https://repo.maven.apache.org/maven2/org/apache/maven/maven-plugin-parameter-documenter/2.0.6/maven-plugin-parameter-documenter-2.0.6.jar (21 kB at 297 kB/s)
[INFO] Downloaded from central: https://repo.maven.apache.org/maven2/org/apache/maven/doxia/doxia-sink-api/1.0-alpha-7/doxia-sink-api-1.0-alpha-7.jar (5.9 kB at 86 kB/s)
[INFO] Downloading from central: https://repo.maven.apache.org/maven2/org/apache/maven/maven-plugin-descriptor/2.0.6/maven-plugin-descriptor-2.0.6.jar
[INFO] Downloading from central: https://repo.maven.apache.org/maven2/org/apache/maven/maven-artifact/2.0.6/maven-artifact-2.0.6.jar
[INFO] Downloaded from central: https://repo.maven.apache.org/maven2/org/apache/maven/maven-repository-metadata/2.0.6/maven-repository-metadata-2.0.6.jar (24 kB at 314 kB/s)
[INFO] Downloading from central: https://repo.maven.apache.org/maven2/org/apache/maven/maven-settings/2.0.6/maven-settings-2.0.6.jar
[INFO] Downloaded from central: https://repo.maven.apache.org/maven2/org/apache/maven/maven-error-diagnostics/2.0.6/maven-error-diagnostics-2.0.6.jar (14 kB at 172 kB/s)
[INFO] Downloading from central: https://repo.maven.apache.org/maven2/org/apache/maven/maven-model/2.0.6/maven-model-2.0.6.jar
[INFO] Downloaded from central: https://repo.maven.apache.org/maven2/commons-cli/commons-cli/1.0/commons-cli-1.0.jar (30 kB at 359 kB/s)
[INFO] Downloading from central: https://repo.maven.apache.org/maven2/org/apache/maven/maven-monitor/2.0.6/maven-monitor-2.0.6.jar
[INFO] Downloaded from central: https://repo.maven.apache.org/maven2/org/apache/maven/maven-plugin-descriptor/2.0.6/maven-plugin-descriptor-2.0.6.jar (37 kB at 429 kB/s)
[INFO] Downloading from central: https://repo.maven.apache.org/maven2/org/codehaus/plexus/plexus-utils/2.0.5/plexus-utils-2.0.5.jar
[INFO] Downloaded from central: https://repo.maven.apache.org/maven2/org/apache/maven/maven-artifact/2.0.6/maven-artifact-2.0.6.jar (87 kB at 960 kB/s)
[INFO] Downloading from central: https://repo.maven.apache.org/maven2/org/codehaus/plexus/plexus-interpolation/1.13/plexus-interpolation-1.13.jar
[INFO] Downloaded from central: https://repo.maven.apache.org/maven2/org/apache/maven/maven-settings/2.0.6/maven-settings-2.0.6.jar (49 kB at 522 kB/s)
[INFO] Downloaded from central: https://repo.maven.apache.org/maven2/org/apache/maven/maven-monitor/2.0.6/maven-monitor-2.0.6.jar (10 kB at 106 kB/s)
[INFO] Downloaded from central: https://repo.maven.apache.org/maven2/org/apache/maven/maven-model/2.0.6/maven-model-2.0.6.jar (86 kB at 864 kB/s)
[INFO] Downloaded from central: https://repo.maven.apache.org/maven2/org/codehaus/plexus/plexus-interpolation/1.13/plexus-interpolation-1.13.jar (61 kB at 560 kB/s)
[INFO] Downloaded from central: https://repo.maven.apache.org/maven2/org/codehaus/plexus/plexus-utils/2.0.5/plexus-utils-2.0.5.jar (223 kB at 1.9 MB/s)
[WARNING] Using platform encoding (ISO-8859-1 actually) to copy filtered resources, i.e. build is platform dependent!
[INFO] skip non existing resourceDirectory /home/jenkins/jenkins-slave/workspace/box_maven-surefire_SUREFIRE-1617@2/surefire-its/target/this is: a testsurefire-1617/src/main/resources
[INFO] 
[INFO] --- maven-compiler-plugin:3.8.1:compile (default-compile) @ junit-path-with-umlaut ---
[INFO] Downloading from central: https://repo.maven.apache.org/maven2/org/codehaus/plexus/plexus-java/0.9.10/plexus-java-0.9.10.pom
[INFO] Downloaded from central: https://repo.maven.apache.org/maven2/org/codehaus/plexus/plexus-java/0.9.10/plexus-java-0.9.10.pom (5.1 kB at 365 kB/s)
[INFO] Downloading from central: https://repo.maven.apache.org/maven2/org/codehaus/plexus/plexus-languages/0.9.10/plexus-languages-0.9.10.pom
[INFO] Downloaded from central: https://repo.maven.apache.org/maven2/org/codehaus/plexus/plexus-languages/0.9.10/plexus-languages-0.9.10.pom (4.1 kB at 296 kB/s)
[INFO] Downloading from central: https://repo.maven.apache.org/maven2/org/codehaus/plexus/plexus-compiler-api/2.8.4/plexus-compiler-api-2.8.4.pom
[INFO] Downloaded from central: https://repo.maven.apache.org/maven2/org/codehaus/plexus/plexus-compiler-api/2.8.4/plexus-compiler-api-2.8.4.pom (867 B at 62 kB/s)
[INFO] Downloading from central: https://repo.maven.apache.org/maven2/org/codehaus/plexus/plexus-compiler/2.8.4/plexus-compiler-2.8.4.pom
[INFO] Downloaded from central: https://repo.maven.apache.org/maven2/org/codehaus/plexus/plexus-compiler/2.8.4/plexus-compiler-2.8.4.pom (6.0 kB at 431 kB/s)
[INFO] Downloading from central: https://repo.maven.apache.org/maven2/org/codehaus/plexus/plexus-compiler-manager/2.8.4/plexus-compiler-manager-2.8.4.pom
[INFO] Downloaded from central: https://repo.maven.apache.org/maven2/org/codehaus/plexus/plexus-compiler-manager/2.8.4/plexus-compiler-manager-2.8.4.pom (692 B at 46 kB/s)
[INFO] Downloading from central: https://repo.maven.apache.org/maven2/org/codehaus/plexus/plexus-compiler-javac/2.8.4/plexus-compiler-javac-2.8.4.pom
[INFO] Downloaded from central: https://repo.maven.apache.org/maven2/org/codehaus/plexus/plexus-compiler-javac/2.8.4/plexus-compiler-javac-2.8.4.pom (771 B at 31 kB/s)
[INFO] Downloading from central: https://repo.maven.apache.org/maven2/org/codehaus/plexus/plexus-compilers/2.8.4/plexus-compilers-2.8.4.pom
[INFO] Downloaded from central: https://repo.maven.apache.org/maven2/org/codehaus/plexus/plexus-compilers/2.8.4/plexus-compilers-2.8.4.pom (1.3 kB at 103 kB/s)
[INFO] Downloading from central: https://repo.maven.apache.org/maven2/org/codehaus/plexus/plexus-java/0.9.10/plexus-java-0.9.10.jar
[INFO] Downloading from central: https://repo.maven.apache.org/maven2/org/codehaus/plexus/plexus-compiler-api/2.8.4/plexus-compiler-api-2.8.4.jar
[INFO] Downloading from central: https://repo.maven.apache.org/maven2/org/codehaus/plexus/plexus-compiler-javac/2.8.4/plexus-compiler-javac-2.8.4.jar
[INFO] Downloading from central: https://repo.maven.apache.org/maven2/org/codehaus/plexus/plexus-compiler-manager/2.8.4/plexus-compiler-manager-2.8.4.jar
[INFO] Downloaded from central: https://repo.maven.apache.org/maven2/org/codehaus/plexus/plexus-compiler-manager/2.8.4/plexus-compiler-manager-2.8.4.jar (4.7 kB at 294 kB/s)
[INFO] Downloaded from central: https://repo.maven.apache.org/maven2/org/codehaus/plexus/plexus-compiler-javac/2.8.4/plexus-compiler-javac-2.8.4.jar (21 kB at 1.3 MB/s)
[INFO] Downloaded from central: https://repo.maven.apache.org/maven2/org/codehaus/plexus/plexus-compiler-api/2.8.4/plexus-compiler-api-2.8.4.jar (27 kB at 1.5 MB/s)
[INFO] Downloaded from central: https://repo.maven.apache.org/maven2/org/codehaus/plexus/plexus-java/0.9.10/plexus-java-0.9.10.jar (39 kB at 2.0 MB/s)
[INFO] No sources to compile
[INFO] 
[INFO] --- maven-resources-plugin:2.6:testResources (default-testResources) @ junit-path-with-umlaut ---
[WARNING] Using platform encoding (ISO-8859-1 actually) to copy filtered resources, i.e. build is platform dependent!
[INFO] skip non existing resourceDirectory /home/jenkins/jenkins-slave/workspace/box_maven-surefire_SUREFIRE-1617@2/surefire-its/target/this is: a testsurefire-1617/src/test/resources
[INFO] 
[INFO] --- maven-compiler-plugin:3.8.1:testCompile (default-testCompile) @ junit-path-with-umlaut ---
[INFO] Changes detected - recompiling the module!
[WARNING] File encoding has not been set, using platform encoding ISO-8859-1, i.e. build is platform dependent!
[INFO] Compiling 1 source file to /home/jenkins/jenkins-slave/workspace/box_maven-surefire_SUREFIRE-1617@2/surefire-its/target/this is: a testsurefire-1617/target/test-classes
[INFO] 
[INFO] --- maven-surefire-plugin:3.0.0-SNAPSHOT:test (default-test) @ junit-path-with-umlaut ---
[INFO] Downloading from central: https://repo.maven.apache.org/maven2/org/codehaus/plexus/plexus-utils/1.1/plexus-utils-1.1.jar
[INFO] Downloaded from central: https://repo.maven.apache.org/maven2/org/codehaus/plexus/plexus-utils/1.1/plexus-utils-1.1.jar (169 kB at 5.8 MB/s)
[INFO] Surefire report directory: /home/jenkins/jenkins-slave/workspace/box_maven-surefire_SUREFIRE-1617@2/surefire-its/target/this is: a testsurefire-1617/target/surefire-reports
[INFO] 
[INFO] -------------------------------------------------------
[INFO]  T E S T S
[INFO] -------------------------------------------------------
[INFO] 
[INFO] Results:
[INFO] 
[INFO] Tests run: 0, Failures: 0, Errors: 0, Skipped: 0
[INFO] 
[INFO] ------------------------------------------------------------------------
[INFO] BUILD FAILURE
[INFO] ------------------------------------------------------------------------
[INFO] Total time:  3.462 s
[INFO] Finished at: 2019-05-09T19:00:39Z
[INFO] ------------------------------------------------------------------------
[ERROR] Failed to execute goal org.apache.maven.plugins:maven-surefire-plugin:3.0.0-SNAPSHOT:test (default-test) on project junit-path-with-umlaut: There are test failures.
[ERROR] 
[ERROR] Please refer to /home/jenkins/jenkins-slave/workspace/box_maven-surefire_SUREFIRE-1617@2/surefire-its/target/this is: a testsurefire-1617/target/surefire-reports for the individual test results.
[ERROR] Please refer to dump files (if any exist) [date].dump, [date]-jvmRun[N].dump and [date].dumpstream.
[ERROR] The forked VM terminated without properly saying goodbye. VM crash or System.exit called?
[ERROR] Command was /bin/sh -c cd "/home/jenkins/jenkins-slave/workspace/box_maven-surefire_SUREFIRE-1617@2/surefire-its/target/this is: a testsurefire-1617" && /usr/local/asfpackages/java/openjdk-12-ea+33/bin/java -jar '/home/jenkins/jenkins-slave/workspace/box_maven-surefire_SUREFIRE-1617@2/surefire-its/target/this is: a testsurefire-1617/target/surefire/surefirebooter2744970329963363675.jar' '/home/jenkins/jenkins-slave/workspace/box_maven-surefire_SUREFIRE-1617@2/surefire-its/target/this is: a testsurefire-1617/target/surefire' 2019-05-09T19-00-38_822-jvmRun1 surefire14073523476079244179tmp surefire_04300831301545990506tmp
[ERROR] Error occurred in starting fork, check output in log
[ERROR] Process Exit Code: 1
[ERROR] org.apache.maven.surefire.booter.SurefireBooterForkException: The forked VM terminated without properly saying goodbye. VM crash or System.exit called?
[ERROR] Command was /bin/sh -c cd "/home/jenkins/jenkins-slave/workspace/box_maven-surefire_SUREFIRE-1617@2/surefire-its/target/this is: a testsurefire-1617" && /usr/local/asfpackages/java/openjdk-12-ea+33/bin/java -jar '/home/jenkins/jenkins-slave/workspace/box_maven-surefire_SUREFIRE-1617@2/surefire-its/target/this is: a testsurefire-1617/target/surefire/surefirebooter2744970329963363675.jar' '/home/jenkins/jenkins-slave/workspace/box_maven-surefire_SUREFIRE-1617@2/surefire-its/target/this is: a testsurefire-1617/target/surefire' 2019-05-09T19-00-38_822-jvmRun1 surefire14073523476079244179tmp surefire_04300831301545990506tmp
[ERROR] Error occurred in starting fork, check output in log
[ERROR] Process Exit Code: 1
[ERROR]  at org.apache.maven.plugin.surefire.booterclient.ForkStarter.fork(ForkStarter.java:690)
[ERROR]  at org.apache.maven.plugin.surefire.booterclient.ForkStarter.run(ForkStarter.java:285)
[ERROR]  at org.apache.maven.plugin.surefire.booterclient.ForkStarter.run(ForkStarter.java:248)
[ERROR]  at org.apache.maven.plugin.surefire.AbstractSurefireMojo.executeProvider(AbstractSurefireMojo.java:1191)
[ERROR]  at org.apache.maven.plugin.surefire.AbstractSurefireMojo.executeAfterPreconditionsChecked(AbstractSurefireMojo.java:1038)
[ERROR]  at org.apache.maven.plugin.surefire.AbstractSurefireMojo.execute(AbstractSurefireMojo.java:865)
[ERROR]  at org.apache.maven.plugin.DefaultBuildPluginManager.executeMojo(DefaultBuildPluginManager.java:137)
[ERROR]  at org.apache.maven.lifecycle.internal.MojoExecutor.execute(MojoExecutor.java:210)
[ERROR]  at org.apache.maven.lifecycle.internal.MojoExecutor.execute(MojoExecutor.java:156)
[ERROR]  at org.apache.maven.lifecycle.internal.MojoExecutor.execute(MojoExecutor.java:148)
[ERROR]  at org.apache.maven.lifecycle.internal.LifecycleModuleBuilder.buildProject(LifecycleModuleBuilder.java:117)
[ERROR]  at org.apache.maven.lifecycle.internal.LifecycleModuleBuilder.buildProject(LifecycleModuleBuilder.java:81)
[ERROR]  at org.apache.maven.lifecycle.internal.builder.singlethreaded.SingleThreadedBuilder.build(SingleThreadedBuilder.java:56)
[ERROR]  at org.apache.maven.lifecycle.internal.LifecycleStarter.execute(LifecycleStarter.java:128)
[ERROR]  at org.apache.maven.DefaultMaven.doExecute(DefaultMaven.java:305)
[ERROR]  at org.apache.maven.DefaultMaven.doExecute(DefaultMaven.java:192)
[ERROR]  at org.apache.maven.DefaultMaven.execute(DefaultMaven.java:105)
[ERROR]  at org.apache.maven.cli.MavenCli.execute(MavenCli.java:956)
[ERROR]  at org.apache.maven.cli.MavenCli.doMain(MavenCli.java:288)
[ERROR]  at org.apache.maven.cli.MavenCli.main(MavenCli.java:192)
[ERROR]  at java.base/jdk.internal.reflect.NativeMethodAccessorImpl.invoke0(Native Method)
[ERROR]  at java.base/jdk.internal.reflect.NativeMethodAccessorImpl.invoke(NativeMethodAccessorImpl.java:62)
[ERROR]  at java.base/jdk.internal.reflect.DelegatingMethodAccessorImpl.invoke(DelegatingMethodAccessorImpl.java:43)
[ERROR]  at java.base/java.lang.reflect.Method.invoke(Method.java:567)
[ERROR]  at org.codehaus.plexus.classworlds.launcher.Launcher.launchEnhanced(Launcher.java:289)
[ERROR]  at org.codehaus.plexus.classworlds.launcher.Launcher.launch(Launcher.java:229)
[ERROR]  at org.codehaus.plexus.classworlds.launcher.Launcher.mainWithExitCode(Launcher.java:415)
[ERROR]  at org.codehaus.plexus.classworlds.launcher.Launcher.main(Launcher.java:356)
[ERROR] -> [Help 1]
org.apache.maven.lifecycle.LifecycleExecutionException: Failed to execute goal org.apache.maven.plugins:maven-surefire-plugin:3.0.0-SNAPSHOT:test (default-test) on project junit-path-with-umlaut: There are test failures.

Please refer to /home/jenkins/jenkins-slave/workspace/box_maven-surefire_SUREFIRE-1617@2/surefire-its/target/this is: a testsurefire-1617/target/surefire-reports for the individual test results.
Please refer to dump files (if any exist) [date].dump, [date]-jvmRun[N].dump and [date].dumpstream.
The forked VM terminated without properly saying goodbye. VM crash or System.exit called?
Command was /bin/sh -c cd "/home/jenkins/jenkins-slave/workspace/box_maven-surefire_SUREFIRE-1617@2/surefire-its/target/this is: a testsurefire-1617" && /usr/local/asfpackages/java/openjdk-12-ea+33/bin/java -jar '/home/jenkins/jenkins-slave/workspace/box_maven-surefire_SUREFIRE-1617@2/surefire-its/target/this is: a testsurefire-1617/target/surefire/surefirebooter2744970329963363675.jar' '/home/jenkins/jenkins-slave/workspace/box_maven-surefire_SUREFIRE-1617@2/surefire-its/target/this is: a testsurefire-1617/target/surefire' 2019-05-09T19-00-38_822-jvmRun1 surefire14073523476079244179tmp surefire_04300831301545990506tmp
Error occurred in starting fork, check output in log
Process Exit Code: 1
org.apache.maven.surefire.booter.SurefireBooterForkException: The forked VM terminated without properly saying goodbye. VM crash or System.exit called?
Command was /bin/sh -c cd "/home/jenkins/jenkins-slave/workspace/box_maven-surefire_SUREFIRE-1617@2/surefire-its/target/this is: a testsurefire-1617" && /usr/local/asfpackages/java/openjdk-12-ea+33/bin/java -jar '/home/jenkins/jenkins-slave/workspace/box_maven-surefire_SUREFIRE-1617@2/surefire-its/target/this is: a testsurefire-1617/target/surefire/surefirebooter2744970329963363675.jar' '/home/jenkins/jenkins-slave/workspace/box_maven-surefire_SUREFIRE-1617@2/surefire-its/target/this is: a testsurefire-1617/target/surefire' 2019-05-09T19-00-38_822-jvmRun1 surefire14073523476079244179tmp surefire_04300831301545990506tmp
Error occurred in starting fork, check output in log
Process Exit Code: 1
 at org.apache.maven.plugin.surefire.booterclient.ForkStarter.fork(ForkStarter.java:690)
 at org.apache.maven.plugin.surefire.booterclient.ForkStarter.run(ForkStarter.java:285)
 at org.apache.maven.plugin.surefire.booterclient.ForkStarter.run(ForkStarter.java:248)
 at org.apache.maven.plugin.surefire.AbstractSurefireMojo.executeProvider(AbstractSurefireMojo.java:1191)
 at org.apache.maven.plugin.surefire.AbstractSurefireMojo.executeAfterPreconditionsChecked(AbstractSurefireMojo.java:1038)
 at org.apache.maven.plugin.surefire.AbstractSurefireMojo.execute(AbstractSurefireMojo.java:865)
 at org.apache.maven.plugin.DefaultBuildPluginManager.executeMojo(DefaultBuildPluginManager.java:137)
 at org.apache.maven.lifecycle.internal.MojoExecutor.execute(MojoExecutor.java:210)
 at org.apache.maven.lifecycle.internal.MojoExecutor.execute(MojoExecutor.java:156)
 at org.apache.maven.lifecycle.internal.MojoExecutor.execute(MojoExecutor.java:148)
 at org.apache.maven.lifecycle.internal.LifecycleModuleBuilder.buildProject(LifecycleModuleBuilder.java:117)
 at org.apache.maven.lifecycle.internal.LifecycleModuleBuilder.buildProject(LifecycleModuleBuilder.java:81)
 at org.apache.maven.lifecycle.internal.builder.singlethreaded.SingleThreadedBuilder.build(SingleThreadedBuilder.java:56)
 at org.apache.maven.lifecycle.internal.LifecycleStarter.execute(LifecycleStarter.java:128)
 at org.apache.maven.DefaultMaven.doExecute(DefaultMaven.java:305)
 at org.apache.maven.DefaultMaven.doExecute(DefaultMaven.java:192)
 at org.apache.maven.DefaultMaven.execute(DefaultMaven.java:105)
 at org.apache.maven.cli.MavenCli.execute(MavenCli.java:956)
 at org.apache.maven.cli.MavenCli.doMain(MavenCli.java:288)
 at org.apache.maven.cli.MavenCli.main(MavenCli.java:192)
 at java.base/jdk.internal.reflect.NativeMethodAccessorImpl.invoke0(Native Method)
 at java.base/jdk.internal.reflect.NativeMethodAccessorImpl.invoke(NativeMethodAccessorImpl.java:62)
 at java.base/jdk.internal.reflect.DelegatingMethodAccessorImpl.invoke(DelegatingMethodAccessorImpl.java:43)
 at java.base/java.lang.reflect.Method.invoke(Method.java:567)
 at org.codehaus.plexus.classworlds.launcher.Launcher.launchEnhanced(Launcher.java:289)
 at org.codehaus.plexus.classworlds.launcher.Launcher.launch(Launcher.java:229)
 at org.codehaus.plexus.classworlds.launcher.Launcher.mainWithExitCode(Launcher.java:415)
 at org.codehaus.plexus.classworlds.launcher.Launcher.main(Launcher.java:356)

    at org.apache.maven.lifecycle.internal.MojoExecutor.execute (MojoExecutor.java:215)
    at org.apache.maven.lifecycle.internal.MojoExecutor.execute (MojoExecutor.java:156)
    at org.apache.maven.lifecycle.internal.MojoExecutor.execute (MojoExecutor.java:148)
    at org.apache.maven.lifecycle.internal.LifecycleModuleBuilder.buildProject (LifecycleModuleBuilder.java:117)
    at org.apache.maven.lifecycle.internal.LifecycleModuleBuilder.buildProject (LifecycleModuleBuilder.java:81)
    at org.apache.maven.lifecycle.internal.builder.singlethreaded.SingleThreadedBuilder.build (SingleThreadedBuilder.java:56)
    at org.apache.maven.lifecycle.internal.LifecycleStarter.execute (LifecycleStarter.java:128)
    at org.apache.maven.DefaultMaven.doExecute (DefaultMaven.java:305)
    at org.apache.maven.DefaultMaven.doExecute (DefaultMaven.java:192)
    at org.apache.maven.DefaultMaven.execute (DefaultMaven.java:105)
    at org.apache.maven.cli.MavenCli.execute (MavenCli.java:956)
    at org.apache.maven.cli.MavenCli.doMain (MavenCli.java:288)
    at org.apache.maven.cli.MavenCli.main (MavenCli.java:192)
    at jdk.internal.reflect.NativeMethodAccessorImpl.invoke0 (Native Method)
    at jdk.internal.reflect.NativeMethodAccessorImpl.invoke (NativeMethodAccessorImpl.java:62)
    at jdk.internal.reflect.DelegatingMethodAccessorImpl.invoke (DelegatingMethodAccessorImpl.java:43)
    at java.lang.reflect.Method.invoke (Method.java:567)
    at org.codehaus.plexus.classworlds.launcher.Launcher.launchEnhanced (Launcher.java:289)
    at org.codehaus.plexus.classworlds.launcher.Launcher.launch (Launcher.java:229)
    at org.codehaus.plexus.classworlds.launcher.Launcher.mainWithExitCode (Launcher.java:415)
    at org.codehaus.plexus.classworlds.launcher.Launcher.main (Launcher.java:356)
Caused by: org.apache.maven.plugin.MojoExecutionException: There are test failures.

Please refer to /home/jenkins/jenkins-slave/workspace/box_maven-surefire_SUREFIRE-1617@2/surefire-its/target/this is: a testsurefire-1617/target/surefire-reports for the individual test results.
Please refer to dump files (if any exist) [date].dump, [date]-jvmRun[N].dump and [date].dumpstream.
The forked VM terminated without properly saying goodbye. VM crash or System.exit called?
Command was /bin/sh -c cd "/home/jenkins/jenkins-slave/workspace/box_maven-surefire_SUREFIRE-1617@2/surefire-its/target/this is: a testsurefire-1617" && /usr/local/asfpackages/java/openjdk-12-ea+33/bin/java -jar '/home/jenkins/jenkins-slave/workspace/box_maven-surefire_SUREFIRE-1617@2/surefire-its/target/this is: a testsurefire-1617/target/surefire/surefirebooter2744970329963363675.jar' '/home/jenkins/jenkins-slave/workspace/box_maven-surefire_SUREFIRE-1617@2/surefire-its/target/this is: a testsurefire-1617/target/surefire' 2019-05-09T19-00-38_822-jvmRun1 surefire14073523476079244179tmp surefire_04300831301545990506tmp
Error occurred in starting fork, check output in log
Process Exit Code: 1
org.apache.maven.surefire.booter.SurefireBooterForkException: The forked VM terminated without properly saying goodbye. VM crash or System.exit called?
Command was /bin/sh -c cd "/home/jenkins/jenkins-slave/workspace/box_maven-surefire_SUREFIRE-1617@2/surefire-its/target/this is: a testsurefire-1617" && /usr/local/asfpackages/java/openjdk-12-ea+33/bin/java -jar '/home/jenkins/jenkins-slave/workspace/box_maven-surefire_SUREFIRE-1617@2/surefire-its/target/this is: a testsurefire-1617/target/surefire/surefirebooter2744970329963363675.jar' '/home/jenkins/jenkins-slave/workspace/box_maven-surefire_SUREFIRE-1617@2/surefire-its/target/this is: a testsurefire-1617/target/surefire' 2019-05-09T19-00-38_822-jvmRun1 surefire14073523476079244179tmp surefire_04300831301545990506tmp
Error occurred in starting fork, check output in log
Process Exit Code: 1
 at org.apache.maven.plugin.surefire.booterclient.ForkStarter.fork(ForkStarter.java:690)
 at org.apache.maven.plugin.surefire.booterclient.ForkStarter.run(ForkStarter.java:285)
 at org.apache.maven.plugin.surefire.booterclient.ForkStarter.run(ForkStarter.java:248)
 at org.apache.maven.plugin.surefire.AbstractSurefireMojo.executeProvider(AbstractSurefireMojo.java:1191)
 at org.apache.maven.plugin.surefire.AbstractSurefireMojo.executeAfterPreconditionsChecked(AbstractSurefireMojo.java:1038)
 at org.apache.maven.plugin.surefire.AbstractSurefireMojo.execute(AbstractSurefireMojo.java:865)
 at org.apache.maven.plugin.DefaultBuildPluginManager.executeMojo(DefaultBuildPluginManager.java:137)
 at org.apache.maven.lifecycle.internal.MojoExecutor.execute(MojoExecutor.java:210)
 at org.apache.maven.lifecycle.internal.MojoExecutor.execute(MojoExecutor.java:156)
 at org.apache.maven.lifecycle.internal.MojoExecutor.execute(MojoExecutor.java:148)
 at org.apache.maven.lifecycle.internal.LifecycleModuleBuilder.buildProject(LifecycleModuleBuilder.java:117)
 at org.apache.maven.lifecycle.internal.LifecycleModuleBuilder.buildProject(LifecycleModuleBuilder.java:81)
 at org.apache.maven.lifecycle.internal.builder.singlethreaded.SingleThreadedBuilder.build(SingleThreadedBuilder.java:56)
 at org.apache.maven.lifecycle.internal.LifecycleStarter.execute(LifecycleStarter.java:128)
 at org.apache.maven.DefaultMaven.doExecute(DefaultMaven.java:305)
 at org.apache.maven.DefaultMaven.doExecute(DefaultMaven.java:192)
 at org.apache.maven.DefaultMaven.execute(DefaultMaven.java:105)
 at org.apache.maven.cli.MavenCli.execute(MavenCli.java:956)
 at org.apache.maven.cli.MavenCli.doMain(MavenCli.java:288)
 at org.apache.maven.cli.MavenCli.main(MavenCli.java:192)
 at java.base/jdk.internal.reflect.NativeMethodAccessorImpl.invoke0(Native Method)
 at java.base/jdk.internal.reflect.NativeMethodAccessorImpl.invoke(NativeMethodAccessorImpl.java:62)
 at java.base/jdk.internal.reflect.DelegatingMethodAccessorImpl.invoke(DelegatingMethodAccessorImpl.java:43)
 at java.base/java.lang.reflect.Method.invoke(Method.java:567)
 at org.codehaus.plexus.classworlds.launcher.Launcher.launchEnhanced(Launcher.java:289)
 at org.codehaus.plexus.classworlds.launcher.Launcher.launch(Launcher.java:229)
 at org.codehaus.plexus.classworlds.launcher.Launcher.mainWithExitCode(Launcher.java:415)
 at org.codehaus.plexus.classworlds.launcher.Launcher.main(Launcher.java:356)

    at org.apache.maven.plugin.surefire.SurefireHelper.throwException (SurefireHelper.java:266)
    at org.apache.maven.plugin.surefire.SurefireHelper.reportExecution (SurefireHelper.java:159)
    at org.apache.maven.plugin.surefire.SurefirePlugin.handleSummary (SurefirePlugin.java:377)
    at org.apache.maven.plugin.surefire.AbstractSurefireMojo.executeAfterPreconditionsChecked (AbstractSurefireMojo.java:1054)
    at org.apache.maven.plugin.surefire.AbstractSurefireMojo.execute (AbstractSurefireMojo.java:865)
    at org.apache.maven.plugin.DefaultBuildPluginManager.executeMojo (DefaultBuildPluginManager.java:137)
    at org.apache.maven.lifecycle.internal.MojoExecutor.execute (MojoExecutor.java:210)
    at org.apache.maven.lifecycle.internal.MojoExecutor.execute (MojoExecutor.java:156)
    at org.apache.maven.lifecycle.internal.MojoExecutor.execute (MojoExecutor.java:148)
    at org.apache.maven.lifecycle.internal.LifecycleModuleBuilder.buildProject (LifecycleModuleBuilder.java:117)
    at org.apache.maven.lifecycle.internal.LifecycleModuleBuilder.buildProject (LifecycleModuleBuilder.java:81)
    at org.apache.maven.lifecycle.internal.builder.singlethreaded.SingleThreadedBuilder.build (SingleThreadedBuilder.java:56)
    at org.apache.maven.lifecycle.internal.LifecycleStarter.execute (LifecycleStarter.java:128)
    at org.apache.maven.DefaultMaven.doExecute (DefaultMaven.java:305)
    at org.apache.maven.DefaultMaven.doExecute (DefaultMaven.java:192)
    at org.apache.maven.DefaultMaven.execute (DefaultMaven.java:105)
    at org.apache.maven.cli.MavenCli.execute (MavenCli.java:956)
    at org.apache.maven.cli.MavenCli.doMain (MavenCli.java:288)
    at org.apache.maven.cli.MavenCli.main (MavenCli.java:192)
    at jdk.internal.reflect.NativeMethodAccessorImpl.invoke0 (Native Method)
    at jdk.internal.reflect.NativeMethodAccessorImpl.invoke (NativeMethodAccessorImpl.java:62)
    at jdk.internal.reflect.DelegatingMethodAccessorImpl.invoke (DelegatingMethodAccessorImpl.java:43)
    at java.lang.reflect.Method.invoke (Method.java:567)
    at org.codehaus.plexus.classworlds.launcher.Launcher.launchEnhanced (Launcher.java:289)
    at org.codehaus.plexus.classworlds.launcher.Launcher.launch (Launcher.java:229)
    at org.codehaus.plexus.classworlds.launcher.Launcher.mainWithExitCode (Launcher.java:415)
    at org.codehaus.plexus.classworlds.launcher.Launcher.main (Launcher.java:356)
Caused by: org.apache.maven.surefire.booter.SurefireBooterForkException: The forked VM terminated without properly saying goodbye. VM crash or System.exit called?
Command was /bin/sh -c cd "/home/jenkins/jenkins-slave/workspace/box_maven-surefire_SUREFIRE-1617@2/surefire-its/target/this is: a testsurefire-1617" && /usr/local/asfpackages/java/openjdk-12-ea+33/bin/java -jar '/home/jenkins/jenkins-slave/workspace/box_maven-surefire_SUREFIRE-1617@2/surefire-its/target/this is: a testsurefire-1617/target/surefire/surefirebooter2744970329963363675.jar' '/home/jenkins/jenkins-slave/workspace/box_maven-surefire_SUREFIRE-1617@2/surefire-its/target/this is: a testsurefire-1617/target/surefire' 2019-05-09T19-00-38_822-jvmRun1 surefire14073523476079244179tmp surefire_04300831301545990506tmp
Error occurred in starting fork, check output in log
Process Exit Code: 1
    at org.apache.maven.plugin.surefire.booterclient.ForkStarter.fork (ForkStarter.java:690)
    at org.apache.maven.plugin.surefire.booterclient.ForkStarter.run (ForkStarter.java:285)
    at org.apache.maven.plugin.surefire.booterclient.ForkStarter.run (ForkStarter.java:248)
    at org.apache.maven.plugin.surefire.AbstractSurefireMojo.executeProvider (AbstractSurefireMojo.java:1191)
    at org.apache.maven.plugin.surefire.AbstractSurefireMojo.executeAfterPreconditionsChecked (AbstractSurefireMojo.java:1038)
    at org.apache.maven.plugin.surefire.AbstractSurefireMojo.execute (AbstractSurefireMojo.java:865)
    at org.apache.maven.plugin.DefaultBuildPluginManager.executeMojo (DefaultBuildPluginManager.java:137)
    at org.apache.maven.lifecycle.internal.MojoExecutor.execute (MojoExecutor.java:210)
    at org.apache.maven.lifecycle.internal.MojoExecutor.execute (MojoExecutor.java:156)
    at org.apache.maven.lifecycle.internal.MojoExecutor.execute (MojoExecutor.java:148)
    at org.apache.maven.lifecycle.internal.LifecycleModuleBuilder.buildProject (LifecycleModuleBuilder.java:117)
    at org.apache.maven.lifecycle.internal.LifecycleModuleBuilder.buildProject (LifecycleModuleBuilder.java:81)
    at org.apache.maven.lifecycle.internal.builder.singlethreaded.SingleThreadedBuilder.build (SingleThreadedBuilder.java:56)
    at org.apache.maven.lifecycle.internal.LifecycleStarter.execute (LifecycleStarter.java:128)
    at org.apache.maven.DefaultMaven.doExecute (DefaultMaven.java:305)
    at org.apache.maven.DefaultMaven.doExecute (DefaultMaven.java:192)
    at org.apache.maven.DefaultMaven.execute (DefaultMaven.java:105)
    at org.apache.maven.cli.MavenCli.execute (MavenCli.java:956)
    at org.apache.maven.cli.MavenCli.doMain (MavenCli.java:288)
    at org.apache.maven.cli.MavenCli.main (MavenCli.java:192)
    at jdk.internal.reflect.NativeMethodAccessorImpl.invoke0 (Native Method)
    at jdk.internal.reflect.NativeMethodAccessorImpl.invoke (NativeMethodAccessorImpl.java:62)
    at jdk.internal.reflect.DelegatingMethodAccessorImpl.invoke (DelegatingMethodAccessorImpl.java:43)
    at java.lang.reflect.Method.invoke (Method.java:567)
    at org.codehaus.plexus.classworlds.launcher.Launcher.launchEnhanced (Launcher.java:289)
    at org.codehaus.plexus.classworlds.launcher.Launcher.launch (Launcher.java:229)
    at org.codehaus.plexus.classworlds.launcher.Launcher.mainWithExitCode (Launcher.java:415)
    at org.codehaus.plexus.classworlds.launcher.Launcher.main (Launcher.java:356)
[ERROR] 
[ERROR] Re-run Maven using the -X switch to enable full debug logging.
[ERROR] 
[ERROR] For more information about the errors and possible solutions, please read the following articles:
[ERROR] [Help 1] http://cwiki.apache.org/confluence/display/MAVEN/MojoExecutionException


Stack Trace:
org.apache.maven.surefire.its.fixture.SurefireVerifierException: 
Exit code was non-zero: 1; command line and log = 
/home/jenkins/tools/maven/apache-maven-3.6.0/bin/mvn -e --batch-mode -Dmaven.repo.local=/home/jenkins/jenkins-slave/workspace/box_maven-surefire_SUREFIRE-1617@2/.m2 org.apache.maven.plugins:maven-clean-plugin:clean -Dsurefire.version=3.0.0-SNAPSHOT -Djacoco.agent=-javaagent:/home/jenkins/jenkins-slave/workspace/box_maven-surefire_SUREFIRE-1617@2/.m2/org/jacoco/org.jacoco.agent/0.8.3/org.jacoco.agent-0.8.3-runtime.jar=destfile=/home/jenkins/jenkins-slave/workspace/box_maven-surefire_SUREFIRE-1617@2/surefire-its/target/jacoco-it.exec,append=true,includes=**/failsafe/*:**/failsafe/**/*:**/surefire/*:**/surefire/**/*,inclnolocationclasses=true,jmx=false -Dhttps.protocols=TLSv1,TLSv1.1,TLSv1.2 test
[INFO] Error stacktraces are turned on.
[INFO] Scanning for projects...
[INFO] Downloading from central: https://repo.maven.apache.org/maven2/org/apache/maven/plugins/maven-clean-plugin/3.0.0/maven-clean-plugin-3.0.0.pom
[INFO] Downloaded from central: https://repo.maven.apache.org/maven2/org/apache/maven/plugins/maven-clean-plugin/3.0.0/maven-clean-plugin-3.0.0.pom (4.8 kB at 16 kB/s)
[INFO] Downloading from central: https://repo.maven.apache.org/maven2/org/apache/maven/plugins/maven-plugins/28/maven-plugins-28.pom
[INFO] Downloaded from central: https://repo.maven.apache.org/maven2/org/apache/maven/plugins/maven-plugins/28/maven-plugins-28.pom (12 kB at 633 kB/s)
[INFO] Downloading from central: https://repo.maven.apache.org/maven2/org/apache/maven/plugins/maven-clean-plugin/3.0.0/maven-clean-plugin-3.0.0.jar
[INFO] Downloaded from central: https://repo.maven.apache.org/maven2/org/apache/maven/plugins/maven-clean-plugin/3.0.0/maven-clean-plugin-3.0.0.jar (31 kB at 1.5 MB/s)
[INFO] 
[INFO] ------< org.apache.maven.plugins.surefire:junit-path-with-umlaut >------
[INFO] Building Test path with Ümlaut 1.0-SNAPSHOT
[INFO] --------------------------------[ jar ]---------------------------------
[INFO] Downloading from central: https://repo.maven.apache.org/maven2/org/apache/maven/plugins/maven-resources-plugin/2.6/maven-resources-plugin-2.6.pom
[INFO] Downloaded from central: https://repo.maven.apache.org/maven2/org/apache/maven/plugins/maven-resources-plugin/2.6/maven-resources-plugin-2.6.pom (8.1 kB at 507 kB/s)
[INFO] Downloading from central: https://repo.maven.apache.org/maven2/org/apache/maven/plugins/maven-plugins/23/maven-plugins-23.pom
[INFO] Downloaded from central: https://repo.maven.apache.org/maven2/org/apache/maven/plugins/maven-plugins/23/maven-plugins-23.pom (9.2 kB at 657 kB/s)
[INFO] Downloading from central: https://repo.maven.apache.org/maven2/org/apache/maven/plugins/maven-resources-plugin/2.6/maven-resources-plugin-2.6.jar
[INFO] Downloaded from central: https://repo.maven.apache.org/maven2/org/apache/maven/plugins/maven-resources-plugin/2.6/maven-resources-plugin-2.6.jar (30 kB at 1.7 MB/s)
[INFO] Downloading from central: https://repo.maven.apache.org/maven2/org/apache/maven/plugins/maven-compiler-plugin/3.8.1/maven-compiler-plugin-3.8.1.pom
[INFO] Downloaded from central: https://repo.maven.apache.org/maven2/org/apache/maven/plugins/maven-compiler-plugin/3.8.1/maven-compiler-plugin-3.8.1.pom (12 kB at 891 kB/s)
[INFO] Downloading from central: https://repo.maven.apache.org/maven2/org/apache/maven/plugins/maven-compiler-plugin/3.8.1/maven-compiler-plugin-3.8.1.jar
[INFO] Downloaded from central: https://repo.maven.apache.org/maven2/org/apache/maven/plugins/maven-compiler-plugin/3.8.1/maven-compiler-plugin-3.8.1.jar (62 kB at 2.8 MB/s)
[INFO] 
[INFO] --- maven-clean-plugin:3.0.0:clean (default-cli) @ junit-path-with-umlaut ---
[INFO] 
[INFO] --- maven-resources-plugin:2.6:resources (default-resources) @ junit-path-with-umlaut ---
[INFO] Downloading from central: https://repo.maven.apache.org/maven2/org/codehaus/plexus/plexus-interpolation/1.13/plexus-interpolation-1.13.pom
[INFO] Downloaded from central: https://repo.maven.apache.org/maven2/org/codehaus/plexus/plexus-interpolation/1.13/plexus-interpolation-1.13.pom (890 B at 59 kB/s)
[INFO] Downloading from central: https://repo.maven.apache.org/maven2/org/apache/maven/maven-plugin-api/2.0.6/maven-plugin-api-2.0.6.jar
[INFO] Downloading from central: https://repo.maven.apache.org/maven2/org/apache/maven/maven-profile/2.0.6/maven-profile-2.0.6.jar
[INFO] Downloading from central: https://repo.maven.apache.org/maven2/org/apache/maven/maven-project/2.0.6/maven-project-2.0.6.jar
[INFO] Downloading from central: https://repo.maven.apache.org/maven2/org/apache/maven/maven-artifact-manager/2.0.6/maven-artifact-manager-2.0.6.jar
[INFO] Downloading from central: https://repo.maven.apache.org/maven2/org/apache/maven/maven-plugin-registry/2.0.6/maven-plugin-registry-2.0.6.jar
[INFO] Downloaded from central: https://repo.maven.apache.org/maven2/org/apache/maven/maven-plugin-api/2.0.6/maven-plugin-api-2.0.6.jar (13 kB at 612 kB/s)
[INFO] Downloading from central: https://repo.maven.apache.org/maven2/org/apache/maven/maven-core/2.0.6/maven-core-2.0.6.jar
[INFO] Downloaded from central: https://repo.maven.apache.org/maven2/org/apache/maven/maven-plugin-registry/2.0.6/maven-plugin-registry-2.0.6.jar (29 kB at 567 kB/s)
[INFO] Downloading from central: https://repo.maven.apache.org/maven2/org/apache/maven/maven-plugin-parameter-documenter/2.0.6/maven-plugin-parameter-documenter-2.0.6.jar
[INFO] Downloaded from central: https://repo.maven.apache.org/maven2/org/apache/maven/maven-profile/2.0.6/maven-profile-2.0.6.jar (35 kB at 653 kB/s)
[INFO] Downloading from central: https://repo.maven.apache.org/maven2/org/apache/maven/reporting/maven-reporting-api/2.0.6/maven-reporting-api-2.0.6.jar
[INFO] Downloaded from central: https://repo.maven.apache.org/maven2/org/apache/maven/maven-artifact-manager/2.0.6/maven-artifact-manager-2.0.6.jar (57 kB at 1.0 MB/s)
[INFO] Downloading from central: https://repo.maven.apache.org/maven2/org/apache/maven/doxia/doxia-sink-api/1.0-alpha-7/doxia-sink-api-1.0-alpha-7.jar
[INFO] Downloaded from central: https://repo.maven.apache.org/maven2/org/apache/maven/maven-project/2.0.6/maven-project-2.0.6.jar (116 kB at 1.8 MB/s)
[INFO] Downloading from central: https://repo.maven.apache.org/maven2/org/apache/maven/maven-repository-metadata/2.0.6/maven-repository-metadata-2.0.6.jar
[INFO] Downloaded from central: https://repo.maven.apache.org/maven2/org/apache/maven/maven-core/2.0.6/maven-core-2.0.6.jar (152 kB at 2.3 MB/s)
[INFO] Downloading from central: https://repo.maven.apache.org/maven2/org/apache/maven/maven-error-diagnostics/2.0.6/maven-error-diagnostics-2.0.6.jar
[INFO] Downloaded from central: https://repo.maven.apache.org/maven2/org/apache/maven/reporting/maven-reporting-api/2.0.6/maven-reporting-api-2.0.6.jar (9.9 kB at 146 kB/s)
[INFO] Downloading from central: https://repo.maven.apache.org/maven2/commons-cli/commons-cli/1.0/commons-cli-1.0.jar
[INFO] Downloaded from central: https://repo.maven.apache.org/maven2/org/apache/maven/maven-plugin-parameter-documenter/2.0.6/maven-plugin-parameter-documenter-2.0.6.jar (21 kB at 297 kB/s)
[INFO] Downloaded from central: https://repo.maven.apache.org/maven2/org/apache/maven/doxia/doxia-sink-api/1.0-alpha-7/doxia-sink-api-1.0-alpha-7.jar (5.9 kB at 86 kB/s)
[INFO] Downloading from central: https://repo.maven.apache.org/maven2/org/apache/maven/maven-plugin-descriptor/2.0.6/maven-plugin-descriptor-2.0.6.jar
[INFO] Downloading from central: https://repo.maven.apache.org/maven2/org/apache/maven/maven-artifact/2.0.6/maven-artifact-2.0.6.jar
[INFO] Downloaded from central: https://repo.maven.apache.org/maven2/org/apache/maven/maven-repository-metadata/2.0.6/maven-repository-metadata-2.0.6.jar (24 kB at 314 kB/s)
[INFO] Downloading from central: https://repo.maven.apache.org/maven2/org/apache/maven/maven-settings/2.0.6/maven-settings-2.0.6.jar
[INFO] Downloaded from central: https://repo.maven.apache.org/maven2/org/apache/maven/maven-error-diagnostics/2.0.6/maven-error-diagnostics-2.0.6.jar (14 kB at 172 kB/s)
[INFO] Downloading from central: https://repo.maven.apache.org/maven2/org/apache/maven/maven-model/2.0.6/maven-model-2.0.6.jar
[INFO] Downloaded from central: https://repo.maven.apache.org/maven2/commons-cli/commons-cli/1.0/commons-cli-1.0.jar (30 kB at 359 kB/s)
[INFO] Downloading from central: https://repo.maven.apache.org/maven2/org/apache/maven/maven-monitor/2.0.6/maven-monitor-2.0.6.jar
[INFO] Downloaded from central: https://repo.maven.apache.org/maven2/org/apache/maven/maven-plugin-descriptor/2.0.6/maven-plugin-descriptor-2.0.6.jar (37 kB at 429 kB/s)
[INFO] Downloading from central: https://repo.maven.apache.org/maven2/org/codehaus/plexus/plexus-utils/2.0.5/plexus-utils-2.0.5.jar
[INFO] Downloaded from central: https://repo.maven.apache.org/maven2/org/apache/maven/maven-artifact/2.0.6/maven-artifact-2.0.6.jar (87 kB at 960 kB/s)
[INFO] Downloading from central: https://repo.maven.apache.org/maven2/org/codehaus/plexus/plexus-interpolation/1.13/plexus-interpolation-1.13.jar
[INFO] Downloaded from central: https://repo.maven.apache.org/maven2/org/apache/maven/maven-settings/2.0.6/maven-settings-2.0.6.jar (49 kB at 522 kB/s)
[INFO] Downloaded from central: https://repo.maven.apache.org/maven2/org/apache/maven/maven-monitor/2.0.6/maven-monitor-2.0.6.jar (10 kB at 106 kB/s)
[INFO] Downloaded from central: https://repo.maven.apache.org/maven2/org/apache/maven/maven-model/2.0.6/maven-model-2.0.6.jar (86 kB at 864 kB/s)
[INFO] Downloaded from central: https://repo.maven.apache.org/maven2/org/codehaus/plexus/plexus-interpolation/1.13/plexus-interpolation-1.13.jar (61 kB at 560 kB/s)
[INFO] Downloaded from central: https://repo.maven.apache.org/maven2/org/codehaus/plexus/plexus-utils/2.0.5/plexus-utils-2.0.5.jar (223 kB at 1.9 MB/s)
[WARNING] Using platform encoding (ISO-8859-1 actually) to copy filtered resources, i.e. build is platform dependent!
[INFO] skip non existing resourceDirectory /home/jenkins/jenkins-slave/workspace/box_maven-surefire_SUREFIRE-1617@2/surefire-its/target/this is: a testsurefire-1617/src/main/resources
[INFO] 
[INFO] --- maven-compiler-plugin:3.8.1:compile (default-compile) @ junit-path-with-umlaut ---
[INFO] Downloading from central: https://repo.maven.apache.org/maven2/org/codehaus/plexus/plexus-java/0.9.10/plexus-java-0.9.10.pom
[INFO] Downloaded from central: https://repo.maven.apache.org/maven2/org/codehaus/plexus/plexus-java/0.9.10/plexus-java-0.9.10.pom (5.1 kB at 365 kB/s)
[INFO] Downloading from central: https://repo.maven.apache.org/maven2/org/codehaus/plexus/plexus-languages/0.9.10/plexus-languages-0.9.10.pom
[INFO] Downloaded from central: https://repo.maven.apache.org/maven2/org/codehaus/plexus/plexus-languages/0.9.10/plexus-languages-0.9.10.pom (4.1 kB at 296 kB/s)
[INFO] Downloading from central: https://repo.maven.apache.org/maven2/org/codehaus/plexus/plexus-compiler-api/2.8.4/plexus-compiler-api-2.8.4.pom
[INFO] Downloaded from central: https://repo.maven.apache.org/maven2/org/codehaus/plexus/plexus-compiler-api/2.8.4/plexus-compiler-api-2.8.4.pom (867 B at 62 kB/s)
[INFO] Downloading from central: https://repo.maven.apache.org/maven2/org/codehaus/plexus/plexus-compiler/2.8.4/plexus-compiler-2.8.4.pom
[INFO] Downloaded from central: https://repo.maven.apache.org/maven2/org/codehaus/plexus/plexus-compiler/2.8.4/plexus-compiler-2.8.4.pom (6.0 kB at 431 kB/s)
[INFO] Downloading from central: https://repo.maven.apache.org/maven2/org/codehaus/plexus/plexus-compiler-manager/2.8.4/plexus-compiler-manager-2.8.4.pom
[INFO] Downloaded from central: https://repo.maven.apache.org/maven2/org/codehaus/plexus/plexus-compiler-manager/2.8.4/plexus-compiler-manager-2.8.4.pom (692 B at 46 kB/s)
[INFO] Downloading from central: https://repo.maven.apache.org/maven2/org/codehaus/plexus/plexus-compiler-javac/2.8.4/plexus-compiler-javac-2.8.4.pom
[INFO] Downloaded from central: https://repo.maven.apache.org/maven2/org/codehaus/plexus/plexus-compiler-javac/2.8.4/plexus-compiler-javac-2.8.4.pom (771 B at 31 kB/s)
[INFO] Downloading from central: https://repo.maven.apache.org/maven2/org/codehaus/plexus/plexus-compilers/2.8.4/plexus-compilers-2.8.4.pom
[INFO] Downloaded from central: https://repo.maven.apache.org/maven2/org/codehaus/plexus/plexus-compilers/2.8.4/plexus-compilers-2.8.4.pom (1.3 kB at 103 kB/s)
[INFO] Downloading from central: https://repo.maven.apache.org/maven2/org/codehaus/plexus/plexus-java/0.9.10/plexus-java-0.9.10.jar
[INFO] Downloading from central: https://repo.maven.apache.org/maven2/org/codehaus/plexus/plexus-compiler-api/2.8.4/plexus-compiler-api-2.8.4.jar
[INFO] Downloading from central: https://repo.maven.apache.org/maven2/org/codehaus/plexus/plexus-compiler-javac/2.8.4/plexus-compiler-javac-2.8.4.jar
[INFO] Downloading from central: https://repo.maven.apache.org/maven2/org/codehaus/plexus/plexus-compiler-manager/2.8.4/plexus-compiler-manager-2.8.4.jar
[INFO] Downloaded from central: https://repo.maven.apache.org/maven2/org/codehaus/plexus/plexus-compiler-manager/2.8.4/plexus-compiler-manager-2.8.4.jar (4.7 kB at 294 kB/s)
[INFO] Downloaded from central: https://repo.maven.apache.org/maven2/org/codehaus/plexus/plexus-compiler-javac/2.8.4/plexus-compiler-javac-2.8.4.jar (21 kB at 1.3 MB/s)
[INFO] Downloaded from central: https://repo.maven.apache.org/maven2/org/codehaus/plexus/plexus-compiler-api/2.8.4/plexus-compiler-api-2.8.4.jar (27 kB at 1.5 MB/s)
[INFO] Downloaded from central: https://repo.maven.apache.org/maven2/org/codehaus/plexus/plexus-java/0.9.10/plexus-java-0.9.10.jar (39 kB at 2.0 MB/s)
[INFO] No sources to compile
[INFO] 
[INFO] --- maven-resources-plugin:2.6:testResources (default-testResources) @ junit-path-with-umlaut ---
[WARNING] Using platform encoding (ISO-8859-1 actually) to copy filtered resources, i.e. build is platform dependent!
[INFO] skip non existing resourceDirectory /home/jenkins/jenkins-slave/workspace/box_maven-surefire_SUREFIRE-1617@2/surefire-its/target/this is: a testsurefire-1617/src/test/resources
[INFO] 
[INFO] --- maven-compiler-plugin:3.8.1:testCompile (default-testCompile) @ junit-path-with-umlaut ---
[INFO] Changes detected - recompiling the module!
[WARNING] File encoding has not been set, using platform encoding ISO-8859-1, i.e. build is platform dependent!
[INFO] Compiling 1 source file to /home/jenkins/jenkins-slave/workspace/box_maven-surefire_SUREFIRE-1617@2/surefire-its/target/this is: a testsurefire-1617/target/test-classes
[INFO] 
[INFO] --- maven-surefire-plugin:3.0.0-SNAPSHOT:test (default-test) @ junit-path-with-umlaut ---
[INFO] Downloading from central: https://repo.maven.apache.org/maven2/org/codehaus/plexus/plexus-utils/1.1/plexus-utils-1.1.jar
[INFO] Downloaded from central: https://repo.maven.apache.org/maven2/org/codehaus/plexus/plexus-utils/1.1/plexus-utils-1.1.jar (169 kB at 5.8 MB/s)
[INFO] Surefire report directory: /home/jenkins/jenkins-slave/workspace/box_maven-surefire_SUREFIRE-1617@2/surefire-its/target/this is: a testsurefire-1617/target/surefire-reports
[INFO] 
[INFO] -------------------------------------------------------
[INFO]  T E S T S
[INFO] -------------------------------------------------------
[INFO] 
[INFO] Results:
[INFO] 
[INFO] Tests run: 0, Failures: 0, Errors: 0, Skipped: 0
[INFO] 
[INFO] ------------------------------------------------------------------------
[INFO] BUILD FAILURE
[INFO] ------------------------------------------------------------------------
[INFO] Total time:  3.462 s
[INFO] Finished at: 2019-05-09T19:00:39Z
[INFO] ------------------------------------------------------------------------
[ERROR] Failed to execute goal org.apache.maven.plugins:maven-surefire-plugin:3.0.0-SNAPSHOT:test (default-test) on project junit-path-with-umlaut: There are test failures.
[ERROR] 
[ERROR] Please refer to /home/jenkins/jenkins-slave/workspace/box_maven-surefire_SUREFIRE-1617@2/surefire-its/target/this is: a testsurefire-1617/target/surefire-reports for the individual test results.
[ERROR] Please refer to dump files (if any exist) [date].dump, [date]-jvmRun[N].dump and [date].dumpstream.
[ERROR] The forked VM terminated without properly saying goodbye. VM crash or System.exit called?
[ERROR] Command was /bin/sh -c cd "/home/jenkins/jenkins-slave/workspace/box_maven-surefire_SUREFIRE-1617@2/surefire-its/target/this is: a testsurefire-1617" && /usr/local/asfpackages/java/openjdk-12-ea+33/bin/java -jar '/home/jenkins/jenkins-slave/workspace/box_maven-surefire_SUREFIRE-1617@2/surefire-its/target/this is: a testsurefire-1617/target/surefire/surefirebooter2744970329963363675.jar' '/home/jenkins/jenkins-slave/workspace/box_maven-surefire_SUREFIRE-1617@2/surefire-its/target/this is: a testsurefire-1617/target/surefire' 2019-05-09T19-00-38_822-jvmRun1 surefire14073523476079244179tmp surefire_04300831301545990506tmp
[ERROR] Error occurred in starting fork, check output in log
[ERROR] Process Exit Code: 1
[ERROR] org.apache.maven.surefire.booter.SurefireBooterForkException: The forked VM terminated without properly saying goodbye. VM crash or System.exit called?
[ERROR] Command was /bin/sh -c cd "/home/jenkins/jenkins-slave/workspace/box_maven-surefire_SUREFIRE-1617@2/surefire-its/target/this is: a testsurefire-1617" && /usr/local/asfpackages/java/openjdk-12-ea+33/bin/java -jar '/home/jenkins/jenkins-slave/workspace/box_maven-surefire_SUREFIRE-1617@2/surefire-its/target/this is: a testsurefire-1617/target/surefire/surefirebooter2744970329963363675.jar' '/home/jenkins/jenkins-slave/workspace/box_maven-surefire_SUREFIRE-1617@2/surefire-its/target/this is: a testsurefire-1617/target/surefire' 2019-05-09T19-00-38_822-jvmRun1 surefire14073523476079244179tmp surefire_04300831301545990506tmp
[ERROR] Error occurred in starting fork, check output in log
[ERROR] Process Exit Code: 1
[ERROR] 	at org.apache.maven.plugin.surefire.booterclient.ForkStarter.fork(ForkStarter.java:690)
[ERROR] 	at org.apache.maven.plugin.surefire.booterclient.ForkStarter.run(ForkStarter.java:285)
[ERROR] 	at org.apache.maven.plugin.surefire.booterclient.ForkStarter.run(ForkStarter.java:248)
[ERROR] 	at org.apache.maven.plugin.surefire.AbstractSurefireMojo.executeProvider(AbstractSurefireMojo.java:1191)
[ERROR] 	at org.apache.maven.plugin.surefire.AbstractSurefireMojo.executeAfterPreconditionsChecked(AbstractSurefireMojo.java:1038)
[ERROR] 	at org.apache.maven.plugin.surefire.AbstractSurefireMojo.execute(AbstractSurefireMojo.java:865)
[ERROR] 	at org.apache.maven.plugin.DefaultBuildPluginManager.executeMojo(DefaultBuildPluginManager.java:137)
[ERROR] 	at org.apache.maven.lifecycle.internal.MojoExecutor.execute(MojoExecutor.java:210)
[ERROR] 	at org.apache.maven.lifecycle.internal.MojoExecutor.execute(MojoExecutor.java:156)
[ERROR] 	at org.apache.maven.lifecycle.internal.MojoExecutor.execute(MojoExecutor.java:148)
[ERROR] 	at org.apache.maven.lifecycle.internal.LifecycleModuleBuilder.buildProject(LifecycleModuleBuilder.java:117)
[ERROR] 	at org.apache.maven.lifecycle.internal.LifecycleModuleBuilder.buildProject(LifecycleModuleBuilder.java:81)
[ERROR] 	at org.apache.maven.lifecycle.internal.builder.singlethreaded.SingleThreadedBuilder.build(SingleThreadedBuilder.java:56)
[ERROR] 	at org.apache.maven.lifecycle.internal.LifecycleStarter.execute(LifecycleStarter.java:128)
[ERROR] 	at org.apache.maven.DefaultMaven.doExecute(DefaultMaven.java:305)
[ERROR] 	at org.apache.maven.DefaultMaven.doExecute(DefaultMaven.java:192)
[ERROR] 	at org.apache.maven.DefaultMaven.execute(DefaultMaven.java:105)
[ERROR] 	at org.apache.maven.cli.MavenCli.execute(MavenCli.java:956)
[ERROR] 	at org.apache.maven.cli.MavenCli.doMain(MavenCli.java:288)
[ERROR] 	at org.apache.maven.cli.MavenCli.main(MavenCli.java:192)
[ERROR] 	at java.base/jdk.internal.reflect.NativeMethodAccessorImpl.invoke0(Native Method)
[ERROR] 	at java.base/jdk.internal.reflect.NativeMethodAccessorImpl.invoke(NativeMethodAccessorImpl.java:62)
[ERROR] 	at java.base/jdk.internal.reflect.DelegatingMethodAccessorImpl.invoke(DelegatingMethodAccessorImpl.java:43)
[ERROR] 	at java.base/java.lang.reflect.Method.invoke(Method.java:567)
[ERROR] 	at org.codehaus.plexus.classworlds.launcher.Launcher.launchEnhanced(Launcher.java:289)
[ERROR] 	at org.codehaus.plexus.classworlds.launcher.Launcher.launch(Launcher.java:229)
[ERROR] 	at org.codehaus.plexus.classworlds.launcher.Launcher.mainWithExitCode(Launcher.java:415)
[ERROR] 	at org.codehaus.plexus.classworlds.launcher.Launcher.main(Launcher.java:356)
[ERROR] -> [Help 1]
org.apache.maven.lifecycle.LifecycleExecutionException: Failed to execute goal org.apache.maven.plugins:maven-surefire-plugin:3.0.0-SNAPSHOT:test (default-test) on project junit-path-with-umlaut: There are test failures.

Please refer to /home/jenkins/jenkins-slave/workspace/box_maven-surefire_SUREFIRE-1617@2/surefire-its/target/this is: a testsurefire-1617/target/surefire-reports for the individual test results.
Please refer to dump files (if any exist) [date].dump, [date]-jvmRun[N].dump and [date].dumpstream.
The forked VM terminated without properly saying goodbye. VM crash or System.exit called?
Command was /bin/sh -c cd "/home/jenkins/jenkins-slave/workspace/box_maven-surefire_SUREFIRE-1617@2/surefire-its/target/this is: a testsurefire-1617" && /usr/local/asfpackages/java/openjdk-12-ea+33/bin/java -jar '/home/jenkins/jenkins-slave/workspace/box_maven-surefire_SUREFIRE-1617@2/surefire-its/target/this is: a testsurefire-1617/target/surefire/surefirebooter2744970329963363675.jar' '/home/jenkins/jenkins-slave/workspace/box_maven-surefire_SUREFIRE-1617@2/surefire-its/target/this is: a testsurefire-1617/target/surefire' 2019-05-09T19-00-38_822-jvmRun1 surefire14073523476079244179tmp surefire_04300831301545990506tmp
Error occurred in starting fork, check output in log
Process Exit Code: 1
org.apache.maven.surefire.booter.SurefireBooterForkException: The forked VM terminated without properly saying goodbye. VM crash or System.exit called?
Command was /bin/sh -c cd "/home/jenkins/jenkins-slave/workspace/box_maven-surefire_SUREFIRE-1617@2/surefire-its/target/this is: a testsurefire-1617" && /usr/local/asfpackages/java/openjdk-12-ea+33/bin/java -jar '/home/jenkins/jenkins-slave/workspace/box_maven-surefire_SUREFIRE-1617@2/surefire-its/target/this is: a testsurefire-1617/target/surefire/surefirebooter2744970329963363675.jar' '/home/jenkins/jenkins-slave/workspace/box_maven-surefire_SUREFIRE-1617@2/surefire-its/target/this is: a testsurefire-1617/target/surefire' 2019-05-09T19-00-38_822-jvmRun1 surefire14073523476079244179tmp surefire_04300831301545990506tmp
Error occurred in starting fork, check output in log
Process Exit Code: 1
	at org.apache.maven.plugin.surefire.booterclient.ForkStarter.fork(ForkStarter.java:690)
	at org.apache.maven.plugin.surefire.booterclient.ForkStarter.run(ForkStarter.java:285)
	at org.apache.maven.plugin.surefire.booterclient.ForkStarter.run(ForkStarter.java:248)
	at org.apache.maven.plugin.surefire.AbstractSurefireMojo.executeProvider(AbstractSurefireMojo.java:1191)
	at org.apache.maven.plugin.surefire.AbstractSurefireMojo.executeAfterPreconditionsChecked(AbstractSurefireMojo.java:1038)
	at org.apache.maven.plugin.surefire.AbstractSurefireMojo.execute(AbstractSurefireMojo.java:865)
	at org.apache.maven.plugin.DefaultBuildPluginManager.executeMojo(DefaultBuildPluginManager.java:137)
	at org.apache.maven.lifecycle.internal.MojoExecutor.execute(MojoExecutor.java:210)
	at org.apache.maven.lifecycle.internal.MojoExecutor.execute(MojoExecutor.java:156)
	at org.apache.maven.lifecycle.internal.MojoExecutor.execute(MojoExecutor.java:148)
	at org.apache.maven.lifecycle.internal.LifecycleModuleBuilder.buildProject(LifecycleModuleBuilder.java:117)
	at org.apache.maven.lifecycle.internal.LifecycleModuleBuilder.buildProject(LifecycleModuleBuilder.java:81)
	at org.apache.maven.lifecycle.internal.builder.singlethreaded.SingleThreadedBuilder.build(SingleThreadedBuilder.java:56)
	at org.apache.maven.lifecycle.internal.LifecycleStarter.execute(LifecycleStarter.java:128)
	at org.apache.maven.DefaultMaven.doExecute(DefaultMaven.java:305)
	at org.apache.maven.DefaultMaven.doExecute(DefaultMaven.java:192)
	at org.apache.maven.DefaultMaven.execute(DefaultMaven.java:105)
	at org.apache.maven.cli.MavenCli.execute(MavenCli.java:956)
	at org.apache.maven.cli.MavenCli.doMain(MavenCli.java:288)
	at org.apache.maven.cli.MavenCli.main(MavenCli.java:192)
	at java.base/jdk.internal.reflect.NativeMethodAccessorImpl.invoke0(Native Method)
	at java.base/jdk.internal.reflect.NativeMethodAccessorImpl.invoke(NativeMethodAccessorImpl.java:62)
	at java.base/jdk.internal.reflect.DelegatingMethodAccessorImpl.invoke(DelegatingMethodAccessorImpl.java:43)
	at java.base/java.lang.reflect.Method.invoke(Method.java:567)
	at org.codehaus.plexus.classworlds.launcher.Launcher.launchEnhanced(Launcher.java:289)
	at org.codehaus.plexus.classworlds.launcher.Launcher.launch(Launcher.java:229)
	at org.codehaus.plexus.classworlds.launcher.Launcher.mainWithExitCode(Launcher.java:415)
	at org.codehaus.plexus.classworlds.launcher.Launcher.main(Launcher.java:356)

    at org.apache.maven.lifecycle.internal.MojoExecutor.execute (MojoExecutor.java:215)
    at org.apache.maven.lifecycle.internal.MojoExecutor.execute (MojoExecutor.java:156)
    at org.apache.maven.lifecycle.internal.MojoExecutor.execute (MojoExecutor.java:148)
    at org.apache.maven.lifecycle.internal.LifecycleModuleBuilder.buildProject (LifecycleModuleBuilder.java:117)
    at org.apache.maven.lifecycle.internal.LifecycleModuleBuilder.buildProject (LifecycleModuleBuilder.java:81)
    at org.apache.maven.lifecycle.internal.builder.singlethreaded.SingleThreadedBuilder.build (SingleThreadedBuilder.java:56)
    at org.apache.maven.lifecycle.internal.LifecycleStarter.execute (LifecycleStarter.java:128)
    at org.apache.maven.DefaultMaven.doExecute (DefaultMaven.java:305)
    at org.apache.maven.DefaultMaven.doExecute (DefaultMaven.java:192)
    at org.apache.maven.DefaultMaven.execute (DefaultMaven.java:105)
    at org.apache.maven.cli.MavenCli.execute (MavenCli.java:956)
    at org.apache.maven.cli.MavenCli.doMain (MavenCli.java:288)
    at org.apache.maven.cli.MavenCli.main (MavenCli.java:192)
    at jdk.internal.reflect.NativeMethodAccessorImpl.invoke0 (Native Method)
    at jdk.internal.reflect.NativeMethodAccessorImpl.invoke (NativeMethodAccessorImpl.java:62)
    at jdk.internal.reflect.DelegatingMethodAccessorImpl.invoke (DelegatingMethodAccessorImpl.java:43)
    at java.lang.reflect.Method.invoke (Method.java:567)
    at org.codehaus.plexus.classworlds.launcher.Launcher.launchEnhanced (Launcher.java:289)
    at org.codehaus.plexus.classworlds.launcher.Launcher.launch (Launcher.java:229)
    at org.codehaus.plexus.classworlds.launcher.Launcher.mainWithExitCode (Launcher.java:415)
    at org.codehaus.plexus.classworlds.launcher.Launcher.main (Launcher.java:356)
Caused by: org.apache.maven.plugin.MojoExecutionException: There are test failures.

Please refer to /home/jenkins/jenkins-slave/workspace/box_maven-surefire_SUREFIRE-1617@2/surefire-its/target/this is: a testsurefire-1617/target/surefire-reports for the individual test results.
Please refer to dump files (if any exist) [date].dump, [date]-jvmRun[N].dump and [date].dumpstream.
The forked VM terminated without properly saying goodbye. VM crash or System.exit called?
Command was /bin/sh -c cd "/home/jenkins/jenkins-slave/workspace/box_maven-surefire_SUREFIRE-1617@2/surefire-its/target/this is: a testsurefire-1617" && /usr/local/asfpackages/java/openjdk-12-ea+33/bin/java -jar '/home/jenkins/jenkins-slave/workspace/box_maven-surefire_SUREFIRE-1617@2/surefire-its/target/this is: a testsurefire-1617/target/surefire/surefirebooter2744970329963363675.jar' '/home/jenkins/jenkins-slave/workspace/box_maven-surefire_SUREFIRE-1617@2/surefire-its/target/this is: a testsurefire-1617/target/surefire' 2019-05-09T19-00-38_822-jvmRun1 surefire14073523476079244179tmp surefire_04300831301545990506tmp
Error occurred in starting fork, check output in log
Process Exit Code: 1
org.apache.maven.surefire.booter.SurefireBooterForkException: The forked VM terminated without properly saying goodbye. VM crash or System.exit called?
Command was /bin/sh -c cd "/home/jenkins/jenkins-slave/workspace/box_maven-surefire_SUREFIRE-1617@2/surefire-its/target/this is: a testsurefire-1617" && /usr/local/asfpackages/java/openjdk-12-ea+33/bin/java -jar '/home/jenkins/jenkins-slave/workspace/box_maven-surefire_SUREFIRE-1617@2/surefire-its/target/this is: a testsurefire-1617/target/surefire/surefirebooter2744970329963363675.jar' '/home/jenkins/jenkins-slave/workspace/box_maven-surefire_SUREFIRE-1617@2/surefire-its/target/this is: a testsurefire-1617/target/surefire' 2019-05-09T19-00-38_822-jvmRun1 surefire14073523476079244179tmp surefire_04300831301545990506tmp
Error occurred in starting fork, check output in log
Process Exit Code: 1
	at org.apache.maven.plugin.surefire.booterclient.ForkStarter.fork(ForkStarter.java:690)
	at org.apache.maven.plugin.surefire.booterclient.ForkStarter.run(ForkStarter.java:285)
	at org.apache.maven.plugin.surefire.booterclient.ForkStarter.run(ForkStarter.java:248)
	at org.apache.maven.plugin.surefire.AbstractSurefireMojo.executeProvider(AbstractSurefireMojo.java:1191)
	at org.apache.maven.plugin.surefire.AbstractSurefireMojo.executeAfterPreconditionsChecked(AbstractSurefireMojo.java:1038)
	at org.apache.maven.plugin.surefire.AbstractSurefireMojo.execute(AbstractSurefireMojo.java:865)
	at org.apache.maven.plugin.DefaultBuildPluginManager.executeMojo(DefaultBuildPluginManager.java:137)
	at org.apache.maven.lifecycle.internal.MojoExecutor.execute(MojoExecutor.java:210)
	at org.apache.maven.lifecycle.internal.MojoExecutor.execute(MojoExecutor.java:156)
	at org.apache.maven.lifecycle.internal.MojoExecutor.execute(MojoExecutor.java:148)
	at org.apache.maven.lifecycle.internal.LifecycleModuleBuilder.buildProject(LifecycleModuleBuilder.java:117)
	at org.apache.maven.lifecycle.internal.LifecycleModuleBuilder.buildProject(LifecycleModuleBuilder.java:81)
	at org.apache.maven.lifecycle.internal.builder.singlethreaded.SingleThreadedBuilder.build(SingleThreadedBuilder.java:56)
	at org.apache.maven.lifecycle.internal.LifecycleStarter.execute(LifecycleStarter.java:128)
	at org.apache.maven.DefaultMaven.doExecute(DefaultMaven.java:305)
	at org.apache.maven.DefaultMaven.doExecute(DefaultMaven.java:192)
	at org.apache.maven.DefaultMaven.execute(DefaultMaven.java:105)
	at org.apache.maven.cli.MavenCli.execute(MavenCli.java:956)
	at org.apache.maven.cli.MavenCli.doMain(MavenCli.java:288)
	at org.apache.maven.cli.MavenCli.main(MavenCli.java:192)
	at java.base/jdk.internal.reflect.NativeMethodAccessorImpl.invoke0(Native Method)
	at java.base/jdk.internal.reflect.NativeMethodAccessorImpl.invoke(NativeMethodAccessorImpl.java:62)
	at java.base/jdk.internal.reflect.DelegatingMethodAccessorImpl.invoke(DelegatingMethodAccessorImpl.java:43)
	at java.base/java.lang.reflect.Method.invoke(Method.java:567)
	at org.codehaus.plexus.classworlds.launcher.Launcher.launchEnhanced(Launcher.java:289)
	at org.codehaus.plexus.classworlds.launcher.Launcher.launch(Launcher.java:229)
	at org.codehaus.plexus.classworlds.launcher.Launcher.mainWithExitCode(Launcher.java:415)
	at org.codehaus.plexus.classworlds.launcher.Launcher.main(Launcher.java:356)

    at org.apache.maven.plugin.surefire.SurefireHelper.throwException (SurefireHelper.java:266)
    at org.apache.maven.plugin.surefire.SurefireHelper.reportExecution (SurefireHelper.java:159)
    at org.apache.maven.plugin.surefire.SurefirePlugin.handleSummary (SurefirePlugin.java:377)
    at org.apache.maven.plugin.surefire.AbstractSurefireMojo.executeAfterPreconditionsChecked (AbstractSurefireMojo.java:1054)
    at org.apache.maven.plugin.surefire.AbstractSurefireMojo.execute (AbstractSurefireMojo.java:865)
    at org.apache.maven.plugin.DefaultBuildPluginManager.executeMojo (DefaultBuildPluginManager.java:137)
    at org.apache.maven.lifecycle.internal.MojoExecutor.execute (MojoExecutor.java:210)
    at org.apache.maven.lifecycle.internal.MojoExecutor.execute (MojoExecutor.java:156)
    at org.apache.maven.lifecycle.internal.MojoExecutor.execute (MojoExecutor.java:148)
    at org.apache.maven.lifecycle.internal.LifecycleModuleBuilder.buildProject (LifecycleModuleBuilder.java:117)
    at org.apache.maven.lifecycle.internal.LifecycleModuleBuilder.buildProject (LifecycleModuleBuilder.java:81)
    at org.apache.maven.lifecycle.internal.builder.singlethreaded.SingleThreadedBuilder.build (SingleThreadedBuilder.java:56)
    at org.apache.maven.lifecycle.internal.LifecycleStarter.execute (LifecycleStarter.java:128)
    at org.apache.maven.DefaultMaven.doExecute (DefaultMaven.java:305)
    at org.apache.maven.DefaultMaven.doExecute (DefaultMaven.java:192)
    at org.apache.maven.DefaultMaven.execute (DefaultMaven.java:105)
    at org.apache.maven.cli.MavenCli.execute (MavenCli.java:956)
    at org.apache.maven.cli.MavenCli.doMain (MavenCli.java:288)
    at org.apache.maven.cli.MavenCli.main (MavenCli.java:192)
    at jdk.internal.reflect.NativeMethodAccessorImpl.invoke0 (Native Method)
    at jdk.internal.reflect.NativeMethodAccessorImpl.invoke (NativeMethodAccessorImpl.java:62)
    at jdk.internal.reflect.DelegatingMethodAccessorImpl.invoke (DelegatingMethodAccessorImpl.java:43)
    at java.lang.reflect.Method.invoke (Method.java:567)
    at org.codehaus.plexus.classworlds.launcher.Launcher.launchEnhanced (Launcher.java:289)
    at org.codehaus.plexus.classworlds.launcher.Launcher.launch (Launcher.java:229)
    at org.codehaus.plexus.classworlds.launcher.Launcher.mainWithExitCode (Launcher.java:415)
    at org.codehaus.plexus.classworlds.launcher.Launcher.main (Launcher.java:356)
Caused by: org.apache.maven.surefire.booter.SurefireBooterForkException: The forked VM terminated without properly saying goodbye. VM crash or System.exit called?
Command was /bin/sh -c cd "/home/jenkins/jenkins-slave/workspace/box_maven-surefire_SUREFIRE-1617@2/surefire-its/target/this is: a testsurefire-1617" && /usr/local/asfpackages/java/openjdk-12-ea+33/bin/java -jar '/home/jenkins/jenkins-slave/workspace/box_maven-surefire_SUREFIRE-1617@2/surefire-its/target/this is: a testsurefire-1617/target/surefire/surefirebooter2744970329963363675.jar' '/home/jenkins/jenkins-slave/workspace/box_maven-surefire_SUREFIRE-1617@2/surefire-its/target/this is: a testsurefire-1617/target/surefire' 2019-05-09T19-00-38_822-jvmRun1 surefire14073523476079244179tmp surefire_04300831301545990506tmp
Error occurred in starting fork, check output in log
Process Exit Code: 1
    at org.apache.maven.plugin.surefire.booterclient.ForkStarter.fork (ForkStarter.java:690)
    at org.apache.maven.plugin.surefire.booterclient.ForkStarter.run (ForkStarter.java:285)
    at org.apache.maven.plugin.surefire.booterclient.ForkStarter.run (ForkStarter.java:248)
    at org.apache.maven.plugin.surefire.AbstractSurefireMojo.executeProvider (AbstractSurefireMojo.java:1191)
    at org.apache.maven.plugin.surefire.AbstractSurefireMojo.executeAfterPreconditionsChecked (AbstractSurefireMojo.java:1038)
    at org.apache.maven.plugin.surefire.AbstractSurefireMojo.execute (AbstractSurefireMojo.java:865)
    at org.apache.maven.plugin.DefaultBuildPluginManager.executeMojo (DefaultBuildPluginManager.java:137)
    at org.apache.maven.lifecycle.internal.MojoExecutor.execute (MojoExecutor.java:210)
    at org.apache.maven.lifecycle.internal.MojoExecutor.execute (MojoExecutor.java:156)
    at org.apache.maven.lifecycle.internal.MojoExecutor.execute (MojoExecutor.java:148)
    at org.apache.maven.lifecycle.internal.LifecycleModuleBuilder.buildProject (LifecycleModuleBuilder.java:117)
    at org.apache.maven.lifecycle.internal.LifecycleModuleBuilder.buildProject (LifecycleModuleBuilder.java:81)
    at org.apache.maven.lifecycle.internal.builder.singlethreaded.SingleThreadedBuilder.build (SingleThreadedBuilder.java:56)
    at org.apache.maven.lifecycle.internal.LifecycleStarter.execute (LifecycleStarter.java:128)
    at org.apache.maven.DefaultMaven.doExecute (DefaultMaven.java:305)
    at org.apache.maven.DefaultMaven.doExecute (DefaultMaven.java:192)
    at org.apache.maven.DefaultMaven.execute (DefaultMaven.java:105)
    at org.apache.maven.cli.MavenCli.execute (MavenCli.java:956)
    at org.apache.maven.cli.MavenCli.doMain (MavenCli.java:288)
    at org.apache.maven.cli.MavenCli.main (MavenCli.java:192)
    at jdk.internal.reflect.NativeMethodAccessorImpl.invoke0 (Native Method)
    at jdk.internal.reflect.NativeMethodAccessorImpl.invoke (NativeMethodAccessorImpl.java:62)
    at jdk.internal.reflect.DelegatingMethodAccessorImpl.invoke (DelegatingMethodAccessorImpl.java:43)
    at java.lang.reflect.Method.invoke (Method.java:567)
    at org.codehaus.plexus.classworlds.launcher.Launcher.launchEnhanced (Launcher.java:289)
    at org.codehaus.plexus.classworlds.launcher.Launcher.launch (Launcher.java:229)
    at org.codehaus.plexus.classworlds.launcher.Launcher.mainWithExitCode (Launcher.java:415)
    at org.codehaus.plexus.classworlds.launcher.Launcher.main (Launcher.java:356)
[ERROR] 
[ERROR] Re-run Maven using the -X switch to enable full debug logging.
[ERROR] 
[ERROR] For more information about the errors and possible solutions, please read the following articles:
[ERROR] [Help 1] http://cwiki.apache.org/confluence/display/MAVEN/MojoExecutionException

	at org.apache.maven.surefire.its.UmlautDirIT.surefire1617WithColonInProjectDir(UmlautDirIT.java:86)
Caused by: org.apache.maven.it.VerificationException: 
Exit code was non-zero: 1; command line and log = 
/home/jenkins/tools/maven/apache-maven-3.6.0/bin/mvn -e --batch-mode -Dmaven.repo.local=/home/jenkins/jenkins-slave/workspace/box_maven-surefire_SUREFIRE-1617@2/.m2 org.apache.maven.plugins:maven-clean-plugin:clean -Dsurefire.version=3.0.0-SNAPSHOT -Djacoco.agent=-javaagent:/home/jenkins/jenkins-slave/workspace/box_maven-surefire_SUREFIRE-1617@2/.m2/org/jacoco/org.jacoco.agent/0.8.3/org.jacoco.agent-0.8.3-runtime.jar=destfile=/home/jenkins/jenkins-slave/workspace/box_maven-surefire_SUREFIRE-1617@2/surefire-its/target/jacoco-it.exec,append=true,includes=**/failsafe/*:**/failsafe/**/*:**/surefire/*:**/surefire/**/*,inclnolocationclasses=true,jmx=false -Dhttps.protocols=TLSv1,TLSv1.1,TLSv1.2 test
[INFO] Error stacktraces are turned on.
[INFO] Scanning for projects...
[INFO] Downloading from central: https://repo.maven.apache.org/maven2/org/apache/maven/plugins/maven-clean-plugin/3.0.0/maven-clean-plugin-3.0.0.pom
[INFO] Downloaded from central: https://repo.maven.apache.org/maven2/org/apache/maven/plugins/maven-clean-plugin/3.0.0/maven-clean-plugin-3.0.0.pom (4.8 kB at 16 kB/s)
[INFO] Downloading from central: https://repo.maven.apache.org/maven2/org/apache/maven/plugins/maven-plugins/28/maven-plugins-28.pom
[INFO] Downloaded from central: https://repo.maven.apache.org/maven2/org/apache/maven/plugins/maven-plugins/28/maven-plugins-28.pom (12 kB at 633 kB/s)
[INFO] Downloading from central: https://repo.maven.apache.org/maven2/org/apache/maven/plugins/maven-clean-plugin/3.0.0/maven-clean-plugin-3.0.0.jar
[INFO] Downloaded from central: https://repo.maven.apache.org/maven2/org/apache/maven/plugins/maven-clean-plugin/3.0.0/maven-clean-plugin-3.0.0.jar (31 kB at 1.5 MB/s)
[INFO] 
[INFO] ------< org.apache.maven.plugins.surefire:junit-path-with-umlaut >------
[INFO] Building Test path with Ümlaut 1.0-SNAPSHOT
[INFO] --------------------------------[ jar ]---------------------------------
[INFO] Downloading from central: https://repo.maven.apache.org/maven2/org/apache/maven/plugins/maven-resources-plugin/2.6/maven-resources-plugin-2.6.pom
[INFO] Downloaded from central: https://repo.maven.apache.org/maven2/org/apache/maven/plugins/maven-resources-plugin/2.6/maven-resources-plugin-2.6.pom (8.1 kB at 507 kB/s)
[INFO] Downloading from central: https://repo.maven.apache.org/maven2/org/apache/maven/plugins/maven-plugins/23/maven-plugins-23.pom
[INFO] Downloaded from central: https://repo.maven.apache.org/maven2/org/apache/maven/plugins/maven-plugins/23/maven-plugins-23.pom (9.2 kB at 657 kB/s)
[INFO] Downloading from central: https://repo.maven.apache.org/maven2/org/apache/maven/plugins/maven-resources-plugin/2.6/maven-resources-plugin-2.6.jar
[INFO] Downloaded from central: https://repo.maven.apache.org/maven2/org/apache/maven/plugins/maven-resources-plugin/2.6/maven-resources-plugin-2.6.jar (30 kB at 1.7 MB/s)
[INFO] Downloading from central: https://repo.maven.apache.org/maven2/org/apache/maven/plugins/maven-compiler-plugin/3.8.1/maven-compiler-plugin-3.8.1.pom
[INFO] Downloaded from central: https://repo.maven.apache.org/maven2/org/apache/maven/plugins/maven-compiler-plugin/3.8.1/maven-compiler-plugin-3.8.1.pom (12 kB at 891 kB/s)
[INFO] Downloading from central: https://repo.maven.apache.org/maven2/org/apache/maven/plugins/maven-compiler-plugin/3.8.1/maven-compiler-plugin-3.8.1.jar
[INFO] Downloaded from central: https://repo.maven.apache.org/maven2/org/apache/maven/plugins/maven-compiler-plugin/3.8.1/maven-compiler-plugin-3.8.1.jar (62 kB at 2.8 MB/s)
[INFO] 
[INFO] --- maven-clean-plugin:3.0.0:clean (default-cli) @ junit-path-with-umlaut ---
[INFO] 
[INFO] --- maven-resources-plugin:2.6:resources (default-resources) @ junit-path-with-umlaut ---
[INFO] Downloading from central: https://repo.maven.apache.org/maven2/org/codehaus/plexus/plexus-interpolation/1.13/plexus-interpolation-1.13.pom
[INFO] Downloaded from central: https://repo.maven.apache.org/maven2/org/codehaus/plexus/plexus-interpolation/1.13/plexus-interpolation-1.13.pom (890 B at 59 kB/s)
[INFO] Downloading from central: https://repo.maven.apache.org/maven2/org/apache/maven/maven-plugin-api/2.0.6/maven-plugin-api-2.0.6.jar
[INFO] Downloading from central: https://repo.maven.apache.org/maven2/org/apache/maven/maven-profile/2.0.6/maven-profile-2.0.6.jar
[INFO] Downloading from central: https://repo.maven.apache.org/maven2/org/apache/maven/maven-project/2.0.6/maven-project-2.0.6.jar
[INFO] Downloading from central: https://repo.maven.apache.org/maven2/org/apache/maven/maven-artifact-manager/2.0.6/maven-artifact-manager-2.0.6.jar
[INFO] Downloading from central: https://repo.maven.apache.org/maven2/org/apache/maven/maven-plugin-registry/2.0.6/maven-plugin-registry-2.0.6.jar
[INFO] Downloaded from central: https://repo.maven.apache.org/maven2/org/apache/maven/maven-plugin-api/2.0.6/maven-plugin-api-2.0.6.jar (13 kB at 612 kB/s)
[INFO] Downloading from central: https://repo.maven.apache.org/maven2/org/apache/maven/maven-core/2.0.6/maven-core-2.0.6.jar
[INFO] Downloaded from central: https://repo.maven.apache.org/maven2/org/apache/maven/maven-plugin-registry/2.0.6/maven-plugin-registry-2.0.6.jar (29 kB at 567 kB/s)
[INFO] Downloading from central: https://repo.maven.apache.org/maven2/org/apache/maven/maven-plugin-parameter-documenter/2.0.6/maven-plugin-parameter-documenter-2.0.6.jar
[INFO] Downloaded from central: https://repo.maven.apache.org/maven2/org/apache/maven/maven-profile/2.0.6/maven-profile-2.0.6.jar (35 kB at 653 kB/s)
[INFO] Downloading from central: https://repo.maven.apache.org/maven2/org/apache/maven/reporting/maven-reporting-api/2.0.6/maven-reporting-api-2.0.6.jar
[INFO] Downloaded from central: https://repo.maven.apache.org/maven2/org/apache/maven/maven-artifact-manager/2.0.6/maven-artifact-manager-2.0.6.jar (57 kB at 1.0 MB/s)
[INFO] Downloading from central: https://repo.maven.apache.org/maven2/org/apache/maven/doxia/doxia-sink-api/1.0-alpha-7/doxia-sink-api-1.0-alpha-7.jar
[INFO] Downloaded from central: https://repo.maven.apache.org/maven2/org/apache/maven/maven-project/2.0.6/maven-project-2.0.6.jar (116 kB at 1.8 MB/s)
[INFO] Downloading from central: https://repo.maven.apache.org/maven2/org/apache/maven/maven-repository-metadata/2.0.6/maven-repository-metadata-2.0.6.jar
[INFO] Downloaded from central: https://repo.maven.apache.org/maven2/org/apache/maven/maven-core/2.0.6/maven-core-2.0.6.jar (152 kB at 2.3 MB/s)
[INFO] Downloading from central: https://repo.maven.apache.org/maven2/org/apache/maven/maven-error-diagnostics/2.0.6/maven-error-diagnostics-2.0.6.jar
[INFO] Downloaded from central: https://repo.maven.apache.org/maven2/org/apache/maven/reporting/maven-reporting-api/2.0.6/maven-reporting-api-2.0.6.jar (9.9 kB at 146 kB/s)
[INFO] Downloading from central: https://repo.maven.apache.org/maven2/commons-cli/commons-cli/1.0/commons-cli-1.0.jar
[INFO] Downloaded from central: https://repo.maven.apache.org/maven2/org/apache/maven/maven-plugin-parameter-documenter/2.0.6/maven-plugin-parameter-documenter-2.0.6.jar (21 kB at 297 kB/s)
[INFO] Downloaded from central: https://repo.maven.apache.org/maven2/org/apache/maven/doxia/doxia-sink-api/1.0-alpha-7/doxia-sink-api-1.0-alpha-7.jar (5.9 kB at 86 kB/s)
[INFO] Downloading from central: https://repo.maven.apache.org/maven2/org/apache/maven/maven-plugin-descriptor/2.0.6/maven-plugin-descriptor-2.0.6.jar
[INFO] Downloading from central: https://repo.maven.apache.org/maven2/org/apache/maven/maven-artifact/2.0.6/maven-artifact-2.0.6.jar
[INFO] Downloaded from central: https://repo.maven.apache.org/maven2/org/apache/maven/maven-repository-metadata/2.0.6/maven-repository-metadata-2.0.6.jar (24 kB at 314 kB/s)
[INFO] Downloading from central: https://repo.maven.apache.org/maven2/org/apache/maven/maven-settings/2.0.6/maven-settings-2.0.6.jar
[INFO] Downloaded from central: https://repo.maven.apache.org/maven2/org/apache/maven/maven-error-diagnostics/2.0.6/maven-error-diagnostics-2.0.6.jar (14 kB at 172 kB/s)
[INFO] Downloading from central: https://repo.maven.apache.org/maven2/org/apache/maven/maven-model/2.0.6/maven-model-2.0.6.jar
[INFO] Downloaded from central: https://repo.maven.apache.org/maven2/commons-cli/commons-cli/1.0/commons-cli-1.0.jar (30 kB at 359 kB/s)
[INFO] Downloading from central: https://repo.maven.apache.org/maven2/org/apache/maven/maven-monitor/2.0.6/maven-monitor-2.0.6.jar
[INFO] Downloaded from central: https://repo.maven.apache.org/maven2/org/apache/maven/maven-plugin-descriptor/2.0.6/maven-plugin-descriptor-2.0.6.jar (37 kB at 429 kB/s)
[INFO] Downloading from central: https://repo.maven.apache.org/maven2/org/codehaus/plexus/plexus-utils/2.0.5/plexus-utils-2.0.5.jar
[INFO] Downloaded from central: https://repo.maven.apache.org/maven2/org/apache/maven/maven-artifact/2.0.6/maven-artifact-2.0.6.jar (87 kB at 960 kB/s)
[INFO] Downloading from central: https://repo.maven.apache.org/maven2/org/codehaus/plexus/plexus-interpolation/1.13/plexus-interpolation-1.13.jar
[INFO] Downloaded from central: https://repo.maven.apache.org/maven2/org/apache/maven/maven-settings/2.0.6/maven-settings-2.0.6.jar (49 kB at 522 kB/s)
[INFO] Downloaded from central: https://repo.maven.apache.org/maven2/org/apache/maven/maven-monitor/2.0.6/maven-monitor-2.0.6.jar (10 kB at 106 kB/s)
[INFO] Downloaded from central: https://repo.maven.apache.org/maven2/org/apache/maven/maven-model/2.0.6/maven-model-2.0.6.jar (86 kB at 864 kB/s)
[INFO] Downloaded from central: https://repo.maven.apache.org/maven2/org/codehaus/plexus/plexus-interpolation/1.13/plexus-interpolation-1.13.jar (61 kB at 560 kB/s)
[INFO] Downloaded from central: https://repo.maven.apache.org/maven2/org/codehaus/plexus/plexus-utils/2.0.5/plexus-utils-2.0.5.jar (223 kB at 1.9 MB/s)
[WARNING] Using platform encoding (ISO-8859-1 actually) to copy filtered resources, i.e. build is platform dependent!
[INFO] skip non existing resourceDirectory /home/jenkins/jenkins-slave/workspace/box_maven-surefire_SUREFIRE-1617@2/surefire-its/target/this is: a testsurefire-1617/src/main/resources
[INFO] 
[INFO] --- maven-compiler-plugin:3.8.1:compile (default-compile) @ junit-path-with-umlaut ---
[INFO] Downloading from central: https://repo.maven.apache.org/maven2/org/codehaus/plexus/plexus-java/0.9.10/plexus-java-0.9.10.pom
[INFO] Downloaded from central: https://repo.maven.apache.org/maven2/org/codehaus/plexus/plexus-java/0.9.10/plexus-java-0.9.10.pom (5.1 kB at 365 kB/s)
[INFO] Downloading from central: https://repo.maven.apache.org/maven2/org/codehaus/plexus/plexus-languages/0.9.10/plexus-languages-0.9.10.pom
[INFO] Downloaded from central: https://repo.maven.apache.org/maven2/org/codehaus/plexus/plexus-languages/0.9.10/plexus-languages-0.9.10.pom (4.1 kB at 296 kB/s)
[INFO] Downloading from central: https://repo.maven.apache.org/maven2/org/codehaus/plexus/plexus-compiler-api/2.8.4/plexus-compiler-api-2.8.4.pom
[INFO] Downloaded from central: https://repo.maven.apache.org/maven2/org/codehaus/plexus/plexus-compiler-api/2.8.4/plexus-compiler-api-2.8.4.pom (867 B at 62 kB/s)
[INFO] Downloading from central: https://repo.maven.apache.org/maven2/org/codehaus/plexus/plexus-compiler/2.8.4/plexus-compiler-2.8.4.pom
[INFO] Downloaded from central: https://repo.maven.apache.org/maven2/org/codehaus/plexus/plexus-compiler/2.8.4/plexus-compiler-2.8.4.pom (6.0 kB at 431 kB/s)
[INFO] Downloading from central: https://repo.maven.apache.org/maven2/org/codehaus/plexus/plexus-compiler-manager/2.8.4/plexus-compiler-manager-2.8.4.pom
[INFO] Downloaded from central: https://repo.maven.apache.org/maven2/org/codehaus/plexus/plexus-compiler-manager/2.8.4/plexus-compiler-manager-2.8.4.pom (692 B at 46 kB/s)
[INFO] Downloading from central: https://repo.maven.apache.org/maven2/org/codehaus/plexus/plexus-compiler-javac/2.8.4/plexus-compiler-javac-2.8.4.pom
[INFO] Downloaded from central: https://repo.maven.apache.org/maven2/org/codehaus/plexus/plexus-compiler-javac/2.8.4/plexus-compiler-javac-2.8.4.pom (771 B at 31 kB/s)
[INFO] Downloading from central: https://repo.maven.apache.org/maven2/org/codehaus/plexus/plexus-compilers/2.8.4/plexus-compilers-2.8.4.pom
[INFO] Downloaded from central: https://repo.maven.apache.org/maven2/org/codehaus/plexus/plexus-compilers/2.8.4/plexus-compilers-2.8.4.pom (1.3 kB at 103 kB/s)
[INFO] Downloading from central: https://repo.maven.apache.org/maven2/org/codehaus/plexus/plexus-java/0.9.10/plexus-java-0.9.10.jar
[INFO] Downloading from central: https://repo.maven.apache.org/maven2/org/codehaus/plexus/plexus-compiler-api/2.8.4/plexus-compiler-api-2.8.4.jar
[INFO] Downloading from central: https://repo.maven.apache.org/maven2/org/codehaus/plexus/plexus-compiler-javac/2.8.4/plexus-compiler-javac-2.8.4.jar
[INFO] Downloading from central: https://repo.maven.apache.org/maven2/org/codehaus/plexus/plexus-compiler-manager/2.8.4/plexus-compiler-manager-2.8.4.jar
[INFO] Downloaded from central: https://repo.maven.apache.org/maven2/org/codehaus/plexus/plexus-compiler-manager/2.8.4/plexus-compiler-manager-2.8.4.jar (4.7 kB at 294 kB/s)
[INFO] Downloaded from central: https://repo.maven.apache.org/maven2/org/codehaus/plexus/plexus-compiler-javac/2.8.4/plexus-compiler-javac-2.8.4.jar (21 kB at 1.3 MB/s)
[INFO] Downloaded from central: https://repo.maven.apache.org/maven2/org/codehaus/plexus/plexus-compiler-api/2.8.4/plexus-compiler-api-2.8.4.jar (27 kB at 1.5 MB/s)
[INFO] Downloaded from central: https://repo.maven.apache.org/maven2/org/codehaus/plexus/plexus-java/0.9.10/plexus-java-0.9.10.jar (39 kB at 2.0 MB/s)
[INFO] No sources to compile
[INFO] 
[INFO] --- maven-resources-plugin:2.6:testResources (default-testResources) @ junit-path-with-umlaut ---
[WARNING] Using platform encoding (ISO-8859-1 actually) to copy filtered resources, i.e. build is platform dependent!
[INFO] skip non existing resourceDirectory /home/jenkins/jenkins-slave/workspace/box_maven-surefire_SUREFIRE-1617@2/surefire-its/target/this is: a testsurefire-1617/src/test/resources
[INFO] 
[INFO] --- maven-compiler-plugin:3.8.1:testCompile (default-testCompile) @ junit-path-with-umlaut ---
[INFO] Changes detected - recompiling the module!
[WARNING] File encoding has not been set, using platform encoding ISO-8859-1, i.e. build is platform dependent!
[INFO] Compiling 1 source file to /home/jenkins/jenkins-slave/workspace/box_maven-surefire_SUREFIRE-1617@2/surefire-its/target/this is: a testsurefire-1617/target/test-classes
[INFO] 
[INFO] --- maven-surefire-plugin:3.0.0-SNAPSHOT:test (default-test) @ junit-path-with-umlaut ---
[INFO] Downloading from central: https://repo.maven.apache.org/maven2/org/codehaus/plexus/plexus-utils/1.1/plexus-utils-1.1.jar
[INFO] Downloaded from central: https://repo.maven.apache.org/maven2/org/codehaus/plexus/plexus-utils/1.1/plexus-utils-1.1.jar (169 kB at 5.8 MB/s)
[INFO] Surefire report directory: /home/jenkins/jenkins-slave/workspace/box_maven-surefire_SUREFIRE-1617@2/surefire-its/target/this is: a testsurefire-1617/target/surefire-reports
[INFO] 
[INFO] -------------------------------------------------------
[INFO]  T E S T S
[INFO] -------------------------------------------------------
[INFO] 
[INFO] Results:
[INFO] 
[INFO] Tests run: 0, Failures: 0, Errors: 0, Skipped: 0
[INFO] 
[INFO] ------------------------------------------------------------------------
[INFO] BUILD FAILURE
[INFO] ------------------------------------------------------------------------
[INFO] Total time:  3.462 s
[INFO] Finished at: 2019-05-09T19:00:39Z
[INFO] ------------------------------------------------------------------------
[ERROR] Failed to execute goal org.apache.maven.plugins:maven-surefire-plugin:3.0.0-SNAPSHOT:test (default-test) on project junit-path-with-umlaut: There are test failures.
[ERROR] 
[ERROR] Please refer to /home/jenkins/jenkins-slave/workspace/box_maven-surefire_SUREFIRE-1617@2/surefire-its/target/this is: a testsurefire-1617/target/surefire-reports for the individual test results.
[ERROR] Please refer to dump files (if any exist) [date].dump, [date]-jvmRun[N].dump and [date].dumpstream.
[ERROR] The forked VM terminated without properly saying goodbye. VM crash or System.exit called?
[ERROR] Command was /bin/sh -c cd "/home/jenkins/jenkins-slave/workspace/box_maven-surefire_SUREFIRE-1617@2/surefire-its/target/this is: a testsurefire-1617" && /usr/local/asfpackages/java/openjdk-12-ea+33/bin/java -jar '/home/jenkins/jenkins-slave/workspace/box_maven-surefire_SUREFIRE-1617@2/surefire-its/target/this is: a testsurefire-1617/target/surefire/surefirebooter2744970329963363675.jar' '/home/jenkins/jenkins-slave/workspace/box_maven-surefire_SUREFIRE-1617@2/surefire-its/target/this is: a testsurefire-1617/target/surefire' 2019-05-09T19-00-38_822-jvmRun1 surefire14073523476079244179tmp surefire_04300831301545990506tmp
[ERROR] Error occurred in starting fork, check output in log
[ERROR] Process Exit Code: 1
[ERROR] org.apache.maven.surefire.booter.SurefireBooterForkException: The forked VM terminated without properly saying goodbye. VM crash or System.exit called?
[ERROR] Command was /bin/sh -c cd "/home/jenkins/jenkins-slave/workspace/box_maven-surefire_SUREFIRE-1617@2/surefire-its/target/this is: a testsurefire-1617" && /usr/local/asfpackages/java/openjdk-12-ea+33/bin/java -jar '/home/jenkins/jenkins-slave/workspace/box_maven-surefire_SUREFIRE-1617@2/surefire-its/target/this is: a testsurefire-1617/target/surefire/surefirebooter2744970329963363675.jar' '/home/jenkins/jenkins-slave/workspace/box_maven-surefire_SUREFIRE-1617@2/surefire-its/target/this is: a testsurefire-1617/target/surefire' 2019-05-09T19-00-38_822-jvmRun1 surefire14073523476079244179tmp surefire_04300831301545990506tmp
[ERROR] Error occurred in starting fork, check output in log
[ERROR] Process Exit Code: 1
[ERROR] 	at org.apache.maven.plugin.surefire.booterclient.ForkStarter.fork(ForkStarter.java:690)
[ERROR] 	at org.apache.maven.plugin.surefire.booterclient.ForkStarter.run(ForkStarter.java:285)
[ERROR] 	at org.apache.maven.plugin.surefire.booterclient.ForkStarter.run(ForkStarter.java:248)
[ERROR] 	at org.apache.maven.plugin.surefire.AbstractSurefireMojo.executeProvider(AbstractSurefireMojo.java:1191)
[ERROR] 	at org.apache.maven.plugin.surefire.AbstractSurefireMojo.executeAfterPreconditionsChecked(AbstractSurefireMojo.java:1038)
[ERROR] 	at org.apache.maven.plugin.surefire.AbstractSurefireMojo.execute(AbstractSurefireMojo.java:865)
[ERROR] 	at org.apache.maven.plugin.DefaultBuildPluginManager.executeMojo(DefaultBuildPluginManager.java:137)
[ERROR] 	at org.apache.maven.lifecycle.internal.MojoExecutor.execute(MojoExecutor.java:210)
[ERROR] 	at org.apache.maven.lifecycle.internal.MojoExecutor.execute(MojoExecutor.java:156)
[ERROR] 	at org.apache.maven.lifecycle.internal.MojoExecutor.execute(MojoExecutor.java:148)
[ERROR] 	at org.apache.maven.lifecycle.internal.LifecycleModuleBuilder.buildProject(LifecycleModuleBuilder.java:117)
[ERROR] 	at org.apache.maven.lifecycle.internal.LifecycleModuleBuilder.buildProject(LifecycleModuleBuilder.java:81)
[ERROR] 	at org.apache.maven.lifecycle.internal.builder.singlethreaded.SingleThreadedBuilder.build(SingleThreadedBuilder.java:56)
[ERROR] 	at org.apache.maven.lifecycle.internal.LifecycleStarter.execute(LifecycleStarter.java:128)
[ERROR] 	at org.apache.maven.DefaultMaven.doExecute(DefaultMaven.java:305)
[ERROR] 	at org.apache.maven.DefaultMaven.doExecute(DefaultMaven.java:192)
[ERROR] 	at org.apache.maven.DefaultMaven.execute(DefaultMaven.java:105)
[ERROR] 	at org.apache.maven.cli.MavenCli.execute(MavenCli.java:956)
[ERROR] 	at org.apache.maven.cli.MavenCli.doMain(MavenCli.java:288)
[ERROR] 	at org.apache.maven.cli.MavenCli.main(MavenCli.java:192)
[ERROR] 	at java.base/jdk.internal.reflect.NativeMethodAccessorImpl.invoke0(Native Method)
[ERROR] 	at java.base/jdk.internal.reflect.NativeMethodAccessorImpl.invoke(NativeMethodAccessorImpl.java:62)
[ERROR] 	at java.base/jdk.internal.reflect.DelegatingMethodAccessorImpl.invoke(DelegatingMethodAccessorImpl.java:43)
[ERROR] 	at java.base/java.lang.reflect.Method.invoke(Method.java:567)
[ERROR] 	at org.codehaus.plexus.classworlds.launcher.Launcher.launchEnhanced(Launcher.java:289)
[ERROR] 	at org.codehaus.plexus.classworlds.launcher.Launcher.launch(Launcher.java:229)
[ERROR] 	at org.codehaus.plexus.classworlds.launcher.Launcher.mainWithExitCode(Launcher.java:415)
[ERROR] 	at org.codehaus.plexus.classworlds.launcher.Launcher.main(Launcher.java:356)
[ERROR] -> [Help 1]
org.apache.maven.lifecycle.LifecycleExecutionException: Failed to execute goal org.apache.maven.plugins:maven-surefire-plugin:3.0.0-SNAPSHOT:test (default-test) on project junit-path-with-umlaut: There are test failures.

Please refer to /home/jenkins/jenkins-slave/workspace/box_maven-surefire_SUREFIRE-1617@2/surefire-its/target/this is: a testsurefire-1617/target/surefire-reports for the individual test results.
Please refer to dump files (if any exist) [date].dump, [date]-jvmRun[N].dump and [date].dumpstream.
The forked VM terminated without properly saying goodbye. VM crash or System.exit called?
Command was /bin/sh -c cd "/home/jenkins/jenkins-slave/workspace/box_maven-surefire_SUREFIRE-1617@2/surefire-its/target/this is: a testsurefire-1617" && /usr/local/asfpackages/java/openjdk-12-ea+33/bin/java -jar '/home/jenkins/jenkins-slave/workspace/box_maven-surefire_SUREFIRE-1617@2/surefire-its/target/this is: a testsurefire-1617/target/surefire/surefirebooter2744970329963363675.jar' '/home/jenkins/jenkins-slave/workspace/box_maven-surefire_SUREFIRE-1617@2/surefire-its/target/this is: a testsurefire-1617/target/surefire' 2019-05-09T19-00-38_822-jvmRun1 surefire14073523476079244179tmp surefire_04300831301545990506tmp
Error occurred in starting fork, check output in log
Process Exit Code: 1
org.apache.maven.surefire.booter.SurefireBooterForkException: The forked VM terminated without properly saying goodbye. VM crash or System.exit called?
Command was /bin/sh -c cd "/home/jenkins/jenkins-slave/workspace/box_maven-surefire_SUREFIRE-1617@2/surefire-its/target/this is: a testsurefire-1617" && /usr/local/asfpackages/java/openjdk-12-ea+33/bin/java -jar '/home/jenkins/jenkins-slave/workspace/box_maven-surefire_SUREFIRE-1617@2/surefire-its/target/this is: a testsurefire-1617/target/surefire/surefirebooter2744970329963363675.jar' '/home/jenkins/jenkins-slave/workspace/box_maven-surefire_SUREFIRE-1617@2/surefire-its/target/this is: a testsurefire-1617/target/surefire' 2019-05-09T19-00-38_822-jvmRun1 surefire14073523476079244179tmp surefire_04300831301545990506tmp
Error occurred in starting fork, check output in log
Process Exit Code: 1
	at org.apache.maven.plugin.surefire.booterclient.ForkStarter.fork(ForkStarter.java:690)
	at org.apache.maven.plugin.surefire.booterclient.ForkStarter.run(ForkStarter.java:285)
	at org.apache.maven.plugin.surefire.booterclient.ForkStarter.run(ForkStarter.java:248)
	at org.apache.maven.plugin.surefire.AbstractSurefireMojo.executeProvider(AbstractSurefireMojo.java:1191)
	at org.apache.maven.plugin.surefire.AbstractSurefireMojo.executeAfterPreconditionsChecked(AbstractSurefireMojo.java:1038)
	at org.apache.maven.plugin.surefire.AbstractSurefireMojo.execute(AbstractSurefireMojo.java:865)
	at org.apache.maven.plugin.DefaultBuildPluginManager.executeMojo(DefaultBuildPluginManager.java:137)
	at org.apache.maven.lifecycle.internal.MojoExecutor.execute(MojoExecutor.java:210)
	at org.apache.maven.lifecycle.internal.MojoExecutor.execute(MojoExecutor.java:156)
	at org.apache.maven.lifecycle.internal.MojoExecutor.execute(MojoExecutor.java:148)
	at org.apache.maven.lifecycle.internal.LifecycleModuleBuilder.buildProject(LifecycleModuleBuilder.java:117)
	at org.apache.maven.lifecycle.internal.LifecycleModuleBuilder.buildProject(LifecycleModuleBuilder.java:81)
	at org.apache.maven.lifecycle.internal.builder.singlethreaded.SingleThreadedBuilder.build(SingleThreadedBuilder.java:56)
	at org.apache.maven.lifecycle.internal.LifecycleStarter.execute(LifecycleStarter.java:128)
	at org.apache.maven.DefaultMaven.doExecute(DefaultMaven.java:305)
	at org.apache.maven.DefaultMaven.doExecute(DefaultMaven.java:192)
	at org.apache.maven.DefaultMaven.execute(DefaultMaven.java:105)
	at org.apache.maven.cli.MavenCli.execute(MavenCli.java:956)
	at org.apache.maven.cli.MavenCli.doMain(MavenCli.java:288)
	at org.apache.maven.cli.MavenCli.main(MavenCli.java:192)
	at java.base/jdk.internal.reflect.NativeMethodAccessorImpl.invoke0(Native Method)
	at java.base/jdk.internal.reflect.NativeMethodAccessorImpl.invoke(NativeMethodAccessorImpl.java:62)
	at java.base/jdk.internal.reflect.DelegatingMethodAccessorImpl.invoke(DelegatingMethodAccessorImpl.java:43)
	at java.base/java.lang.reflect.Method.invoke(Method.java:567)
	at org.codehaus.plexus.classworlds.launcher.Launcher.launchEnhanced(Launcher.java:289)
	at org.codehaus.plexus.classworlds.launcher.Launcher.launch(Launcher.java:229)
	at org.codehaus.plexus.classworlds.launcher.Launcher.mainWithExitCode(Launcher.java:415)
	at org.codehaus.plexus.classworlds.launcher.Launcher.main(Launcher.java:356)

    at org.apache.maven.lifecycle.internal.MojoExecutor.execute (MojoExecutor.java:215)
    at org.apache.maven.lifecycle.internal.MojoExecutor.execute (MojoExecutor.java:156)
    at org.apache.maven.lifecycle.internal.MojoExecutor.execute (MojoExecutor.java:148)
    at org.apache.maven.lifecycle.internal.LifecycleModuleBuilder.buildProject (LifecycleModuleBuilder.java:117)
    at org.apache.maven.lifecycle.internal.LifecycleModuleBuilder.buildProject (LifecycleModuleBuilder.java:81)
    at org.apache.maven.lifecycle.internal.builder.singlethreaded.SingleThreadedBuilder.build (SingleThreadedBuilder.java:56)
    at org.apache.maven.lifecycle.internal.LifecycleStarter.execute (LifecycleStarter.java:128)
    at org.apache.maven.DefaultMaven.doExecute (DefaultMaven.java:305)
    at org.apache.maven.DefaultMaven.doExecute (DefaultMaven.java:192)
    at org.apache.maven.DefaultMaven.execute (DefaultMaven.java:105)
    at org.apache.maven.cli.MavenCli.execute (MavenCli.java:956)
    at org.apache.maven.cli.MavenCli.doMain (MavenCli.java:288)
    at org.apache.maven.cli.MavenCli.main (MavenCli.java:192)
    at jdk.internal.reflect.NativeMethodAccessorImpl.invoke0 (Native Method)
    at jdk.internal.reflect.NativeMethodAccessorImpl.invoke (NativeMethodAccessorImpl.java:62)
    at jdk.internal.reflect.DelegatingMethodAccessorImpl.invoke (DelegatingMethodAccessorImpl.java:43)
    at java.lang.reflect.Method.invoke (Method.java:567)
    at org.codehaus.plexus.classworlds.launcher.Launcher.launchEnhanced (Launcher.java:289)
    at org.codehaus.plexus.classworlds.launcher.Launcher.launch (Launcher.java:229)
    at org.codehaus.plexus.classworlds.launcher.Launcher.mainWithExitCode (Launcher.java:415)
    at org.codehaus.plexus.classworlds.launcher.Launcher.main (Launcher.java:356)
Caused by: org.apache.maven.plugin.MojoExecutionException: There are test failures.

Please refer to /home/jenkins/jenkins-slave/workspace/box_maven-surefire_SUREFIRE-1617@2/surefire-its/target/this is: a testsurefire-1617/target/surefire-reports for the individual test results.
Please refer to dump files (if any exist) [date].dump, [date]-jvmRun[N].dump and [date].dumpstream.
The forked VM terminated without properly saying goodbye. VM crash or System.exit called?
Command was /bin/sh -c cd "/home/jenkins/jenkins-slave/workspace/box_maven-surefire_SUREFIRE-1617@2/surefire-its/target/this is: a testsurefire-1617" && /usr/local/asfpackages/java/openjdk-12-ea+33/bin/java -jar '/home/jenkins/jenkins-slave/workspace/box_maven-surefire_SUREFIRE-1617@2/surefire-its/target/this is: a testsurefire-1617/target/surefire/surefirebooter2744970329963363675.jar' '/home/jenkins/jenkins-slave/workspace/box_maven-surefire_SUREFIRE-1617@2/surefire-its/target/this is: a testsurefire-1617/target/surefire' 2019-05-09T19-00-38_822-jvmRun1 surefire14073523476079244179tmp surefire_04300831301545990506tmp
Error occurred in starting fork, check output in log
Process Exit Code: 1
org.apache.maven.surefire.booter.SurefireBooterForkException: The forked VM terminated without properly saying goodbye. VM crash or System.exit called?
Command was /bin/sh -c cd "/home/jenkins/jenkins-slave/workspace/box_maven-surefire_SUREFIRE-1617@2/surefire-its/target/this is: a testsurefire-1617" && /usr/local/asfpackages/java/openjdk-12-ea+33/bin/java -jar '/home/jenkins/jenkins-slave/workspace/box_maven-surefire_SUREFIRE-1617@2/surefire-its/target/this is: a testsurefire-1617/target/surefire/surefirebooter2744970329963363675.jar' '/home/jenkins/jenkins-slave/workspace/box_maven-surefire_SUREFIRE-1617@2/surefire-its/target/this is: a testsurefire-1617/target/surefire' 2019-05-09T19-00-38_822-jvmRun1 surefire14073523476079244179tmp surefire_04300831301545990506tmp
Error occurred in starting fork, check output in log
Process Exit Code: 1
	at org.apache.maven.plugin.surefire.booterclient.ForkStarter.fork(ForkStarter.java:690)
	at org.apache.maven.plugin.surefire.booterclient.ForkStarter.run(ForkStarter.java:285)
	at org.apache.maven.plugin.surefire.booterclient.ForkStarter.run(ForkStarter.java:248)
	at org.apache.maven.plugin.surefire.AbstractSurefireMojo.executeProvider(AbstractSurefireMojo.java:1191)
	at org.apache.maven.plugin.surefire.AbstractSurefireMojo.executeAfterPreconditionsChecked(AbstractSurefireMojo.java:1038)
	at org.apache.maven.plugin.surefire.AbstractSurefireMojo.execute(AbstractSurefireMojo.java:865)
	at org.apache.maven.plugin.DefaultBuildPluginManager.executeMojo(DefaultBuildPluginManager.java:137)
	at org.apache.maven.lifecycle.internal.MojoExecutor.execute(MojoExecutor.java:210)
	at org.apache.maven.lifecycle.internal.MojoExecutor.execute(MojoExecutor.java:156)
	at org.apache.maven.lifecycle.internal.MojoExecutor.execute(MojoExecutor.java:148)
	at org.apache.maven.lifecycle.internal.LifecycleModuleBuilder.buildProject(LifecycleModuleBuilder.java:117)
	at org.apache.maven.lifecycle.internal.LifecycleModuleBuilder.buildProject(LifecycleModuleBuilder.java:81)
	at org.apache.maven.lifecycle.internal.builder.singlethreaded.SingleThreadedBuilder.build(SingleThreadedBuilder.java:56)
	at org.apache.maven.lifecycle.internal.LifecycleStarter.execute(LifecycleStarter.java:128)
	at org.apache.maven.DefaultMaven.doExecute(DefaultMaven.java:305)
	at org.apache.maven.DefaultMaven.doExecute(DefaultMaven.java:192)
	at org.apache.maven.DefaultMaven.execute(DefaultMaven.java:105)
	at org.apache.maven.cli.MavenCli.execute(MavenCli.java:956)
	at org.apache.maven.cli.MavenCli.doMain(MavenCli.java:288)
	at org.apache.maven.cli.MavenCli.main(MavenCli.java:192)
	at java.base/jdk.internal.reflect.NativeMethodAccessorImpl.invoke0(Native Method)
	at java.base/jdk.internal.reflect.NativeMethodAccessorImpl.invoke(NativeMethodAccessorImpl.java:62)
	at java.base/jdk.internal.reflect.DelegatingMethodAccessorImpl.invoke(DelegatingMethodAccessorImpl.java:43)
	at java.base/java.lang.reflect.Method.invoke(Method.java:567)
	at org.codehaus.plexus.classworlds.launcher.Launcher.launchEnhanced(Launcher.java:289)
	at org.codehaus.plexus.classworlds.launcher.Launcher.launch(Launcher.java:229)
	at org.codehaus.plexus.classworlds.launcher.Launcher.mainWithExitCode(Launcher.java:415)
	at org.codehaus.plexus.classworlds.launcher.Launcher.main(Launcher.java:356)

    at org.apache.maven.plugin.surefire.SurefireHelper.throwException (SurefireHelper.java:266)
    at org.apache.maven.plugin.surefire.SurefireHelper.reportExecution (SurefireHelper.java:159)
    at org.apache.maven.plugin.surefire.SurefirePlugin.handleSummary (SurefirePlugin.java:377)
    at org.apache.maven.plugin.surefire.AbstractSurefireMojo.executeAfterPreconditionsChecked (AbstractSurefireMojo.java:1054)
    at org.apache.maven.plugin.surefire.AbstractSurefireMojo.execute (AbstractSurefireMojo.java:865)
    at org.apache.maven.plugin.DefaultBuildPluginManager.executeMojo (DefaultBuildPluginManager.java:137)
    at org.apache.maven.lifecycle.internal.MojoExecutor.execute (MojoExecutor.java:210)
    at org.apache.maven.lifecycle.internal.MojoExecutor.execute (MojoExecutor.java:156)
    at org.apache.maven.lifecycle.internal.MojoExecutor.execute (MojoExecutor.java:148)
    at org.apache.maven.lifecycle.internal.LifecycleModuleBuilder.buildProject (LifecycleModuleBuilder.java:117)
    at org.apache.maven.lifecycle.internal.LifecycleModuleBuilder.buildProject (LifecycleModuleBuilder.java:81)
    at org.apache.maven.lifecycle.internal.builder.singlethreaded.SingleThreadedBuilder.build (SingleThreadedBuilder.java:56)
    at org.apache.maven.lifecycle.internal.LifecycleStarter.execute (LifecycleStarter.java:128)
    at org.apache.maven.DefaultMaven.doExecute (DefaultMaven.java:305)
    at org.apache.maven.DefaultMaven.doExecute (DefaultMaven.java:192)
    at org.apache.maven.DefaultMaven.execute (DefaultMaven.java:105)
    at org.apache.maven.cli.MavenCli.execute (MavenCli.java:956)
    at org.apache.maven.cli.MavenCli.doMain (MavenCli.java:288)
    at org.apache.maven.cli.MavenCli.main (MavenCli.java:192)
    at jdk.internal.reflect.NativeMethodAccessorImpl.invoke0 (Native Method)
    at jdk.internal.reflect.NativeMethodAccessorImpl.invoke (NativeMethodAccessorImpl.java:62)
    at jdk.internal.reflect.DelegatingMethodAccessorImpl.invoke (DelegatingMethodAccessorImpl.java:43)
    at java.lang.reflect.Method.invoke (Method.java:567)
    at org.codehaus.plexus.classworlds.launcher.Launcher.launchEnhanced (Launcher.java:289)
    at org.codehaus.plexus.classworlds.launcher.Launcher.launch (Launcher.java:229)
    at org.codehaus.plexus.classworlds.launcher.Launcher.mainWithExitCode (Launcher.java:415)
    at org.codehaus.plexus.classworlds.launcher.Launcher.main (Launcher.java:356)
Caused by: org.apache.maven.surefire.booter.SurefireBooterForkException: The forked VM terminated without properly saying goodbye. VM crash or System.exit called?
Command was /bin/sh -c cd "/home/jenkins/jenkins-slave/workspace/box_maven-surefire_SUREFIRE-1617@2/surefire-its/target/this is: a testsurefire-1617" && /usr/local/asfpackages/java/openjdk-12-ea+33/bin/java -jar '/home/jenkins/jenkins-slave/workspace/box_maven-surefire_SUREFIRE-1617@2/surefire-its/target/this is: a testsurefire-1617/target/surefire/surefirebooter2744970329963363675.jar' '/home/jenkins/jenkins-slave/workspace/box_maven-surefire_SUREFIRE-1617@2/surefire-its/target/this is: a testsurefire-1617/target/surefire' 2019-05-09T19-00-38_822-jvmRun1 surefire14073523476079244179tmp surefire_04300831301545990506tmp
Error occurred in starting fork, check output in log
Process Exit Code: 1
    at org.apache.maven.plugin.surefire.booterclient.ForkStarter.fork (ForkStarter.java:690)
    at org.apache.maven.plugin.surefire.booterclient.ForkStarter.run (ForkStarter.java:285)
    at org.apache.maven.plugin.surefire.booterclient.ForkStarter.run (ForkStarter.java:248)
    at org.apache.maven.plugin.surefire.AbstractSurefireMojo.executeProvider (AbstractSurefireMojo.java:1191)
    at org.apache.maven.plugin.surefire.AbstractSurefireMojo.executeAfterPreconditionsChecked (AbstractSurefireMojo.java:1038)
    at org.apache.maven.plugin.surefire.AbstractSurefireMojo.execute (AbstractSurefireMojo.java:865)
    at org.apache.maven.plugin.DefaultBuildPluginManager.executeMojo (DefaultBuildPluginManager.java:137)
    at org.apache.maven.lifecycle.internal.MojoExecutor.execute (MojoExecutor.java:210)
    at org.apache.maven.lifecycle.internal.MojoExecutor.execute (MojoExecutor.java:156)
    at org.apache.maven.lifecycle.internal.MojoExecutor.execute (MojoExecutor.java:148)
    at org.apache.maven.lifecycle.internal.LifecycleModuleBuilder.buildProject (LifecycleModuleBuilder.java:117)
    at org.apache.maven.lifecycle.internal.LifecycleModuleBuilder.buildProject (LifecycleModuleBuilder.java:81)
    at org.apache.maven.lifecycle.internal.builder.singlethreaded.SingleThreadedBuilder.build (SingleThreadedBuilder.java:56)
    at org.apache.maven.lifecycle.internal.LifecycleStarter.execute (LifecycleStarter.java:128)
    at org.apache.maven.DefaultMaven.doExecute (DefaultMaven.java:305)
    at org.apache.maven.DefaultMaven.doExecute (DefaultMaven.java:192)
    at org.apache.maven.DefaultMaven.execute (DefaultMaven.java:105)
    at org.apache.maven.cli.MavenCli.execute (MavenCli.java:956)
    at org.apache.maven.cli.MavenCli.doMain (MavenCli.java:288)
    at org.apache.maven.cli.MavenCli.main (MavenCli.java:192)
    at jdk.internal.reflect.NativeMethodAccessorImpl.invoke0 (Native Method)
    at jdk.internal.reflect.NativeMethodAccessorImpl.invoke (NativeMethodAccessorImpl.java:62)
    at jdk.internal.reflect.DelegatingMethodAccessorImpl.invoke (DelegatingMethodAccessorImpl.java:43)
    at java.lang.reflect.Method.invoke (Method.java:567)
    at org.codehaus.plexus.classworlds.launcher.Launcher.launchEnhanced (Launcher.java:289)
    at org.codehaus.plexus.classworlds.launcher.Launcher.launch (Launcher.java:229)
    at org.codehaus.plexus.classworlds.launcher.Launcher.mainWithExitCode (Launcher.java:415)
    at org.codehaus.plexus.classworlds.launcher.Launcher.main (Launcher.java:356)
[ERROR] 
[ERROR] Re-run Maven using the -X switch to enable full debug logging.
[ERROR] 
[ERROR] For more information about the errors and possible solutions, please read the following articles:
[ERROR] [Help 1] http://cwiki.apache.org/confluence/display/MAVEN/MojoExecutionException

	at org.apache.maven.surefire.its.UmlautDirIT.surefire1617WithColonInProjectDir(UmlautDirIT.java:86)




Build log:
[...truncated 46683 lines...]
[2019-05-09T19:05:27.901Z] [INFO] 
[2019-05-09T19:05:27.901Z] [INFO] --- maven-resources-plugin:3.1.0:testResources (default-testResources) @ surefire-its ---
[2019-05-09T19:05:27.901Z] [INFO] Using 'UTF-8' encoding to copy filtered resources.
[2019-05-09T19:05:27.901Z] [INFO] Copying 829 resources
[2019-05-09T19:05:29.021Z] [INFO] Running org.apache.maven.surefire.its.UmlautDirIT
[2019-05-09T19:05:32.523Z] Zipped 2796 entries.
[2019-05-09T19:05:32.523Z] Archiving C:\Users\jenkins\AppData\Local\Temp\2\jenkins-maven-box-maven-surefire-SUREFIRE-1617-19\surefire-its--windows-jdk8-maven3.6.x.zip
[2019-05-09T19:05:32.524Z] [Fast Archiver] No artifacts from Maven TLP » maven-surefire » SUREFIRE-1617 #16 to compare, so performing full copy of artifacts
[Pipeline] archiveArtifacts
[2019-05-09T19:05:34.020Z] Archiving artifacts
[2019-05-09T19:05:34.042Z] [Fast Archiver] No artifacts from Maven TLP » maven-surefire » SUREFIRE-1617 #16 to compare, so performing full copy of artifacts
[Pipeline] cleanWs
[2019-05-09T19:05:35.599Z] [WS-CLEANUP] Deleting project workspace...
[2019-05-09T19:05:35.599Z] [WS-CLEANUP] Deferred wipeout is used...
[2019-05-09T19:05:35.670Z] [WS-CLEANUP] done
[Pipeline] }
[Pipeline] // ws
[Pipeline] }
[Pipeline] // timestamps
[Pipeline] }
[Pipeline] // node
[Pipeline] }
[2019-05-09T19:05:36.572Z] [INFO] Copying 3 resources
[2019-05-09T19:05:36.572Z] [INFO] 
[2019-05-09T19:05:36.572Z] [INFO] --- maven-compiler-plugin:3.7.0:testCompile (default-testCompile) @ surefire-its ---
[2019-05-09T19:05:36.898Z] [INFO] Changes detected - recompiling the module!
[2019-05-09T19:05:37.211Z] [INFO] Compiling 208 source files to C:\Users\jenkins\AppData\Local\Temp\2\jenkins-maven-box-maven-surefire-SUREFIRE-1617-19\surefire-its\target\test-classes
[2019-05-09T19:05:46.088Z] [INFO] 
[2019-05-09T19:05:46.088Z] [INFO] --- maven-surefire-plugin:3.0.0-M3:test (default-test) @ surefire-its ---
[2019-05-09T19:05:46.088Z] [INFO] Surefire report directory: C:\Users\jenkins\AppData\Local\Temp\2\jenkins-maven-box-maven-surefire-SUREFIRE-1617-19\surefire-its\target\surefire-reports
[2019-05-09T19:05:46.088Z] [INFO] Using configured provider org.apache.maven.shadefire.surefire.junit.JUnit3Provider
[2019-05-09T19:05:46.088Z] [INFO] parallel='none', perCoreThreadCount=true, threadCount=0, useUnlimitedThreads=false, threadCountSuites=0, threadCountClasses=0, threadCountMethods=0, parallelOptimized=true
[2019-05-09T19:05:46.088Z] [INFO] 
[2019-05-09T19:05:46.088Z] [INFO] -------------------------------------------------------
[2019-05-09T19:05:46.088Z] [INFO]  T E S T S
[2019-05-09T19:05:46.088Z] [INFO] -------------------------------------------------------
[2019-05-09T19:05:46.391Z] [INFO] Running org.apache.maven.surefire.its.fixture.JUnit4SuiteTest
[2019-05-09T19:05:46.699Z] [WARNING] System property already exists '-DskipTests'. Overriding to '-DskipTests'.
[2019-05-09T19:05:46.699Z] [WARNING] System property already exists '-Dx=a'. Overriding to '-Dx=b'.
[2019-05-09T19:05:46.699Z] Using JAVA_HOME=F:\jenkins\tools\java\latest12 in forked launcher.
[2019-05-09T19:05:46.699Z] [INFO] Tests run: 2, Failures: 0, Errors: 0, Skipped: 0, Time elapsed: 0.178 s - in org.apache.maven.surefire.its.fixture.JUnit4SuiteTest
[2019-05-09T19:05:47.007Z] [INFO] 
[2019-05-09T19:05:47.007Z] [INFO] Results:
[2019-05-09T19:05:47.007Z] [INFO] 
[2019-05-09T19:05:47.007Z] [INFO] Tests run: 2, Failures: 0, Errors: 0, Skipped: 0
[2019-05-09T19:05:47.007Z] [INFO] 
[2019-05-09T19:05:47.007Z] [INFO] 
[2019-05-09T19:05:47.007Z] [INFO] --- maven-jar-plugin:3.1.0:jar (default-jar) @ surefire-its ---
[2019-05-09T19:05:48.540Z] [INFO] Building jar: C:\Users\jenkins\AppData\Local\Temp\2\jenkins-maven-box-maven-surefire-SUREFIRE-1617-19\surefire-its\target\surefire-its-3.0.0-SNAPSHOT.jar
[2019-05-09T19:05:49.196Z] [INFO] 
[2019-05-09T19:05:49.196Z] [INFO] --- maven-site-plugin:3.7.1:attach-descriptor (attach-descriptor) @ surefire-its ---
[2019-05-09T19:05:49.196Z] [INFO] Skipping because packaging 'jar' is not pom.
[2019-05-09T19:05:49.196Z] [INFO] 
[2019-05-09T19:05:49.196Z] [INFO] --- jacoco-maven-plugin:0.8.3:prepare-agent-integration (jacoco-agent-it) @ surefire-its ---
[2019-05-09T19:05:49.197Z] [INFO] Skipping JaCoCo execution because property jacoco.skip is set.
[2019-05-09T19:05:49.197Z] [INFO] jacoco-it.agent set to empty
[2019-05-09T19:05:49.197Z] [INFO] 
[2019-05-09T19:05:49.197Z] [INFO] --- maven-failsafe-plugin:3.0.0-M3:integration-test (default) @ surefire-its ---
[2019-05-09T19:05:49.197Z] [INFO] Downloading from central: https://repo.maven.apache.org/maven2/org/apache/maven/surefire/surefire-junit47/3.0.0-M3/surefire-junit47-3.0.0-M3.pom
[2019-05-09T19:05:49.197Z] [INFO] Downloaded from central: https://repo.maven.apache.org/maven2/org/apache/maven/surefire/surefire-junit47/3.0.0-M3/surefire-junit47-3.0.0-M3.pom (7.3 kB at 208 kB/s)
[2019-05-09T19:05:49.197Z] [INFO] Downloading from central: https://repo.maven.apache.org/maven2/org/apache/maven/surefire/surefire-providers/3.0.0-M3/surefire-providers-3.0.0-M3.pom
[2019-05-09T19:05:49.197Z] [INFO] Downloaded from central: https://repo.maven.apache.org/maven2/org/apache/maven/surefire/surefire-providers/3.0.0-M3/surefire-providers-3.0.0-M3.pom (2.5 kB at 98 kB/s)
[2019-05-09T19:05:49.197Z] [INFO] Downloading from central: https://repo.maven.apache.org/maven2/org/apache/maven/surefire/common-junit48/3.0.0-M3/common-junit48-3.0.0-M3.pom
[2019-05-09T19:05:49.197Z] [INFO] Downloaded from central: https://repo.maven.apache.org/maven2/org/apache/maven/surefire/common-junit48/3.0.0-M3/common-junit48-3.0.0-M3.pom (2.4 kB at 113 kB/s)
[2019-05-09T19:05:49.197Z] [INFO] Downloading from central: https://repo.maven.apache.org/maven2/org/apache/maven/surefire/common-junit4/3.0.0-M3/common-junit4-3.0.0-M3.pom
[2019-05-09T19:05:49.522Z] [INFO] Downloaded from central: https://repo.maven.apache.org/maven2/org/apache/maven/surefire/common-junit4/3.0.0-M3/common-junit4-3.0.0-M3.pom (1.9 kB at 43 kB/s)
[2019-05-09T19:05:49.522Z] [INFO] Downloading from central: https://repo.maven.apache.org/maven2/org/apache/maven/surefire/common-junit3/3.0.0-M3/common-junit3-3.0.0-M3.pom
[2019-05-09T19:05:49.522Z] [INFO] Downloaded from central: https://repo.maven.apache.org/maven2/org/apache/maven/surefire/common-junit3/3.0.0-M3/common-junit3-3.0.0-M3.pom (1.6 kB at 75 kB/s)
[2019-05-09T19:05:49.522Z] [INFO] Downloading from central: https://repo.maven.apache.org/maven2/org/apache/maven/surefire/common-java5/3.0.0-M3/common-java5-3.0.0-M3.pom
[2019-05-09T19:05:49.522Z] [INFO] Downloaded from central: https://repo.maven.apache.org/maven2/org/apache/maven/surefire/common-java5/3.0.0-M3/common-java5-3.0.0-M3.pom (3.1 kB at 77 kB/s)
[2019-05-09T19:05:49.522Z] [INFO] Downloading from central: https://repo.maven.apache.org/maven2/org/apache/maven/surefire/surefire-grouper/3.0.0-M3/surefire-grouper-3.0.0-M3.pom
[2019-05-09T19:05:49.522Z] [INFO] Downloaded from central: https://repo.maven.apache.org/maven2/org/apache/maven/surefire/surefire-grouper/3.0.0-M3/surefire-grouper-3.0.0-M3.pom (2.6 kB at 82 kB/s)
[2019-05-09T19:05:49.522Z] [INFO] Downloading from central: https://repo.maven.apache.org/maven2/org/apache/maven/surefire/surefire-junit47/3.0.0-M3/surefire-junit47-3.0.0-M3.jar
[2019-05-09T19:05:49.522Z] [INFO] Downloading from central: https://repo.maven.apache.org/maven2/org/apache/maven/surefire/common-junit3/3.0.0-M3/common-junit3-3.0.0-M3.jar
[2019-05-09T19:05:49.522Z] [INFO] Downloading from central: https://repo.maven.apache.org/maven2/org/apache/maven/surefire/common-junit4/3.0.0-M3/common-junit4-3.0.0-M3.jar
[2019-05-09T19:05:49.522Z] [INFO] Downloading from central: https://repo.maven.apache.org/maven2/org/apache/maven/surefire/common-junit48/3.0.0-M3/common-junit48-3.0.0-M3.jar
[2019-05-09T19:05:49.522Z] [INFO] Downloading from central: https://repo.maven.apache.org/maven2/org/apache/maven/surefire/common-java5/3.0.0-M3/common-java5-3.0.0-M3.jar
[2019-05-09T19:05:49.834Z] [INFO] Downloaded from central: https://repo.maven.apache.org/maven2/org/apache/maven/surefire/common-junit4/3.0.0-M3/common-junit4-3.0.0-M3.jar (28 kB at 744 kB/s)
[2019-05-09T19:05:49.834Z] [INFO] Downloading from central: https://repo.maven.apache.org/maven2/org/apache/maven/surefire/surefire-grouper/3.0.0-M3/surefire-grouper-3.0.0-M3.jar
[2019-05-09T19:05:49.834Z] [INFO] Downloaded from central: https://repo.maven.apache.org/maven2/org/apache/maven/surefire/common-java5/3.0.0-M3/common-java5-3.0.0-M3.jar (32 kB at 480 kB/s)
[2019-05-09T19:05:49.834Z] [INFO] Downloaded from central: https://repo.maven.apache.org/maven2/org/apache/maven/surefire/common-junit3/3.0.0-M3/common-junit3-3.0.0-M3.jar (12 kB at 171 kB/s)
[2019-05-09T19:05:49.834Z] [INFO] Downloaded from central: https://repo.maven.apache.org/maven2/org/apache/maven/surefire/common-junit48/3.0.0-M3/common-junit48-3.0.0-M3.jar (22 kB at 103 kB/s)
[2019-05-09T19:05:49.834Z] [INFO] Downloaded from central: https://repo.maven.apache.org/maven2/org/apache/maven/surefire/surefire-junit47/3.0.0-M3/surefire-junit47-3.0.0-M3.jar (93 kB at 412 kB/s)
[2019-05-09T19:05:49.834Z] [INFO] Downloaded from central: https://repo.maven.apache.org/maven2/org/apache/maven/surefire/surefire-grouper/3.0.0-M3/surefire-grouper-3.0.0-M3.jar (40 kB at 121 kB/s)
[2019-05-09T19:05:50.727Z] [INFO] Failsafe report directory: C:\Users\jenkins\AppData\Local\Temp\2\jenkins-maven-box-maven-surefire-SUREFIRE-1617-19\surefire-its\target\failsafe-reports
[2019-05-09T19:05:50.727Z] [INFO] Using configured provider org.apache.maven.surefire.junitcore.JUnitCoreProvider
[2019-05-09T19:05:50.727Z] [INFO] parallel='none', perCoreThreadCount=false, threadCount=1, useUnlimitedThreads=false, threadCountSuites=0, threadCountClasses=0, threadCountMethods=0, parallelOptimized=true
[2019-05-09T19:05:51.120Z] [INFO] 
[2019-05-09T19:05:51.120Z] [INFO] -------------------------------------------------------
[2019-05-09T19:05:51.120Z] [INFO]  T E S T S
[2019-05-09T19:05:51.120Z] [INFO] -------------------------------------------------------
[2019-05-09T19:05:52.199Z] [INFO] Running org.apache.maven.surefire.its.UmlautDirIT
[2019-05-09T19:06:26.413Z] [WARNING] Tests run: 4, Failures: 0, Errors: 0, Skipped: 1, Time elapsed: 53.125 s - in org.apache.maven.surefire.its.UmlautDirIT
[2019-05-09T19:06:26.413Z] [INFO] 
[2019-05-09T19:06:26.413Z] [INFO] Results:
[2019-05-09T19:06:26.413Z] [INFO] 
[2019-05-09T19:06:26.413Z] [WARNING] Tests run: 4, Failures: 0, Errors: 0, Skipped: 1
[2019-05-09T19:06:26.413Z] [INFO] 
[2019-05-09T19:06:26.413Z] [INFO] 
[2019-05-09T19:06:26.413Z] [INFO] --- maven-checkstyle-plugin:3.0.0:check (checkstyle-check) @ surefire-its ---
[2019-05-09T19:06:26.413Z] [INFO] 
[2019-05-09T19:06:26.413Z] [INFO] --- maven-failsafe-plugin:3.0.0-M3:verify (default) @ surefire-its ---
[2019-05-09T19:06:26.413Z] [INFO] Failsafe report directory: C:\Users\jenkins\AppData\Local\Temp\2\jenkins-maven-box-maven-surefire-SUREFIRE-1617-19@2\surefire-its\target\failsafe-reports
[2019-05-09T19:06:26.413Z] [INFO] 
[2019-05-09T19:06:26.413Z] [INFO] --- maven-install-plugin:2.5.2:install (default-install) @ surefire-its ---
[2019-05-09T19:06:26.413Z] [INFO] Skipping artifact installation
[2019-05-09T19:06:26.413Z] [INFO] ------------------------------------------------------------------------
[2019-05-09T19:06:26.413Z] [INFO] Reactor Summary for Apache Maven Surefire 3.0.0-SNAPSHOT:
[2019-05-09T19:06:26.413Z] [INFO] 
[2019-05-09T19:06:26.413Z] [INFO] Apache Maven Surefire .............................. SUCCESS [01:11 min]
[2019-05-09T19:06:26.413Z] [INFO] SureFire Logger API ................................ SUCCESS [ 11.454 s]
[2019-05-09T19:06:26.413Z] [INFO] SureFire API ....................................... SUCCESS [ 25.481 s]
[2019-05-09T19:06:26.413Z] [INFO] SureFire Booter .................................... SUCCESS [ 24.433 s]
[2019-05-09T19:06:26.413Z] [INFO] Maven Surefire Test-Grouping Support ............... SUCCESS [ 16.336 s]
[2019-05-09T19:06:26.413Z] [INFO] SureFire Providers ................................. SUCCESS [  1.821 s]
[2019-05-09T19:06:26.413Z] [INFO] Shared JUnit3 Provider Code ........................ SUCCESS [  7.606 s]
[2019-05-09T19:06:26.413Z] [INFO] Shared Java 5 Provider Base ........................ SUCCESS [  9.658 s]
[2019-05-09T19:06:26.413Z] [INFO] Shared JUnit4 Provider Code ........................ SUCCESS [  9.622 s]
[2019-05-09T19:06:26.413Z] [INFO] Shared JUnit48 Provider Code ....................... SUCCESS [ 10.679 s]
[2019-05-09T19:06:26.413Z] [INFO] SureFire JUnit Runner .............................. SUCCESS [  7.867 s]
[2019-05-09T19:06:26.413Z] [INFO] SureFire JUnit4 Runner ............................. SUCCESS [  8.286 s]
[2019-05-09T19:06:26.413Z] [INFO] Maven Surefire Common .............................. SUCCESS [ 39.901 s]
[2019-05-09T19:06:26.413Z] [INFO] SureFire JUnitCore Runner .......................... SUCCESS [02:20 min]
[2019-05-09T19:06:26.413Z] [INFO] SureFire JUnit Platform Runner ..................... SUCCESS [ 15.836 s]
[2019-05-09T19:06:26.413Z] [INFO] SureFire TestNG Utils .............................. SUCCESS [  7.770 s]
[2019-05-09T19:06:26.413Z] [INFO] SureFire TestNG Runner ............................. SUCCESS [  9.143 s]
[2019-05-09T19:06:26.413Z] [INFO] ShadeFire JUnit3 Provider .......................... SUCCESS [  3.051 s]
[2019-05-09T19:06:26.413Z] [INFO] Surefire Report Parser ............................. SUCCESS [ 12.039 s]
[2019-05-09T19:06:26.413Z] [INFO] Maven Surefire Plugin .............................. SUCCESS [ 19.889 s]
[2019-05-09T19:06:26.413Z] [INFO] Maven Failsafe Plugin .............................. SUCCESS [02:23 min]
[2019-05-09T19:06:26.413Z] [INFO] Maven Surefire Report Plugin ....................... SUCCESS [ 25.128 s]
[2019-05-09T19:06:26.413Z] [INFO] Maven Surefire Integration Tests ................... SUCCESS [01:40 min]
[2019-05-09T19:06:26.413Z] [INFO] ------------------------------------------------------------------------
[2019-05-09T19:06:26.413Z] [INFO] BUILD SUCCESS
[2019-05-09T19:06:26.413Z] [INFO] ------------------------------------------------------------------------
[2019-05-09T19:06:26.413Z] [INFO] Total time:  12:04 min
[2019-05-09T19:06:26.413Z] [INFO] Finished at: 2019-05-09T12:06:24-07:00
[2019-05-09T19:06:26.413Z] [INFO] ------------------------------------------------------------------------
[Pipeline] }
[Pipeline] // withEnv
[Pipeline] }
[Pipeline] // stage
[Pipeline] fileExists
[Pipeline] zip
[2019-05-09T19:06:26.612Z] Writing zip file of C:\Users\jenkins\AppData\Local\Temp\2\jenkins-maven-box-maven-surefire-SUREFIRE-1617-19@2\maven-failsafe-plugin\target\it to C:\Users\jenkins\AppData\Local\Temp\2\jenkins-maven-box-maven-surefire-SUREFIRE-1617-19@2\maven-failsafe-plugin--windows-jdk11-maven3.6.x.zip
[2019-05-09T19:06:26.769Z] Zipped 78 entries.
[2019-05-09T19:06:26.769Z] Archiving C:\Users\jenkins\AppData\Local\Temp\2\jenkins-maven-box-maven-surefire-SUREFIRE-1617-19@2\maven-failsafe-plugin--windows-jdk11-maven3.6.x.zip
[2019-05-09T19:06:26.770Z] [Fast Archiver] No artifacts from Maven TLP » maven-surefire » SUREFIRE-1617 #16 to compare, so performing full copy of artifacts
[Pipeline] fileExists
[Pipeline] zip
[2019-05-09T19:06:26.908Z] Writing zip file of C:\Users\jenkins\AppData\Local\Temp\2\jenkins-maven-box-maven-surefire-SUREFIRE-1617-19@2\surefire-its\target to C:\Users\jenkins\AppData\Local\Temp\2\jenkins-maven-box-maven-surefire-SUREFIRE-1617-19@2\surefire-its--windows-jdk11-maven3.6.x.zip
[2019-05-09T19:06:36.397Z] Zipped 2796 entries.
[2019-05-09T19:06:36.397Z] Archiving C:\Users\jenkins\AppData\Local\Temp\2\jenkins-maven-box-maven-surefire-SUREFIRE-1617-19@2\surefire-its--windows-jdk11-maven3.6.x.zip
[2019-05-09T19:06:36.398Z] [Fast Archiver] No artifacts from Maven TLP » maven-surefire » SUREFIRE-1617 #16 to compare, so performing full copy of artifacts
[Pipeline] archiveArtifacts
[2019-05-09T19:06:37.980Z] Archiving artifacts
[2019-05-09T19:06:38.007Z] [Fast Archiver] No artifacts from Maven TLP » maven-surefire » SUREFIRE-1617 #16 to compare, so performing full copy of artifacts
[Pipeline] cleanWs
[2019-05-09T19:06:39.486Z] [WS-CLEANUP] Deleting project workspace...
[2019-05-09T19:06:39.486Z] [WS-CLEANUP] Deferred wipeout is used...
[2019-05-09T19:06:39.581Z] [WS-CLEANUP] done
[Pipeline] }
[Pipeline] // ws
[Pipeline] }
[Pipeline] // timestamps
[Pipeline] }
[Pipeline] // node
[Pipeline] }
[2019-05-09T19:06:49.524Z] [WARNING] Tests run: 4, Failures: 0, Errors: 0, Skipped: 1, Time elapsed: 50.566 s - in org.apache.maven.surefire.its.UmlautDirIT
[2019-05-09T19:06:49.524Z] [INFO] 
[2019-05-09T19:06:49.524Z] [INFO] Results:
[2019-05-09T19:06:49.524Z] [INFO] 
[2019-05-09T19:06:49.524Z] [WARNING] Tests run: 4, Failures: 0, Errors: 0, Skipped: 1
[2019-05-09T19:06:49.524Z] [INFO] 
[2019-05-09T19:06:49.524Z] [INFO] 
[2019-05-09T19:06:49.524Z] [INFO] --- maven-checkstyle-plugin:3.0.0:check (checkstyle-check) @ surefire-its ---
[2019-05-09T19:06:49.524Z] [INFO] 
[2019-05-09T19:06:49.524Z] [INFO] --- maven-failsafe-plugin:3.0.0-M3:verify (default) @ surefire-its ---
[2019-05-09T19:06:49.524Z] [INFO] Failsafe report directory: C:\Users\jenkins\AppData\Local\Temp\2\jenkins-maven-box-maven-surefire-SUREFIRE-1617-19\surefire-its\target\failsafe-reports
[2019-05-09T19:06:49.524Z] [INFO] 
[2019-05-09T19:06:49.524Z] [INFO] --- maven-install-plugin:2.5.2:install (default-install) @ surefire-its ---
[2019-05-09T19:06:49.524Z] [INFO] Skipping artifact installation
[2019-05-09T19:06:49.524Z] [INFO] ------------------------------------------------------------------------
[2019-05-09T19:06:49.524Z] [INFO] Reactor Summary for Apache Maven Surefire 3.0.0-SNAPSHOT:
[2019-05-09T19:06:49.524Z] [INFO] 
[2019-05-09T19:06:49.524Z] [INFO] Apache Maven Surefire .............................. SUCCESS [01:11 min]
[2019-05-09T19:06:49.524Z] [INFO] SureFire Logger API ................................ SUCCESS [ 11.374 s]
[2019-05-09T19:06:49.524Z] [INFO] SureFire API ....................................... SUCCESS [ 25.560 s]
[2019-05-09T19:06:49.524Z] [INFO] SureFire Booter .................................... SUCCESS [ 24.567 s]
[2019-05-09T19:06:49.524Z] [INFO] Maven Surefire Test-Grouping Support ............... SUCCESS [ 16.200 s]
[2019-05-09T19:06:49.524Z] [INFO] SureFire Providers ................................. SUCCESS [  1.822 s]
[2019-05-09T19:06:49.524Z] [INFO] Shared JUnit3 Provider Code ........................ SUCCESS [  7.368 s]
[2019-05-09T19:06:49.524Z] [INFO] Shared Java 5 Provider Base ........................ SUCCESS [  9.274 s]
[2019-05-09T19:06:49.524Z] [INFO] Shared JUnit4 Provider Code ........................ SUCCESS [ 10.185 s]
[2019-05-09T19:06:49.524Z] [INFO] Shared JUnit48 Provider Code ....................... SUCCESS [ 10.636 s]
[2019-05-09T19:06:49.524Z] [INFO] SureFire JUnit Runner .............................. SUCCESS [  7.895 s]
[2019-05-09T19:06:49.524Z] [INFO] SureFire JUnit4 Runner ............................. SUCCESS [ 37.485 s]
[2019-05-09T19:06:49.524Z] [INFO] Maven Surefire Common .............................. SUCCESS [ 40.428 s]
[2019-05-09T19:06:49.524Z] [INFO] SureFire JUnitCore Runner .......................... SUCCESS [02:19 min]
[2019-05-09T19:06:49.524Z] [INFO] SureFire JUnit Platform Runner ..................... SUCCESS [ 15.993 s]
[2019-05-09T19:06:49.524Z] [INFO] SureFire TestNG Utils .............................. SUCCESS [  8.447 s]
[2019-05-09T19:06:49.524Z] [INFO] SureFire TestNG Runner ............................. SUCCESS [  9.035 s]
[2019-05-09T19:06:49.524Z] [INFO] ShadeFire JUnit3 Provider .......................... SUCCESS [  3.238 s]
[2019-05-09T19:06:49.524Z] [INFO] Surefire Report Parser ............................. SUCCESS [ 11.382 s]
[2019-05-09T19:06:49.524Z] [INFO] Maven Surefire Plugin .............................. SUCCESS [ 17.788 s]
[2019-05-09T19:06:49.524Z] [INFO] Maven Failsafe Plugin .............................. SUCCESS [02:22 min]
[2019-05-09T19:06:49.524Z] [INFO] Maven Surefire Report Plugin ....................... SUCCESS [ 22.930 s]
[2019-05-09T19:06:49.524Z] [INFO] Maven Surefire Integration Tests ................... SUCCESS [01:37 min]
[2019-05-09T19:06:49.524Z] [INFO] ------------------------------------------------------------------------
[2019-05-09T19:06:49.524Z] [INFO] BUILD SUCCESS
[2019-05-09T19:06:49.524Z] [INFO] ------------------------------------------------------------------------
[2019-05-09T19:06:49.524Z] [INFO] Total time:  12:25 min
[2019-05-09T19:06:49.524Z] [INFO] Finished at: 2019-05-09T12:06:44-07:00
[2019-05-09T19:06:49.524Z] [INFO] ------------------------------------------------------------------------
[Pipeline] }
[Pipeline] // withEnv
[Pipeline] }
[Pipeline] // stage
[Pipeline] fileExists
[Pipeline] zip
[2019-05-09T19:06:49.749Z] Writing zip file of C:\Users\jenkins\AppData\Local\Temp\2\jenkins-maven-box-maven-surefire-SUREFIRE-1617-19\maven-failsafe-plugin\target\it to C:\Users\jenkins\AppData\Local\Temp\2\jenkins-maven-box-maven-surefire-SUREFIRE-1617-19\maven-failsafe-plugin--windows-jdk12-maven3.6.x.zip
[2019-05-09T19:06:49.905Z] Zipped 78 entries.
[2019-05-09T19:06:49.905Z] Archiving C:\Users\jenkins\AppData\Local\Temp\2\jenkins-maven-box-maven-surefire-SUREFIRE-1617-19\maven-failsafe-plugin--windows-jdk12-maven3.6.x.zip
[2019-05-09T19:06:49.905Z] [Fast Archiver] No artifacts from Maven TLP » maven-surefire » SUREFIRE-1617 #16 to compare, so performing full copy of artifacts
[Pipeline] fileExists
[Pipeline] zip
[2019-05-09T19:06:50.027Z] Writing zip file of C:\Users\jenkins\AppData\Local\Temp\2\jenkins-maven-box-maven-surefire-SUREFIRE-1617-19\surefire-its\target to C:\Users\jenkins\AppData\Local\Temp\2\jenkins-maven-box-maven-surefire-SUREFIRE-1617-19\surefire-its--windows-jdk12-maven3.6.x.zip
[2019-05-09T19:07:00.023Z] Zipped 2796 entries.
[2019-05-09T19:07:00.023Z] Archiving C:\Users\jenkins\AppData\Local\Temp\2\jenkins-maven-box-maven-surefire-SUREFIRE-1617-19\surefire-its--windows-jdk12-maven3.6.x.zip
[2019-05-09T19:07:00.024Z] [Fast Archiver] No artifacts from Maven TLP » maven-surefire » SUREFIRE-1617 #16 to compare, so performing full copy of artifacts
[Pipeline] archiveArtifacts
[2019-05-09T19:07:01.864Z] Archiving artifacts
[2019-05-09T19:07:01.886Z] [Fast Archiver] No artifacts from Maven TLP » maven-surefire » SUREFIRE-1617 #16 to compare, so performing full copy of artifacts
[Pipeline] cleanWs
[2019-05-09T19:07:03.667Z] [WS-CLEANUP] Deleting project workspace...
[2019-05-09T19:07:03.667Z] [WS-CLEANUP] Deferred wipeout is used...
[2019-05-09T19:07:03.770Z] [WS-CLEANUP] done
[Pipeline] }
[Pipeline] // ws
[Pipeline] }
[Pipeline] // timestamps
[Pipeline] }
[Pipeline] // node
[Pipeline] }
[Pipeline] // parallel
[Pipeline] echo
Build result: FAILURE
[Pipeline] jiraIssueSelector
[Pipeline] emailext
Mime
  • Unnamed multipart/mixed (inline, None, 0 bytes)
View raw message