maven-notifications mailing list archives

Site index · List index
Message view « Date » · « Thread »
Top « Date » · « Thread »
From Apache Jenkins Server <jenk...@builds.apache.org>
Subject Build failed in Jenkins: Maven TLP » maven-surefire » 1546-1222 #31
Date Wed, 15 May 2019 01:43:45 GMT
See https://builds.apache.org/job/maven-box/job/maven-surefire/job/1546-1222/31/

Changes:

* CommonReflectorTest
* CommonReflectorTest
* CommonReflectorTest
* CommonReflectorTest
* CommonReflectorTest
* CommonReflectorTest

All tests passed

Build log:
[...truncated 18358 lines...]
[2019-05-15T01:43:41.209Z] [INFO] Downloaded from central: https://repo.maven.apache.org/maven2/org/ow2/asm/asm-analysis/6.0_BETA/asm-analysis-6.0_BETA.jar
(21 kB at 22 kB/s)
[2019-05-15T01:43:41.209Z] [INFO] Downloaded from central: https://repo.maven.apache.org/maven2/org/vafer/jdependency/1.2/jdependency-1.2.jar
(22 kB at 23 kB/s)
[2019-05-15T01:43:41.209Z] [INFO] Downloaded from central: https://repo.maven.apache.org/maven2/org/ow2/asm/asm-tree/6.0/asm-tree-6.0.jar
(48 kB at 49 kB/s)
[2019-05-15T01:43:41.209Z] [INFO] Downloaded from central: https://repo.maven.apache.org/maven2/org/ow2/asm/asm-util/6.0_BETA/asm-util-6.0_BETA.jar
(47 kB at 43 kB/s)
[2019-05-15T01:43:41.351Z] [INFO] Excluding org.apache.maven.surefire:surefire-logger-api:jar:3.0.0-SNAPSHOT
from the shaded jar.
[2019-05-15T01:43:41.351Z] [INFO] Including org.apache.maven.shared:maven-shared-utils:jar:3.1.0
in the shaded jar.
[2019-05-15T01:43:41.351Z] [INFO] Including commons-codec:commons-codec:jar:1.11 in the shaded
jar.
[2019-05-15T01:43:41.351Z] [INFO] Minimizing jar org.apache.maven.surefire:surefire-api:jar:3.0.0-SNAPSHOT
[2019-05-15T01:43:41.530Z] [INFO] Excluding org.apache.maven.surefire:surefire-logger-api:jar:3.0.0-SNAPSHOT
from the shaded jar.
[2019-05-15T01:43:41.531Z] [INFO] Including org.apache.maven.shared:maven-shared-utils:jar:3.1.0
in the shaded jar.
[2019-05-15T01:43:41.531Z] [INFO] Including commons-codec:commons-codec:jar:1.11 in the shaded
jar.
[2019-05-15T01:43:41.531Z] [INFO] Minimizing jar org.apache.maven.surefire:surefire-api:jar:3.0.0-SNAPSHOT
[2019-05-15T01:43:42.449Z] [INFO] Minimized 433 -> 276 (63%)
[2019-05-15T01:43:42.449Z] [INFO] Replacing original artifact with shaded artifact.
[2019-05-15T01:43:42.449Z] [INFO] Replacing C:\Users\jenkins\AppData\Local\Temp\2\jenkins-maven-box-maven-surefire-1546-1222-31\surefire-api\target\surefire-api-3.0.0-SNAPSHOT.jar
with C:\Users\jenkins\AppData\Local\Temp\2\jenkins-maven-box-maven-surefire-1546-1222-31\surefire-api\target\surefire-api-3.0.0-SNAPSHOT-shaded.jar
[2019-05-15T01:43:42.449Z] [INFO] Dependency-reduced POM written at: C:\Users\jenkins\AppData\Local\Temp\2\jenkins-maven-box-maven-surefire-1546-1222-31\surefire-api\dependency-reduced-pom.xml
[2019-05-15T01:43:42.625Z] [INFO] Minimized 433 -> 276 (63%)
[2019-05-15T01:43:42.625Z] [INFO] Replacing original artifact with shaded artifact.
[2019-05-15T01:43:42.625Z] [INFO] Replacing C:\Users\jenkins\AppData\Local\Temp\2\jenkins-maven-box-maven-surefire-1546-1222-31@2\surefire-api\target\surefire-api-3.0.0-SNAPSHOT.jar
with C:\Users\jenkins\AppData\Local\Temp\2\jenkins-maven-box-maven-surefire-1546-1222-31@2\surefire-api\target\surefire-api-3.0.0-SNAPSHOT-shaded.jar
[2019-05-15T01:43:42.625Z] [INFO] Dependency-reduced POM written at: C:\Users\jenkins\AppData\Local\Temp\2\jenkins-maven-box-maven-surefire-1546-1222-31@2\surefire-api\dependency-reduced-pom.xml
[2019-05-15T01:43:42.625Z] [INFO] 
[2019-05-15T01:43:42.625Z] [INFO] --- maven-checkstyle-plugin:3.0.0:check (checkstyle-check)
@ surefire-api ---
[2019-05-15T01:43:42.765Z] [INFO] 
[2019-05-15T01:43:42.765Z] [INFO] --- maven-checkstyle-plugin:3.0.0:check (checkstyle-check)
@ surefire-api ---
[2019-05-15T01:43:44.232Z] [INFO] There are 4 errors reported by Checkstyle 6.18 with config/maven_checks.xml
ruleset.
[2019-05-15T01:43:44.233Z] [ERROR] src\main\java\org\apache\maven\surefire\booter\SurefireReflector.java:[37,8]
(imports) UnusedImports: Unused import - javax.annotation.Nonnull.
[2019-05-15T01:43:44.233Z] [INFO] Ignored 3 errors, 1 violation remaining.
[2019-05-15T01:43:44.233Z] [INFO] ------------------------------------------------------------------------
[2019-05-15T01:43:44.233Z] [INFO] Reactor Summary for Apache Maven Surefire 3.0.0-SNAPSHOT:
[2019-05-15T01:43:44.233Z] [INFO] 
[2019-05-15T01:43:44.233Z] [INFO] Apache Maven Surefire .............................. SUCCESS
[ 56.930 s]
[2019-05-15T01:43:44.233Z] [INFO] SureFire Logger API ................................ SUCCESS
[ 25.039 s]
[2019-05-15T01:43:44.233Z] [INFO] SureFire API ....................................... FAILURE
[ 21.327 s]
[2019-05-15T01:43:44.233Z] [INFO] Surefire Extensions API ............................ SKIPPED
[2019-05-15T01:43:44.233Z] [INFO] SureFire Booter .................................... SKIPPED
[2019-05-15T01:43:44.233Z] [INFO] Maven Surefire Test-Grouping Support ............... SKIPPED
[2019-05-15T01:43:44.233Z] [INFO] SureFire Providers ................................. SKIPPED
[2019-05-15T01:43:44.233Z] [INFO] Shared JUnit3 Provider Code ........................ SKIPPED
[2019-05-15T01:43:44.233Z] [INFO] Shared Java 5 Provider Base ........................ SKIPPED
[2019-05-15T01:43:44.233Z] [INFO] Shared JUnit4 Provider Code ........................ SKIPPED
[2019-05-15T01:43:44.233Z] [INFO] Shared JUnit48 Provider Code ....................... SKIPPED
[2019-05-15T01:43:44.233Z] [INFO] SureFire JUnit Runner .............................. SKIPPED
[2019-05-15T01:43:44.233Z] [INFO] SureFire JUnit4 Runner ............................. SKIPPED
[2019-05-15T01:43:44.233Z] [INFO] Maven Surefire Common .............................. SKIPPED
[2019-05-15T01:43:44.233Z] [INFO] SureFire JUnitCore Runner .......................... SKIPPED
[2019-05-15T01:43:44.233Z] [INFO] SureFire JUnit Platform Runner ..................... SKIPPED
[2019-05-15T01:43:44.233Z] [INFO] SureFire TestNG Utils .............................. SKIPPED
[2019-05-15T01:43:44.233Z] [INFO] SureFire TestNG Runner ............................. SKIPPED
[2019-05-15T01:43:44.233Z] [INFO] ShadeFire JUnit3 Provider .......................... SKIPPED
[2019-05-15T01:43:44.233Z] [INFO] Surefire Report Parser ............................. SKIPPED
[2019-05-15T01:43:44.233Z] [INFO] Maven Surefire Plugin .............................. SKIPPED
[2019-05-15T01:43:44.233Z] [INFO] Maven Failsafe Plugin .............................. SKIPPED
[2019-05-15T01:43:44.233Z] [INFO] Maven Surefire Report Plugin ....................... SKIPPED
[2019-05-15T01:43:44.233Z] [INFO] Maven Surefire Integration Tests ................... SKIPPED
[2019-05-15T01:43:44.233Z] [INFO] ------------------------------------------------------------------------
[2019-05-15T01:43:44.233Z] [INFO] BUILD FAILURE
[2019-05-15T01:43:44.233Z] [INFO] ------------------------------------------------------------------------
[2019-05-15T01:43:44.233Z] [INFO] Total time:  01:45 min
[2019-05-15T01:43:44.233Z] [INFO] Finished at: 2019-05-14T18:43:44-07:00
[2019-05-15T01:43:44.233Z] [INFO] ------------------------------------------------------------------------
[2019-05-15T01:43:44.233Z] [ERROR] Failed to execute goal org.apache.maven.plugins:maven-checkstyle-plugin:3.0.0:check
(checkstyle-check) on project surefire-api: You have 1 Checkstyle violation. -> [Help 1]
[2019-05-15T01:43:44.233Z] org.apache.maven.lifecycle.LifecycleExecutionException: Failed
to execute goal org.apache.maven.plugins:maven-checkstyle-plugin:3.0.0:check (checkstyle-check)
on project surefire-api: You have 1 Checkstyle violation.
[2019-05-15T01:43:44.233Z]     at org.apache.maven.lifecycle.internal.MojoExecutor.execute
(MojoExecutor.java:215)
[2019-05-15T01:43:44.233Z]     at org.apache.maven.lifecycle.internal.MojoExecutor.execute
(MojoExecutor.java:156)
[2019-05-15T01:43:44.233Z]     at org.apache.maven.lifecycle.internal.MojoExecutor.execute
(MojoExecutor.java:148)
[2019-05-15T01:43:44.233Z]     at org.apache.maven.lifecycle.internal.LifecycleModuleBuilder.buildProject
(LifecycleModuleBuilder.java:117)
[2019-05-15T01:43:44.233Z]     at org.apache.maven.lifecycle.internal.LifecycleModuleBuilder.buildProject
(LifecycleModuleBuilder.java:81)
[2019-05-15T01:43:44.233Z]     at org.apache.maven.lifecycle.internal.builder.singlethreaded.SingleThreadedBuilder.build
(SingleThreadedBuilder.java:56)
[2019-05-15T01:43:44.233Z]     at org.apache.maven.lifecycle.internal.LifecycleStarter.execute
(LifecycleStarter.java:128)
[2019-05-15T01:43:44.233Z]     at org.apache.maven.DefaultMaven.doExecute (DefaultMaven.java:305)
[2019-05-15T01:43:44.233Z]     at org.apache.maven.DefaultMaven.doExecute (DefaultMaven.java:192)
[2019-05-15T01:43:44.233Z]     at org.apache.maven.DefaultMaven.execute (DefaultMaven.java:105)
[2019-05-15T01:43:44.233Z]     at org.apache.maven.cli.MavenCli.execute (MavenCli.java:956)
[2019-05-15T01:43:44.233Z]     at org.apache.maven.cli.MavenCli.doMain (MavenCli.java:288)
[2019-05-15T01:43:44.233Z]     at org.apache.maven.cli.MavenCli.main (MavenCli.java:192)
[2019-05-15T01:43:44.233Z]     at sun.reflect.NativeMethodAccessorImpl.invoke0 (Native Method)
[2019-05-15T01:43:44.233Z]     at sun.reflect.NativeMethodAccessorImpl.invoke (NativeMethodAccessorImpl.java:62)
[2019-05-15T01:43:44.233Z]     at sun.reflect.DelegatingMethodAccessorImpl.invoke (DelegatingMethodAccessorImpl.java:43)
[2019-05-15T01:43:44.233Z]     at java.lang.reflect.Method.invoke (Method.java:498)
[2019-05-15T01:43:44.233Z]     at org.codehaus.plexus.classworlds.launcher.Launcher.launchEnhanced
(Launcher.java:289)
[2019-05-15T01:43:44.233Z]     at org.codehaus.plexus.classworlds.launcher.Launcher.launch
(Launcher.java:229)
[2019-05-15T01:43:44.233Z]     at org.codehaus.plexus.classworlds.launcher.Launcher.mainWithExitCode
(Launcher.java:415)
[2019-05-15T01:43:44.233Z]     at org.codehaus.plexus.classworlds.launcher.Launcher.main (Launcher.java:356)
[2019-05-15T01:43:44.233Z] Caused by: org.apache.maven.plugin.MojoFailureException: You have
1 Checkstyle violation.
[2019-05-15T01:43:44.233Z]     at org.apache.maven.plugins.checkstyle.CheckstyleViolationCheckMojo.execute
(CheckstyleViolationCheckMojo.java:576)
[2019-05-15T01:43:44.233Z]     at org.apache.maven.plugin.DefaultBuildPluginManager.executeMojo
(DefaultBuildPluginManager.java:137)
[2019-05-15T01:43:44.233Z]     at org.apache.maven.lifecycle.internal.MojoExecutor.execute
(MojoExecutor.java:210)
[2019-05-15T01:43:44.233Z]     at org.apache.maven.lifecycle.internal.MojoExecutor.execute
(MojoExecutor.java:156)
[2019-05-15T01:43:44.233Z]     at org.apache.maven.lifecycle.internal.MojoExecutor.execute
(MojoExecutor.java:148)
[2019-05-15T01:43:44.233Z]     at org.apache.maven.lifecycle.internal.LifecycleModuleBuilder.buildProject
(LifecycleModuleBuilder.java:117)
[2019-05-15T01:43:44.233Z]     at org.apache.maven.lifecycle.internal.LifecycleModuleBuilder.buildProject
(LifecycleModuleBuilder.java:81)
[2019-05-15T01:43:44.233Z]     at org.apache.maven.lifecycle.internal.builder.singlethreaded.SingleThreadedBuilder.build
(SingleThreadedBuilder.java:56)
[2019-05-15T01:43:44.233Z]     at org.apache.maven.lifecycle.internal.LifecycleStarter.execute
(LifecycleStarter.java:128)
[2019-05-15T01:43:44.233Z]     at org.apache.maven.DefaultMaven.doExecute (DefaultMaven.java:305)
[2019-05-15T01:43:44.233Z]     at org.apache.maven.DefaultMaven.doExecute (DefaultMaven.java:192)
[2019-05-15T01:43:44.233Z]     at org.apache.maven.DefaultMaven.execute (DefaultMaven.java:105)
[2019-05-15T01:43:44.233Z]     at org.apache.maven.cli.MavenCli.execute (MavenCli.java:956)
[2019-05-15T01:43:44.233Z]     at org.apache.maven.cli.MavenCli.doMain (MavenCli.java:288)
[2019-05-15T01:43:44.233Z]     at org.apache.maven.cli.MavenCli.main (MavenCli.java:192)
[2019-05-15T01:43:44.233Z]     at sun.reflect.NativeMethodAccessorImpl.invoke0 (Native Method)
[2019-05-15T01:43:44.233Z]     at sun.reflect.NativeMethodAccessorImpl.invoke (NativeMethodAccessorImpl.java:62)
[2019-05-15T01:43:44.233Z]     at sun.reflect.DelegatingMethodAccessorImpl.invoke (DelegatingMethodAccessorImpl.java:43)
[2019-05-15T01:43:44.233Z]     at java.lang.reflect.Method.invoke (Method.java:498)
[2019-05-15T01:43:44.233Z]     at org.codehaus.plexus.classworlds.launcher.Launcher.launchEnhanced
(Launcher.java:289)
[2019-05-15T01:43:44.233Z]     at org.codehaus.plexus.classworlds.launcher.Launcher.launch
(Launcher.java:229)
[2019-05-15T01:43:44.233Z]     at org.codehaus.plexus.classworlds.launcher.Launcher.mainWithExitCode
(Launcher.java:415)
[2019-05-15T01:43:44.233Z]     at org.codehaus.plexus.classworlds.launcher.Launcher.main (Launcher.java:356)
[2019-05-15T01:43:44.233Z] [ERROR] 
[2019-05-15T01:43:44.233Z] [ERROR] Re-run Maven using the -X switch to enable full debug logging.
[2019-05-15T01:43:44.233Z] [ERROR] 
[2019-05-15T01:43:44.233Z] [ERROR] For more information about the errors and possible solutions,
please read the following articles:
[2019-05-15T01:43:44.233Z] [ERROR] [Help 1] http://cwiki.apache.org/confluence/display/MAVEN/MojoFailureException
[2019-05-15T01:43:44.234Z] [ERROR] 
[2019-05-15T01:43:44.234Z] [ERROR] After correcting the problems, you can resume the build
with the command
[2019-05-15T01:43:44.234Z] [ERROR]   mvn <goals> -rf :surefire-api
[2019-05-15T01:43:44.327Z] [INFO] There are 4 errors reported by Checkstyle 6.18 with config/maven_checks.xml
ruleset.
[2019-05-15T01:43:44.327Z] [ERROR] src\main\java\org\apache\maven\surefire\booter\SurefireReflector.java:[37,8]
(imports) UnusedImports: Unused import - javax.annotation.Nonnull.
[2019-05-15T01:43:44.327Z] [INFO] Ignored 3 errors, 1 violation remaining.
[2019-05-15T01:43:44.327Z] [INFO] ------------------------------------------------------------------------
[2019-05-15T01:43:44.327Z] [INFO] Reactor Summary for Apache Maven Surefire 3.0.0-SNAPSHOT:
[2019-05-15T01:43:44.327Z] [INFO] 
[2019-05-15T01:43:44.327Z] [INFO] Apache Maven Surefire .............................. SUCCESS
[01:00 min]
[2019-05-15T01:43:44.327Z] [INFO] SureFire Logger API ................................ SUCCESS
[ 25.071 s]
[2019-05-15T01:43:44.327Z] [INFO] SureFire API ....................................... FAILURE
[ 21.224 s]
[2019-05-15T01:43:44.327Z] [INFO] Surefire Extensions API ............................ SKIPPED
[2019-05-15T01:43:44.327Z] [INFO] SureFire Booter .................................... SKIPPED
[2019-05-15T01:43:44.327Z] [INFO] Maven Surefire Test-Grouping Support ............... SKIPPED
[2019-05-15T01:43:44.327Z] [INFO] SureFire Providers ................................. SKIPPED
[2019-05-15T01:43:44.327Z] [INFO] Shared JUnit3 Provider Code ........................ SKIPPED
[2019-05-15T01:43:44.327Z] [INFO] Shared Java 5 Provider Base ........................ SKIPPED
[2019-05-15T01:43:44.327Z] [INFO] Shared JUnit4 Provider Code ........................ SKIPPED
[2019-05-15T01:43:44.327Z] [INFO] Shared JUnit48 Provider Code ....................... SKIPPED
[2019-05-15T01:43:44.327Z] [INFO] SureFire JUnit Runner .............................. SKIPPED
[2019-05-15T01:43:44.327Z] [INFO] SureFire JUnit4 Runner ............................. SKIPPED
[2019-05-15T01:43:44.327Z] [INFO] Maven Surefire Common .............................. SKIPPED
[2019-05-15T01:43:44.327Z] [INFO] SureFire JUnitCore Runner .......................... SKIPPED
[2019-05-15T01:43:44.327Z] [INFO] SureFire JUnit Platform Runner ..................... SKIPPED
[2019-05-15T01:43:44.327Z] [INFO] SureFire TestNG Utils .............................. SKIPPED
[2019-05-15T01:43:44.327Z] [INFO] SureFire TestNG Runner ............................. SKIPPED
[2019-05-15T01:43:44.327Z] [INFO] ShadeFire JUnit3 Provider .......................... SKIPPED
[2019-05-15T01:43:44.327Z] [INFO] Surefire Report Parser ............................. SKIPPED
[2019-05-15T01:43:44.327Z] [INFO] Maven Surefire Plugin .............................. SKIPPED
[2019-05-15T01:43:44.327Z] [INFO] Maven Failsafe Plugin .............................. SKIPPED
[2019-05-15T01:43:44.327Z] [INFO] Maven Surefire Report Plugin ....................... SKIPPED
[2019-05-15T01:43:44.327Z] [INFO] Maven Surefire Integration Tests ................... SKIPPED
[2019-05-15T01:43:44.327Z] [INFO] ------------------------------------------------------------------------
[2019-05-15T01:43:44.327Z] [INFO] BUILD FAILURE
[2019-05-15T01:43:44.327Z] [INFO] ------------------------------------------------------------------------
[2019-05-15T01:43:44.327Z] [INFO] Total time:  01:49 min
[2019-05-15T01:43:44.327Z] [INFO] Finished at: 2019-05-14T18:43:44-07:00
[2019-05-15T01:43:44.327Z] [INFO] ------------------------------------------------------------------------
[2019-05-15T01:43:44.327Z] [ERROR] Failed to execute goal org.apache.maven.plugins:maven-checkstyle-plugin:3.0.0:check
(checkstyle-check) on project surefire-api: You have 1 Checkstyle violation. -> [Help 1]
[2019-05-15T01:43:44.327Z] org.apache.maven.lifecycle.LifecycleExecutionException: Failed
to execute goal org.apache.maven.plugins:maven-checkstyle-plugin:3.0.0:check (checkstyle-check)
on project surefire-api: You have 1 Checkstyle violation.
[2019-05-15T01:43:44.327Z]     at org.apache.maven.lifecycle.internal.MojoExecutor.execute
(MojoExecutor.java:215)
[2019-05-15T01:43:44.327Z]     at org.apache.maven.lifecycle.internal.MojoExecutor.execute
(MojoExecutor.java:156)
[2019-05-15T01:43:44.327Z]     at org.apache.maven.lifecycle.internal.MojoExecutor.execute
(MojoExecutor.java:148)
[2019-05-15T01:43:44.328Z]     at org.apache.maven.lifecycle.internal.LifecycleModuleBuilder.buildProject
(LifecycleModuleBuilder.java:117)
[2019-05-15T01:43:44.328Z]     at org.apache.maven.lifecycle.internal.LifecycleModuleBuilder.buildProject
(LifecycleModuleBuilder.java:81)
[2019-05-15T01:43:44.328Z]     at org.apache.maven.lifecycle.internal.builder.singlethreaded.SingleThreadedBuilder.build
(SingleThreadedBuilder.java:56)
[2019-05-15T01:43:44.328Z]     at org.apache.maven.lifecycle.internal.LifecycleStarter.execute
(LifecycleStarter.java:128)
[2019-05-15T01:43:44.328Z]     at org.apache.maven.DefaultMaven.doExecute (DefaultMaven.java:305)
[2019-05-15T01:43:44.328Z]     at org.apache.maven.DefaultMaven.doExecute (DefaultMaven.java:192)
[2019-05-15T01:43:44.328Z]     at org.apache.maven.DefaultMaven.execute (DefaultMaven.java:105)
[2019-05-15T01:43:44.328Z]     at org.apache.maven.cli.MavenCli.execute (MavenCli.java:956)
[2019-05-15T01:43:44.328Z]     at org.apache.maven.cli.MavenCli.doMain (MavenCli.java:288)
[2019-05-15T01:43:44.328Z]     at org.apache.maven.cli.MavenCli.main (MavenCli.java:192)
[2019-05-15T01:43:44.328Z]     at sun.reflect.NativeMethodAccessorImpl.invoke0 (Native Method)
[2019-05-15T01:43:44.328Z]     at sun.reflect.NativeMethodAccessorImpl.invoke (NativeMethodAccessorImpl.java:62)
[2019-05-15T01:43:44.328Z]     at sun.reflect.DelegatingMethodAccessorImpl.invoke (DelegatingMethodAccessorImpl.java:43)
[2019-05-15T01:43:44.328Z]     at java.lang.reflect.Method.invoke (Method.java:498)
[2019-05-15T01:43:44.328Z]     at org.codehaus.plexus.classworlds.launcher.Launcher.launchEnhanced
(Launcher.java:289)
[2019-05-15T01:43:44.328Z]     at org.codehaus.plexus.classworlds.launcher.Launcher.launch
(Launcher.java:229)
[2019-05-15T01:43:44.328Z]     at org.codehaus.plexus.classworlds.launcher.Launcher.mainWithExitCode
(Launcher.java:415)
[2019-05-15T01:43:44.328Z]     at org.codehaus.plexus.classworlds.launcher.Launcher.main (Launcher.java:356)
[2019-05-15T01:43:44.328Z] Caused by: org.apache.maven.plugin.MojoFailureException: You have
1 Checkstyle violation.
[2019-05-15T01:43:44.328Z]     at org.apache.maven.plugins.checkstyle.CheckstyleViolationCheckMojo.execute
(CheckstyleViolationCheckMojo.java:576)
[2019-05-15T01:43:44.328Z]     at org.apache.maven.plugin.DefaultBuildPluginManager.executeMojo
(DefaultBuildPluginManager.java:137)
[2019-05-15T01:43:44.328Z]     at org.apache.maven.lifecycle.internal.MojoExecutor.execute
(MojoExecutor.java:210)
[2019-05-15T01:43:44.328Z]     at org.apache.maven.lifecycle.internal.MojoExecutor.execute
(MojoExecutor.java:156)
[2019-05-15T01:43:44.328Z]     at org.apache.maven.lifecycle.internal.MojoExecutor.execute
(MojoExecutor.java:148)
[2019-05-15T01:43:44.328Z]     at org.apache.maven.lifecycle.internal.LifecycleModuleBuilder.buildProject
(LifecycleModuleBuilder.java:117)
[2019-05-15T01:43:44.328Z]     at org.apache.maven.lifecycle.internal.LifecycleModuleBuilder.buildProject
(LifecycleModuleBuilder.java:81)
[2019-05-15T01:43:44.328Z]     at org.apache.maven.lifecycle.internal.builder.singlethreaded.SingleThreadedBuilder.build
(SingleThreadedBuilder.java:56)
[2019-05-15T01:43:44.328Z]     at org.apache.maven.lifecycle.internal.LifecycleStarter.execute
(LifecycleStarter.java:128)
[2019-05-15T01:43:44.328Z]     at org.apache.maven.DefaultMaven.doExecute (DefaultMaven.java:305)
[2019-05-15T01:43:44.328Z]     at org.apache.maven.DefaultMaven.doExecute (DefaultMaven.java:192)
[2019-05-15T01:43:44.328Z]     at org.apache.maven.DefaultMaven.execute (DefaultMaven.java:105)
[2019-05-15T01:43:44.328Z]     at org.apache.maven.cli.MavenCli.execute (MavenCli.java:956)
[2019-05-15T01:43:44.328Z]     at org.apache.maven.cli.MavenCli.doMain (MavenCli.java:288)
[2019-05-15T01:43:44.328Z]     at org.apache.maven.cli.MavenCli.main (MavenCli.java:192)
[2019-05-15T01:43:44.328Z]     at sun.reflect.NativeMethodAccessorImpl.invoke0 (Native Method)
[2019-05-15T01:43:44.328Z]     at sun.reflect.NativeMethodAccessorImpl.invoke (NativeMethodAccessorImpl.java:62)
[2019-05-15T01:43:44.328Z]     at sun.reflect.DelegatingMethodAccessorImpl.invoke (DelegatingMethodAccessorImpl.java:43)
[2019-05-15T01:43:44.328Z]     at java.lang.reflect.Method.invoke (Method.java:498)
[2019-05-15T01:43:44.328Z]     at org.codehaus.plexus.classworlds.launcher.Launcher.launchEnhanced
(Launcher.java:289)
[2019-05-15T01:43:44.328Z]     at org.codehaus.plexus.classworlds.launcher.Launcher.launch
(Launcher.java:229)
[2019-05-15T01:43:44.328Z]     at org.codehaus.plexus.classworlds.launcher.Launcher.mainWithExitCode
(Launcher.java:415)
[2019-05-15T01:43:44.328Z]     at org.codehaus.plexus.classworlds.launcher.Launcher.main (Launcher.java:356)
[2019-05-15T01:43:44.328Z] [ERROR] 
[2019-05-15T01:43:44.328Z] [ERROR] Re-run Maven using the -X switch to enable full debug logging.
[2019-05-15T01:43:44.328Z] [ERROR] 
[2019-05-15T01:43:44.328Z] [ERROR] For more information about the errors and possible solutions,
please read the following articles:
[2019-05-15T01:43:44.328Z] [ERROR] [Help 1] http://cwiki.apache.org/confluence/display/MAVEN/MojoFailureException
[2019-05-15T01:43:44.328Z] [ERROR] 
[2019-05-15T01:43:44.328Z] [ERROR] After correcting the problems, you can resume the build
with the command
[2019-05-15T01:43:44.328Z] [ERROR]   mvn <goals> -rf :surefire-api
[Pipeline] }
[Pipeline] // withEnv
[Pipeline] }
[Pipeline] // stage
[Pipeline] fileExists
[Pipeline] fileExists
[Pipeline] }
[Pipeline] // withEnv
[Pipeline] archiveArtifacts
[Pipeline] }
[2019-05-15T01:43:44.707Z] Archiving artifacts
[Pipeline] // stage
[Pipeline] cleanWs
[Pipeline] fileExists
[2019-05-15T01:43:44.800Z] [WS-CLEANUP] Deleting project workspace...
[2019-05-15T01:43:44.800Z] [WS-CLEANUP] Deferred wipeout is used...
[Pipeline] fileExists
[2019-05-15T01:43:44.856Z] [WS-CLEANUP] done
[Pipeline] }
[Pipeline] archiveArtifacts
[2019-05-15T01:43:44.890Z] Archiving artifacts
[Pipeline] // ws
[Pipeline] }
[Pipeline] cleanWs
[2019-05-15T01:43:44.988Z] [WS-CLEANUP] Deleting project workspace...
[2019-05-15T01:43:44.989Z] [WS-CLEANUP] Deferred wipeout is used...
[Pipeline] // timestamps
[Pipeline] }
[2019-05-15T01:43:45.042Z] [WS-CLEANUP] done
[Pipeline] // node
[Pipeline] }
[Pipeline] }
[Pipeline] // ws
[Pipeline] }
[Pipeline] // timestamps
[Pipeline] }
[Pipeline] // node
[Pipeline] }
[Pipeline] // parallel
[Pipeline] echo
Build result: FAILURE
[Pipeline] jiraIssueSelector
[Pipeline] emailext
Mime
  • Unnamed multipart/mixed (inline, None, 0 bytes)
View raw message