maven-notifications mailing list archives

Site index · List index
Message view « Date » · « Thread »
Top « Date » · « Thread »
From Apache Jenkins Server <jenk...@builds.apache.org>
Subject Build failed in Jenkins: Maven TLP » maven-surefire » 1546-1222 #28
Date Sun, 05 May 2019 23:59:47 GMT
See https://builds.apache.org/job/maven-box/job/maven-surefire/job/1546-1222/28/

Changes:

* improved jacoco with agent and instrumentation
* improved jacoco with agent and instrumentation
* improved jacoco with agent and instrumentation
* improved jacoco with agent and instrumentation
* improved jacoco with agent and instrumentation
* improved jacoco with agent and instrumentation
* improved jacoco with agent and instrumentation
* improved jacoco with agent and instrumentation

No tests ran.

Build log:
[...truncated 975 lines...]
[2019-05-05T23:59:41.191Z] [WS-CLEANUP] Deferred wipeout is used...
[2019-05-05T23:59:41.240Z] [INFO] Error stacktraces are turned on.
[2019-05-05T23:59:41.241Z] [INFO] Scanning for projects...
[Pipeline] fileExists
[2019-05-05T23:59:41.455Z] [ERROR] [ERROR] Some problems were encountered while processing
the POMs:
[2019-05-05T23:59:41.456Z] [ERROR] 'dependencies.dependency.version' for org.jacoco:org.jacoco.agent:jar:runtime
is missing. @ org.apache.maven.surefire:surefire-extensions-api:[unknown-version], /home/jenkins/jenkins-slave/workspace/ven-box_maven-surefire_1546-1222@3/surefire-extensions-api/pom.xml,
line 47, column 21
[2019-05-05T23:59:41.456Z] [ERROR] 'dependencies.dependency.version' for org.jacoco:org.jacoco.agent:jar:runtime
is missing. @ org.apache.maven.surefire:surefire-booter:[unknown-version], /home/jenkins/jenkins-slave/workspace/ven-box_maven-surefire_1546-1222@3/surefire-booter/pom.xml,
line 89, column 17
[2019-05-05T23:59:41.456Z] [ERROR] 'dependencies.dependency.version' for org.jacoco:org.jacoco.agent:jar:runtime
is missing. @ org.apache.maven.surefire:maven-surefire-common:[unknown-version], /home/jenkins/jenkins-slave/workspace/ven-box_maven-surefire_1546-1222@3/maven-surefire-common/pom.xml,
line 123, column 21
[2019-05-05T23:59:41.456Z] [ERROR] 'dependencies.dependency.version' for org.jacoco:org.jacoco.agent:jar:runtime
is missing. @ org.apache.maven.plugins:maven-failsafe-plugin:[unknown-version], /home/jenkins/jenkins-slave/workspace/ven-box_maven-surefire_1546-1222@3/maven-failsafe-plugin/pom.xml,
line 89, column 21
[2019-05-05T23:59:41.456Z]  @ 
[2019-05-05T23:59:41.456Z] [ERROR] The build could not read 4 projects -> [Help 1]
[2019-05-05T23:59:41.456Z] org.apache.maven.project.ProjectBuildingException: Some problems
were encountered while processing the POMs:
[2019-05-05T23:59:41.456Z] [ERROR] 'dependencies.dependency.version' for org.jacoco:org.jacoco.agent:jar:runtime
is missing. @ org.apache.maven.surefire:surefire-extensions-api:[unknown-version], /home/jenkins/jenkins-slave/workspace/ven-box_maven-surefire_1546-1222@3/surefire-extensions-api/pom.xml,
line 47, column 21
[2019-05-05T23:59:41.456Z] [ERROR] 'dependencies.dependency.version' for org.jacoco:org.jacoco.agent:jar:runtime
is missing. @ org.apache.maven.surefire:surefire-booter:[unknown-version], /home/jenkins/jenkins-slave/workspace/ven-box_maven-surefire_1546-1222@3/surefire-booter/pom.xml,
line 89, column 17
[2019-05-05T23:59:41.456Z] [ERROR] 'dependencies.dependency.version' for org.jacoco:org.jacoco.agent:jar:runtime
is missing. @ org.apache.maven.surefire:maven-surefire-common:[unknown-version], /home/jenkins/jenkins-slave/workspace/ven-box_maven-surefire_1546-1222@3/maven-surefire-common/pom.xml,
line 123, column 21
[2019-05-05T23:59:41.456Z] [ERROR] 'dependencies.dependency.version' for org.jacoco:org.jacoco.agent:jar:runtime
is missing. @ org.apache.maven.plugins:maven-failsafe-plugin:[unknown-version], /home/jenkins/jenkins-slave/workspace/ven-box_maven-surefire_1546-1222@3/maven-failsafe-plugin/pom.xml,
line 89, column 21
[2019-05-05T23:59:41.456Z] 
[2019-05-05T23:59:41.456Z]     at org.apache.maven.project.DefaultProjectBuilder.build (DefaultProjectBuilder.java:383)
[2019-05-05T23:59:41.456Z]     at org.apache.maven.graph.DefaultGraphBuilder.collectProjects
(DefaultGraphBuilder.java:414)
[2019-05-05T23:59:41.456Z]     at org.apache.maven.graph.DefaultGraphBuilder.getProjectsForMavenReactor
(DefaultGraphBuilder.java:405)
[2019-05-05T23:59:41.456Z]     at org.apache.maven.graph.DefaultGraphBuilder.build (DefaultGraphBuilder.java:82)
[2019-05-05T23:59:41.456Z]     at org.apache.maven.DefaultMaven.buildGraph (DefaultMaven.java:507)
[2019-05-05T23:59:41.456Z]     at org.apache.maven.DefaultMaven.doExecute (DefaultMaven.java:219)
[2019-05-05T23:59:41.456Z]     at org.apache.maven.DefaultMaven.doExecute (DefaultMaven.java:192)
[2019-05-05T23:59:41.456Z]     at org.apache.maven.DefaultMaven.execute (DefaultMaven.java:105)
[2019-05-05T23:59:41.456Z]     at org.apache.maven.cli.MavenCli.execute (MavenCli.java:956)
[2019-05-05T23:59:41.456Z]     at org.apache.maven.cli.MavenCli.doMain (MavenCli.java:288)
[2019-05-05T23:59:41.456Z]     at org.apache.maven.cli.MavenCli.main (MavenCli.java:192)
[2019-05-05T23:59:41.456Z]     at sun.reflect.NativeMethodAccessorImpl.invoke0 (Native Method)
[2019-05-05T23:59:41.456Z]     at sun.reflect.NativeMethodAccessorImpl.invoke (NativeMethodAccessorImpl.java:62)
[2019-05-05T23:59:41.456Z]     at sun.reflect.DelegatingMethodAccessorImpl.invoke (DelegatingMethodAccessorImpl.java:43)
[2019-05-05T23:59:41.456Z]     at java.lang.reflect.Method.invoke (Method.java:498)
[2019-05-05T23:59:41.456Z]     at org.codehaus.plexus.classworlds.launcher.Launcher.launchEnhanced
(Launcher.java:289)
[2019-05-05T23:59:41.456Z]     at org.codehaus.plexus.classworlds.launcher.Launcher.launch
(Launcher.java:229)
[2019-05-05T23:59:41.456Z]     at org.codehaus.plexus.classworlds.launcher.Launcher.mainWithExitCode
(Launcher.java:415)
[2019-05-05T23:59:41.456Z]     at org.codehaus.plexus.classworlds.launcher.Launcher.main (Launcher.java:356)
[2019-05-05T23:59:41.456Z] [ERROR]   
[2019-05-05T23:59:41.456Z] [ERROR]   The project org.apache.maven.surefire:surefire-extensions-api:3.0.0-SNAPSHOT
(/home/jenkins/jenkins-slave/workspace/ven-box_maven-surefire_1546-1222@3/surefire-extensions-api/pom.xml)
has 1 error
[2019-05-05T23:59:41.456Z] [ERROR]     'dependencies.dependency.version' for org.jacoco:org.jacoco.agent:jar:runtime
is missing. @ org.apache.maven.surefire:surefire-extensions-api:[unknown-version], /home/jenkins/jenkins-slave/workspace/ven-box_maven-surefire_1546-1222@3/surefire-extensions-api/pom.xml,
line 47, column 21
[2019-05-05T23:59:41.456Z] [ERROR]   
[2019-05-05T23:59:41.456Z] [ERROR]   The project org.apache.maven.surefire:surefire-booter:3.0.0-SNAPSHOT
(/home/jenkins/jenkins-slave/workspace/ven-box_maven-surefire_1546-1222@3/surefire-booter/pom.xml)
has 1 error
[2019-05-05T23:59:41.456Z] [ERROR]     'dependencies.dependency.version' for org.jacoco:org.jacoco.agent:jar:runtime
is missing. @ org.apache.maven.surefire:surefire-booter:[unknown-version], /home/jenkins/jenkins-slave/workspace/ven-box_maven-surefire_1546-1222@3/surefire-booter/pom.xml,
line 89, column 17
[2019-05-05T23:59:41.456Z] [ERROR]   
[2019-05-05T23:59:41.456Z] [ERROR]   The project org.apache.maven.surefire:maven-surefire-common:3.0.0-SNAPSHOT
(/home/jenkins/jenkins-slave/workspace/ven-box_maven-surefire_1546-1222@3/maven-surefire-common/pom.xml)
has 1 error
[2019-05-05T23:59:41.456Z] [ERROR]     'dependencies.dependency.version' for org.jacoco:org.jacoco.agent:jar:runtime
is missing. @ org.apache.maven.surefire:maven-surefire-common:[unknown-version], /home/jenkins/jenkins-slave/workspace/ven-box_maven-surefire_1546-1222@3/maven-surefire-common/pom.xml,
line 123, column 21
[2019-05-05T23:59:41.456Z] [ERROR]   
[2019-05-05T23:59:41.456Z] [ERROR]   The project org.apache.maven.plugins:maven-failsafe-plugin:3.0.0-SNAPSHOT
(/home/jenkins/jenkins-slave/workspace/ven-box_maven-surefire_1546-1222@3/maven-failsafe-plugin/pom.xml)
has 1 error
[2019-05-05T23:59:41.456Z] [ERROR]     'dependencies.dependency.version' for org.jacoco:org.jacoco.agent:jar:runtime
is missing. @ org.apache.maven.plugins:maven-failsafe-plugin:[unknown-version], /home/jenkins/jenkins-slave/workspace/ven-box_maven-surefire_1546-1222@3/maven-failsafe-plugin/pom.xml,
line 89, column 21
[2019-05-05T23:59:41.456Z] [ERROR] 
[2019-05-05T23:59:41.456Z] [ERROR] Re-run Maven using the -X switch to enable full debug logging.
[2019-05-05T23:59:41.456Z] [ERROR] 
[2019-05-05T23:59:41.456Z] [ERROR] For more information about the errors and possible solutions,
please read the following articles:
[2019-05-05T23:59:41.456Z] [ERROR] [Help 1] http://cwiki.apache.org/confluence/display/MAVEN/ProjectBuildingException
[Pipeline] archiveArtifacts
[2019-05-05T23:59:41.503Z] [WS-CLEANUP] done
[Pipeline] }
[Pipeline] // ws
[Pipeline] }
[Pipeline] // timestamps
[Pipeline] }
[Pipeline] // node
[Pipeline] }
[2019-05-05T23:59:41.651Z] Archiving artifacts
[Pipeline] }
[Pipeline] // withEnv
[Pipeline] }
[Pipeline] // stage
[Pipeline] cleanWs
[Pipeline] fileExists
[2019-05-05T23:59:41.936Z] Apache Maven 3.6.0 (97c98ec64a1fdfee7767ce5ffb20918da4f719f3; 2018-10-24T18:41:47Z)
[2019-05-05T23:59:41.936Z] Maven home: F:\jenkins\tools\maven\apache-maven-3.6.0\bin\..
[2019-05-05T23:59:41.936Z] Java version: 1.8.0_152, vendor: Oracle Corporation, runtime: f:\jenkins\tools\java\latest1.8\jre
[2019-05-05T23:59:41.936Z] Default locale: en_US, platform encoding: Cp1252
[2019-05-05T23:59:41.936Z] OS name: "windows server 2012 r2", version: "6.3", arch: "amd64",
family: "windows"
[2019-05-05T23:59:41.953Z] [INFO] Downloading from central: https://repo.maven.apache.org/maven2/org/apache/maven/maven-parent/33/maven-parent-33.pom
[2019-05-05T23:59:41.953Z] [INFO] Downloaded from central: https://repo.maven.apache.org/maven2/org/apache/maven/maven-parent/33/maven-parent-33.pom
(44 kB at 162 kB/s)
[2019-05-05T23:59:41.953Z] [INFO] Downloading from central: https://repo.maven.apache.org/maven2/org/apache/apache/21/apache-21.pom
[2019-05-05T23:59:41.953Z] [INFO] Downloaded from central: https://repo.maven.apache.org/maven2/org/apache/apache/21/apache-21.pom
(17 kB at 713 kB/s)
[Pipeline] fileExists
[2019-05-05T23:59:42.163Z] [WS-CLEANUP] Deleting project workspace...
[2019-05-05T23:59:42.163Z] [WS-CLEANUP] Deferred wipeout is used...
[Pipeline] archiveArtifacts
[2019-05-05T23:59:42.262Z] [ERROR] [ERROR] Some problems were encountered while processing
the POMs:
[2019-05-05T23:59:42.262Z] [ERROR] 'dependencies.dependency.version' for org.jacoco:org.jacoco.agent:jar:runtime
is missing. @ org.apache.maven.surefire:surefire-extensions-api:[unknown-version], /home/jenkins/jenkins-slave/workspace/ven-box_maven-surefire_1546-1222@2@2/surefire-extensions-api/pom.xml,
line 47, column 21
[2019-05-05T23:59:42.263Z] [ERROR] 'dependencies.dependency.version' for org.jacoco:org.jacoco.agent:jar:runtime
is missing. @ org.apache.maven.surefire:surefire-booter:[unknown-version], /home/jenkins/jenkins-slave/workspace/ven-box_maven-surefire_1546-1222@2@2/surefire-booter/pom.xml,
line 89, column 17
[2019-05-05T23:59:42.263Z] [ERROR] 'dependencies.dependency.version' for org.jacoco:org.jacoco.agent:jar:runtime
is missing. @ org.apache.maven.surefire:maven-surefire-common:[unknown-version], /home/jenkins/jenkins-slave/workspace/ven-box_maven-surefire_1546-1222@2@2/maven-surefire-common/pom.xml,
line 123, column 21
[2019-05-05T23:59:42.263Z] [ERROR] 'dependencies.dependency.version' for org.jacoco:org.jacoco.agent:jar:runtime
is missing. @ org.apache.maven.plugins:maven-failsafe-plugin:[unknown-version], /home/jenkins/jenkins-slave/workspace/ven-box_maven-surefire_1546-1222@2@2/maven-failsafe-plugin/pom.xml,
line 89, column 21
[2019-05-05T23:59:42.263Z]  @ 
[2019-05-05T23:59:42.263Z] [ERROR] The build could not read 4 projects -> [Help 1]
[2019-05-05T23:59:42.263Z] org.apache.maven.project.ProjectBuildingException: Some problems
were encountered while processing the POMs:
[2019-05-05T23:59:42.263Z] [ERROR] 'dependencies.dependency.version' for org.jacoco:org.jacoco.agent:jar:runtime
is missing. @ org.apache.maven.surefire:surefire-extensions-api:[unknown-version], /home/jenkins/jenkins-slave/workspace/ven-box_maven-surefire_1546-1222@2@2/surefire-extensions-api/pom.xml,
line 47, column 21
[2019-05-05T23:59:42.263Z] [ERROR] 'dependencies.dependency.version' for org.jacoco:org.jacoco.agent:jar:runtime
is missing. @ org.apache.maven.surefire:surefire-booter:[unknown-version], /home/jenkins/jenkins-slave/workspace/ven-box_maven-surefire_1546-1222@2@2/surefire-booter/pom.xml,
line 89, column 17
[2019-05-05T23:59:42.263Z] [ERROR] 'dependencies.dependency.version' for org.jacoco:org.jacoco.agent:jar:runtime
is missing. @ org.apache.maven.surefire:maven-surefire-common:[unknown-version], /home/jenkins/jenkins-slave/workspace/ven-box_maven-surefire_1546-1222@2@2/maven-surefire-common/pom.xml,
line 123, column 21
[2019-05-05T23:59:42.263Z] [ERROR] 'dependencies.dependency.version' for org.jacoco:org.jacoco.agent:jar:runtime
is missing. @ org.apache.maven.plugins:maven-failsafe-plugin:[unknown-version], /home/jenkins/jenkins-slave/workspace/ven-box_maven-surefire_1546-1222@2@2/maven-failsafe-plugin/pom.xml,
line 89, column 21
[2019-05-05T23:59:42.263Z] 
[2019-05-05T23:59:42.263Z]     at org.apache.maven.project.DefaultProjectBuilder.build (DefaultProjectBuilder.java:383)
[2019-05-05T23:59:42.263Z]     at org.apache.maven.graph.DefaultGraphBuilder.collectProjects
(DefaultGraphBuilder.java:414)
[2019-05-05T23:59:42.263Z]     at org.apache.maven.graph.DefaultGraphBuilder.getProjectsForMavenReactor
(DefaultGraphBuilder.java:405)
[2019-05-05T23:59:42.263Z]     at org.apache.maven.graph.DefaultGraphBuilder.build (DefaultGraphBuilder.java:82)
[2019-05-05T23:59:42.263Z]     at org.apache.maven.DefaultMaven.buildGraph (DefaultMaven.java:507)
[2019-05-05T23:59:42.263Z]     at org.apache.maven.DefaultMaven.doExecute (DefaultMaven.java:219)
[2019-05-05T23:59:42.263Z]     at org.apache.maven.DefaultMaven.doExecute (DefaultMaven.java:192)
[2019-05-05T23:59:42.263Z]     at org.apache.maven.DefaultMaven.execute (DefaultMaven.java:105)
[2019-05-05T23:59:42.263Z]     at org.apache.maven.cli.MavenCli.execute (MavenCli.java:956)
[2019-05-05T23:59:42.263Z]     at org.apache.maven.cli.MavenCli.doMain (MavenCli.java:288)
[2019-05-05T23:59:42.263Z]     at org.apache.maven.cli.MavenCli.main (MavenCli.java:192)
[2019-05-05T23:59:42.263Z]     at sun.reflect.NativeMethodAccessorImpl.invoke0 (Native Method)
[2019-05-05T23:59:42.263Z]     at sun.reflect.NativeMethodAccessorImpl.invoke (NativeMethodAccessorImpl.java:62)
[2019-05-05T23:59:42.263Z]     at sun.reflect.DelegatingMethodAccessorImpl.invoke (DelegatingMethodAccessorImpl.java:43)
[2019-05-05T23:59:42.263Z]     at java.lang.reflect.Method.invoke (Method.java:498)
[2019-05-05T23:59:42.263Z]     at org.codehaus.plexus.classworlds.launcher.Launcher.launchEnhanced
(Launcher.java:289)
[2019-05-05T23:59:42.263Z]     at org.codehaus.plexus.classworlds.launcher.Launcher.launch
(Launcher.java:229)
[2019-05-05T23:59:42.263Z]     at org.codehaus.plexus.classworlds.launcher.Launcher.mainWithExitCode
(Launcher.java:415)
[2019-05-05T23:59:42.263Z]     at org.codehaus.plexus.classworlds.launcher.Launcher.main (Launcher.java:356)
[2019-05-05T23:59:42.263Z] [ERROR]   
[2019-05-05T23:59:42.263Z] [ERROR]   The project org.apache.maven.surefire:surefire-extensions-api:3.0.0-SNAPSHOT
(/home/jenkins/jenkins-slave/workspace/ven-box_maven-surefire_1546-1222@2@2/surefire-extensions-api/pom.xml)
has 1 error
[2019-05-05T23:59:42.263Z] [ERROR]     'dependencies.dependency.version' for org.jacoco:org.jacoco.agent:jar:runtime
is missing. @ org.apache.maven.surefire:surefire-extensions-api:[unknown-version], /home/jenkins/jenkins-slave/workspace/ven-box_maven-surefire_1546-1222@2@2/surefire-extensions-api/pom.xml,
line 47, column 21
[2019-05-05T23:59:42.263Z] [ERROR]   
[2019-05-05T23:59:42.263Z] [ERROR]   The project org.apache.maven.surefire:surefire-booter:3.0.0-SNAPSHOT
(/home/jenkins/jenkins-slave/workspace/ven-box_maven-surefire_1546-1222@2@2/surefire-booter/pom.xml)
has 1 error
[2019-05-05T23:59:42.263Z] [ERROR]     'dependencies.dependency.version' for org.jacoco:org.jacoco.agent:jar:runtime
is missing. @ org.apache.maven.surefire:surefire-booter:[unknown-version], /home/jenkins/jenkins-slave/workspace/ven-box_maven-surefire_1546-1222@2@2/surefire-booter/pom.xml,
line 89, column 17
[2019-05-05T23:59:42.263Z] [ERROR]   
[2019-05-05T23:59:42.263Z] [ERROR]   The project org.apache.maven.surefire:maven-surefire-common:3.0.0-SNAPSHOT
(/home/jenkins/jenkins-slave/workspace/ven-box_maven-surefire_1546-1222@2@2/maven-surefire-common/pom.xml)
has 1 error
[2019-05-05T23:59:42.263Z] [ERROR]     'dependencies.dependency.version' for org.jacoco:org.jacoco.agent:jar:runtime
is missing. @ org.apache.maven.surefire:maven-surefire-common:[unknown-version], /home/jenkins/jenkins-slave/workspace/ven-box_maven-surefire_1546-1222@2@2/maven-surefire-common/pom.xml,
line 123, column 21
[2019-05-05T23:59:42.263Z] [ERROR]   
[2019-05-05T23:59:42.263Z] [ERROR]   The project org.apache.maven.plugins:maven-failsafe-plugin:3.0.0-SNAPSHOT
(/home/jenkins/jenkins-slave/workspace/ven-box_maven-surefire_1546-1222@2@2/maven-failsafe-plugin/pom.xml)
has 1 error
[2019-05-05T23:59:42.263Z] [ERROR]     'dependencies.dependency.version' for org.jacoco:org.jacoco.agent:jar:runtime
is missing. @ org.apache.maven.plugins:maven-failsafe-plugin:[unknown-version], /home/jenkins/jenkins-slave/workspace/ven-box_maven-surefire_1546-1222@2@2/maven-failsafe-plugin/pom.xml,
line 89, column 21
[2019-05-05T23:59:42.263Z] [ERROR] 
[2019-05-05T23:59:42.263Z] [ERROR] Re-run Maven using the -X switch to enable full debug logging.
[2019-05-05T23:59:42.263Z] [ERROR] 
[2019-05-05T23:59:42.263Z] [ERROR] For more information about the errors and possible solutions,
please read the following articles:
[2019-05-05T23:59:42.263Z] [ERROR] [Help 1] http://cwiki.apache.org/confluence/display/MAVEN/ProjectBuildingException
[Pipeline] }
[Pipeline] // withEnv
[Pipeline] }
[Pipeline] // stage
[Pipeline] fileExists
[2019-05-05T23:59:42.355Z] Archiving artifacts
[2019-05-05T23:59:42.475Z] [WS-CLEANUP] done
[Pipeline] }
[Pipeline] // ws
[Pipeline] }
[Pipeline] fileExists
[Pipeline] // timestamps
[Pipeline] }
[Pipeline] cleanWs
[Pipeline] // node
[Pipeline] }
[Pipeline] archiveArtifacts
[2019-05-05T23:59:42.854Z] Archiving artifacts
[2019-05-05T23:59:42.885Z] [WS-CLEANUP] Deleting project workspace...
[2019-05-05T23:59:42.885Z] [WS-CLEANUP] Deferred wipeout is used...
[Pipeline] cleanWs
[2019-05-05T23:59:43.197Z] [WS-CLEANUP] done
[Pipeline] }
[Pipeline] // ws
[Pipeline] }
[Pipeline] // timestamps
[Pipeline] }
[Pipeline] // node
[Pipeline] }
[2019-05-05T23:59:43.341Z] [WS-CLEANUP] Deleting project workspace...
[2019-05-05T23:59:43.341Z] [WS-CLEANUP] Deferred wipeout is used...
[2019-05-05T23:59:43.653Z] [WS-CLEANUP] done
[Pipeline] }
[Pipeline] // ws
[Pipeline] }
[Pipeline] // timestamps
[Pipeline] }
[Pipeline] // node
[Pipeline] }
[2019-05-05T23:59:44.682Z] [INFO] Error stacktraces are turned on.
[2019-05-05T23:59:44.978Z] [INFO] Scanning for projects...
[2019-05-05T23:59:46.020Z] [INFO] Downloading from central: https://repo.maven.apache.org/maven2/org/apache/maven/maven-parent/33/maven-parent-33.pom
[2019-05-05T23:59:46.657Z] [INFO] Downloaded from central: https://repo.maven.apache.org/maven2/org/apache/maven/maven-parent/33/maven-parent-33.pom
(44 kB at 71 kB/s)
[2019-05-05T23:59:46.657Z] [INFO] Downloading from central: https://repo.maven.apache.org/maven2/org/apache/apache/21/apache-21.pom
[2019-05-05T23:59:46.657Z] [INFO] Downloaded from central: https://repo.maven.apache.org/maven2/org/apache/apache/21/apache-21.pom
(17 kB at 950 kB/s)
[2019-05-05T23:59:46.951Z] [ERROR] [ERROR] Some problems were encountered while processing
the POMs:
[2019-05-05T23:59:46.951Z] [ERROR] 'dependencies.dependency.version' for org.jacoco:org.jacoco.agent:jar:runtime
is missing. @ org.apache.maven.surefire:surefire-extensions-api:[unknown-version], C:\Users\jenkins\AppData\Local\Temp\2\jenkins-maven-box-maven-surefire-1546-1222-28\surefire-extensions-api\pom.xml,
line 47, column 21
[2019-05-05T23:59:46.951Z] [ERROR] 'dependencies.dependency.version' for org.jacoco:org.jacoco.agent:jar:runtime
is missing. @ org.apache.maven.surefire:surefire-booter:[unknown-version], C:\Users\jenkins\AppData\Local\Temp\2\jenkins-maven-box-maven-surefire-1546-1222-28\surefire-booter\pom.xml,
line 89, column 17
[2019-05-05T23:59:46.951Z] [ERROR] 'dependencies.dependency.version' for org.jacoco:org.jacoco.agent:jar:runtime
is missing. @ org.apache.maven.surefire:maven-surefire-common:[unknown-version], C:\Users\jenkins\AppData\Local\Temp\2\jenkins-maven-box-maven-surefire-1546-1222-28\maven-surefire-common\pom.xml,
line 123, column 21
[2019-05-05T23:59:46.951Z] [ERROR] 'dependencies.dependency.version' for org.jacoco:org.jacoco.agent:jar:runtime
is missing. @ org.apache.maven.plugins:maven-failsafe-plugin:[unknown-version], C:\Users\jenkins\AppData\Local\Temp\2\jenkins-maven-box-maven-surefire-1546-1222-28\maven-failsafe-plugin\pom.xml,
line 89, column 21
[2019-05-05T23:59:46.951Z]  @ 
[2019-05-05T23:59:46.951Z] [ERROR] The build could not read 4 projects -> [Help 1]
[2019-05-05T23:59:46.951Z] org.apache.maven.project.ProjectBuildingException: Some problems
were encountered while processing the POMs:
[2019-05-05T23:59:46.951Z] [ERROR] 'dependencies.dependency.version' for org.jacoco:org.jacoco.agent:jar:runtime
is missing. @ org.apache.maven.surefire:surefire-extensions-api:[unknown-version], C:\Users\jenkins\AppData\Local\Temp\2\jenkins-maven-box-maven-surefire-1546-1222-28\surefire-extensions-api\pom.xml,
line 47, column 21
[2019-05-05T23:59:46.951Z] [ERROR] 'dependencies.dependency.version' for org.jacoco:org.jacoco.agent:jar:runtime
is missing. @ org.apache.maven.surefire:surefire-booter:[unknown-version], C:\Users\jenkins\AppData\Local\Temp\2\jenkins-maven-box-maven-surefire-1546-1222-28\surefire-booter\pom.xml,
line 89, column 17
[2019-05-05T23:59:46.952Z] [ERROR] 'dependencies.dependency.version' for org.jacoco:org.jacoco.agent:jar:runtime
is missing. @ org.apache.maven.surefire:maven-surefire-common:[unknown-version], C:\Users\jenkins\AppData\Local\Temp\2\jenkins-maven-box-maven-surefire-1546-1222-28\maven-surefire-common\pom.xml,
line 123, column 21
[2019-05-05T23:59:46.952Z] [ERROR] 'dependencies.dependency.version' for org.jacoco:org.jacoco.agent:jar:runtime
is missing. @ org.apache.maven.plugins:maven-failsafe-plugin:[unknown-version], C:\Users\jenkins\AppData\Local\Temp\2\jenkins-maven-box-maven-surefire-1546-1222-28\maven-failsafe-plugin\pom.xml,
line 89, column 21
[2019-05-05T23:59:46.952Z] 
[2019-05-05T23:59:46.952Z]     at org.apache.maven.project.DefaultProjectBuilder.build (DefaultProjectBuilder.java:383)
[2019-05-05T23:59:46.952Z]     at org.apache.maven.graph.DefaultGraphBuilder.collectProjects
(DefaultGraphBuilder.java:414)
[2019-05-05T23:59:46.952Z]     at org.apache.maven.graph.DefaultGraphBuilder.getProjectsForMavenReactor
(DefaultGraphBuilder.java:405)
[2019-05-05T23:59:46.952Z]     at org.apache.maven.graph.DefaultGraphBuilder.build (DefaultGraphBuilder.java:82)
[2019-05-05T23:59:46.952Z]     at org.apache.maven.DefaultMaven.buildGraph (DefaultMaven.java:507)
[2019-05-05T23:59:46.952Z]     at org.apache.maven.DefaultMaven.doExecute (DefaultMaven.java:219)
[2019-05-05T23:59:46.952Z]     at org.apache.maven.DefaultMaven.doExecute (DefaultMaven.java:192)
[2019-05-05T23:59:46.952Z]     at org.apache.maven.DefaultMaven.execute (DefaultMaven.java:105)
[2019-05-05T23:59:46.952Z]     at org.apache.maven.cli.MavenCli.execute (MavenCli.java:956)
[2019-05-05T23:59:46.952Z]     at org.apache.maven.cli.MavenCli.doMain (MavenCli.java:288)
[2019-05-05T23:59:46.952Z]     at org.apache.maven.cli.MavenCli.main (MavenCli.java:192)
[2019-05-05T23:59:46.952Z]     at sun.reflect.NativeMethodAccessorImpl.invoke0 (Native Method)
[2019-05-05T23:59:46.952Z]     at sun.reflect.NativeMethodAccessorImpl.invoke (NativeMethodAccessorImpl.java:62)
[2019-05-05T23:59:46.952Z]     at sun.reflect.DelegatingMethodAccessorImpl.invoke (DelegatingMethodAccessorImpl.java:43)
[2019-05-05T23:59:46.952Z]     at java.lang.reflect.Method.invoke (Method.java:498)
[2019-05-05T23:59:46.952Z]     at org.codehaus.plexus.classworlds.launcher.Launcher.launchEnhanced
(Launcher.java:289)
[2019-05-05T23:59:46.952Z]     at org.codehaus.plexus.classworlds.launcher.Launcher.launch
(Launcher.java:229)
[2019-05-05T23:59:46.952Z]     at org.codehaus.plexus.classworlds.launcher.Launcher.mainWithExitCode
(Launcher.java:415)
[2019-05-05T23:59:46.952Z]     at org.codehaus.plexus.classworlds.launcher.Launcher.main (Launcher.java:356)
[2019-05-05T23:59:46.952Z] [ERROR]   
[2019-05-05T23:59:46.952Z] [ERROR]   The project org.apache.maven.surefire:surefire-extensions-api:3.0.0-SNAPSHOT
(C:\Users\jenkins\AppData\Local\Temp\2\jenkins-maven-box-maven-surefire-1546-1222-28\surefire-extensions-api\pom.xml)
has 1 error
[2019-05-05T23:59:46.952Z] [ERROR]     'dependencies.dependency.version' for org.jacoco:org.jacoco.agent:jar:runtime
is missing. @ org.apache.maven.surefire:surefire-extensions-api:[unknown-version], C:\Users\jenkins\AppData\Local\Temp\2\jenkins-maven-box-maven-surefire-1546-1222-28\surefire-extensions-api\pom.xml,
line 47, column 21
[2019-05-05T23:59:46.952Z] [ERROR]   
[2019-05-05T23:59:46.952Z] [ERROR]   The project org.apache.maven.surefire:surefire-booter:3.0.0-SNAPSHOT
(C:\Users\jenkins\AppData\Local\Temp\2\jenkins-maven-box-maven-surefire-1546-1222-28\surefire-booter\pom.xml)
has 1 error
[2019-05-05T23:59:46.952Z] [ERROR]     'dependencies.dependency.version' for org.jacoco:org.jacoco.agent:jar:runtime
is missing. @ org.apache.maven.surefire:surefire-booter:[unknown-version], C:\Users\jenkins\AppData\Local\Temp\2\jenkins-maven-box-maven-surefire-1546-1222-28\surefire-booter\pom.xml,
line 89, column 17
[2019-05-05T23:59:46.952Z] [ERROR]   
[2019-05-05T23:59:46.952Z] [ERROR]   The project org.apache.maven.surefire:maven-surefire-common:3.0.0-SNAPSHOT
(C:\Users\jenkins\AppData\Local\Temp\2\jenkins-maven-box-maven-surefire-1546-1222-28\maven-surefire-common\pom.xml)
has 1 error
[2019-05-05T23:59:46.952Z] [ERROR]     'dependencies.dependency.version' for org.jacoco:org.jacoco.agent:jar:runtime
is missing. @ org.apache.maven.surefire:maven-surefire-common:[unknown-version], C:\Users\jenkins\AppData\Local\Temp\2\jenkins-maven-box-maven-surefire-1546-1222-28\maven-surefire-common\pom.xml,
line 123, column 21
[2019-05-05T23:59:46.952Z] [ERROR]   
[2019-05-05T23:59:46.952Z] [ERROR]   The project org.apache.maven.plugins:maven-failsafe-plugin:3.0.0-SNAPSHOT
(C:\Users\jenkins\AppData\Local\Temp\2\jenkins-maven-box-maven-surefire-1546-1222-28\maven-failsafe-plugin\pom.xml)
has 1 error
[2019-05-05T23:59:46.952Z] [ERROR]     'dependencies.dependency.version' for org.jacoco:org.jacoco.agent:jar:runtime
is missing. @ org.apache.maven.plugins:maven-failsafe-plugin:[unknown-version], C:\Users\jenkins\AppData\Local\Temp\2\jenkins-maven-box-maven-surefire-1546-1222-28\maven-failsafe-plugin\pom.xml,
line 89, column 21
[2019-05-05T23:59:46.952Z] [ERROR] 
[2019-05-05T23:59:46.952Z] [ERROR] Re-run Maven using the -X switch to enable full debug logging.
[2019-05-05T23:59:46.952Z] [ERROR] 
[2019-05-05T23:59:46.952Z] [ERROR] For more information about the errors and possible solutions,
please read the following articles:
[2019-05-05T23:59:46.952Z] [ERROR] [Help 1] http://cwiki.apache.org/confluence/display/MAVEN/ProjectBuildingException
[Pipeline] }
[Pipeline] // withEnv
[Pipeline] }
[Pipeline] // stage
[Pipeline] fileExists
[Pipeline] fileExists
[Pipeline] archiveArtifacts
[2019-05-05T23:59:47.444Z] Archiving artifacts
[Pipeline] cleanWs
[2019-05-05T23:59:47.514Z] [WS-CLEANUP] Deleting project workspace...
[2019-05-05T23:59:47.514Z] [WS-CLEANUP] Deferred wipeout is used...
[2019-05-05T23:59:47.557Z] [WS-CLEANUP] done
[Pipeline] }
[Pipeline] // ws
[Pipeline] }
[Pipeline] // timestamps
[Pipeline] }
[Pipeline] // node
[Pipeline] }
[Pipeline] // parallel
[Pipeline] echo
Build result: FAILURE
[Pipeline] jiraIssueSelector
[Pipeline] emailext
Mime
  • Unnamed multipart/mixed (inline, None, 0 bytes)
View raw message