maven-notifications mailing list archives

Site index · List index
Message view « Date » · « Thread »
Top « Date » · « Thread »
From Apache Jenkins Server <jenk...@builds.apache.org>
Subject Build unstable in Jenkins: Maven TLP » maven-resolver » MRESOLVER-12 #1
Date Sun, 12 May 2019 18:58:34 GMT
See https://builds.apache.org/job/maven-box/job/maven-resolver/job/MRESOLVER-12/1/

No changes.

12 tests failed.
FAILED:  org.eclipse.aether.internal.impl.collect.DefaultDependencyCollectorTest.linux-jdk8
/ Build linux-jdk8 / testSelectionWithScopeDependencySelector

Error Message:
path: [gid:root:ext:ver (root-scope)], expected: [gid:direct:ext:ver (direct-scope)], actual:
[] expected:<1> but was:<0>

Stack Trace:
java.lang.AssertionError: path: [gid:root:ext:ver (root-scope)], expected: [gid:direct:ext:ver
(direct-scope)], actual: [] expected:<1> but was:<0>
	at org.eclipse.aether.internal.impl.collect.DefaultDependencyCollectorTest.assertEqualSubtree(DefaultDependencyCollectorTest.java:144)
	at org.eclipse.aether.internal.impl.collect.DefaultDependencyCollectorTest.assertEqualSubtree(DefaultDependencyCollectorTest.java:122)
	at org.eclipse.aether.internal.impl.collect.DefaultDependencyCollectorTest.testSelectionWithScopeDependencySelector(DefaultDependencyCollectorTest.java:729)


FAILED:  org.eclipse.aether.internal.impl.collect.DefaultDependencyCollectorTest.linux-jdk8
/ Build linux-jdk8 / testDependencyManagement_DependencySelectorProcessesManagedState

Error Message:
path: [gid:root:ext:ver (root-scope), gid:direct-of-root:ext:ver (direct-of-root-scope), gid:transitive-of-root:ext:ver
(transitive-of-root-scope)], expected: [], actual: [gid:transitive-of-transitive-of-root:ext:ver
(managed)] expected:<0> but was:<1>

Stack Trace:
java.lang.AssertionError: path: [gid:root:ext:ver (root-scope), gid:direct-of-root:ext:ver
(direct-of-root-scope), gid:transitive-of-root:ext:ver (transitive-of-root-scope)], expected:
[], actual: [gid:transitive-of-transitive-of-root:ext:ver (managed)] expected:<0> but
was:<1>
	at org.eclipse.aether.internal.impl.collect.DefaultDependencyCollectorTest.assertEqualSubtree(DefaultDependencyCollectorTest.java:144)
	at org.eclipse.aether.internal.impl.collect.DefaultDependencyCollectorTest.assertEqualSubtree(DefaultDependencyCollectorTest.java:152)
	at org.eclipse.aether.internal.impl.collect.DefaultDependencyCollectorTest.assertEqualSubtree(DefaultDependencyCollectorTest.java:152)
	at org.eclipse.aether.internal.impl.collect.DefaultDependencyCollectorTest.assertEqualSubtree(DefaultDependencyCollectorTest.java:122)
	at org.eclipse.aether.internal.impl.collect.DefaultDependencyCollectorTest.testDependencyManagement_DependencySelectorProcessesManagedState(DefaultDependencyCollectorTest.java:555)


FAILED:  org.eclipse.aether.internal.impl.collect.DefaultDependencyCollectorTest.linux-jdk11
/ Build linux-jdk11 / testSelectionWithScopeDependencySelector

Error Message:
path: [gid:root:ext:ver (root-scope)], expected: [gid:direct:ext:ver (direct-scope)], actual:
[] expected:<1> but was:<0>

Stack Trace:
java.lang.AssertionError: path: [gid:root:ext:ver (root-scope)], expected: [gid:direct:ext:ver
(direct-scope)], actual: [] expected:<1> but was:<0>
	at org.eclipse.aether.internal.impl.collect.DefaultDependencyCollectorTest.assertEqualSubtree(DefaultDependencyCollectorTest.java:144)
	at org.eclipse.aether.internal.impl.collect.DefaultDependencyCollectorTest.assertEqualSubtree(DefaultDependencyCollectorTest.java:122)
	at org.eclipse.aether.internal.impl.collect.DefaultDependencyCollectorTest.testSelectionWithScopeDependencySelector(DefaultDependencyCollectorTest.java:729)


FAILED:  org.eclipse.aether.internal.impl.collect.DefaultDependencyCollectorTest.linux-jdk11
/ Build linux-jdk11 / testDependencyManagement_DependencySelectorProcessesManagedState

Error Message:
path: [gid:root:ext:ver (root-scope), gid:direct-of-root:ext:ver (direct-of-root-scope), gid:transitive-of-root:ext:ver
(transitive-of-root-scope)], expected: [], actual: [gid:transitive-of-transitive-of-root:ext:ver
(managed)] expected:<0> but was:<1>

Stack Trace:
java.lang.AssertionError: path: [gid:root:ext:ver (root-scope), gid:direct-of-root:ext:ver
(direct-of-root-scope), gid:transitive-of-root:ext:ver (transitive-of-root-scope)], expected:
[], actual: [gid:transitive-of-transitive-of-root:ext:ver (managed)] expected:<0> but
was:<1>
	at org.eclipse.aether.internal.impl.collect.DefaultDependencyCollectorTest.assertEqualSubtree(DefaultDependencyCollectorTest.java:144)
	at org.eclipse.aether.internal.impl.collect.DefaultDependencyCollectorTest.assertEqualSubtree(DefaultDependencyCollectorTest.java:152)
	at org.eclipse.aether.internal.impl.collect.DefaultDependencyCollectorTest.assertEqualSubtree(DefaultDependencyCollectorTest.java:152)
	at org.eclipse.aether.internal.impl.collect.DefaultDependencyCollectorTest.assertEqualSubtree(DefaultDependencyCollectorTest.java:122)
	at org.eclipse.aether.internal.impl.collect.DefaultDependencyCollectorTest.testDependencyManagement_DependencySelectorProcessesManagedState(DefaultDependencyCollectorTest.java:555)


FAILED:  org.eclipse.aether.internal.impl.collect.DefaultDependencyCollectorTest.linux-jdk7
/ Build linux-jdk7 / testSelectionWithScopeDependencySelector

Error Message:
path: [gid:root:ext:ver (root-scope)], expected: [gid:direct:ext:ver (direct-scope)], actual:
[] expected:<1> but was:<0>

Stack Trace:
java.lang.AssertionError: path: [gid:root:ext:ver (root-scope)], expected: [gid:direct:ext:ver
(direct-scope)], actual: [] expected:<1> but was:<0>
	at org.eclipse.aether.internal.impl.collect.DefaultDependencyCollectorTest.assertEqualSubtree(DefaultDependencyCollectorTest.java:144)
	at org.eclipse.aether.internal.impl.collect.DefaultDependencyCollectorTest.assertEqualSubtree(DefaultDependencyCollectorTest.java:122)
	at org.eclipse.aether.internal.impl.collect.DefaultDependencyCollectorTest.testSelectionWithScopeDependencySelector(DefaultDependencyCollectorTest.java:729)


FAILED:  org.eclipse.aether.internal.impl.collect.DefaultDependencyCollectorTest.linux-jdk7
/ Build linux-jdk7 / testDependencyManagement_DependencySelectorProcessesManagedState

Error Message:
path: [gid:root:ext:ver (root-scope), gid:direct-of-root:ext:ver (direct-of-root-scope), gid:transitive-of-root:ext:ver
(transitive-of-root-scope)], expected: [], actual: [gid:transitive-of-transitive-of-root:ext:ver
(managed)] expected:<0> but was:<1>

Stack Trace:
java.lang.AssertionError: path: [gid:root:ext:ver (root-scope), gid:direct-of-root:ext:ver
(direct-of-root-scope), gid:transitive-of-root:ext:ver (transitive-of-root-scope)], expected:
[], actual: [gid:transitive-of-transitive-of-root:ext:ver (managed)] expected:<0> but
was:<1>
	at org.eclipse.aether.internal.impl.collect.DefaultDependencyCollectorTest.assertEqualSubtree(DefaultDependencyCollectorTest.java:144)
	at org.eclipse.aether.internal.impl.collect.DefaultDependencyCollectorTest.assertEqualSubtree(DefaultDependencyCollectorTest.java:152)
	at org.eclipse.aether.internal.impl.collect.DefaultDependencyCollectorTest.assertEqualSubtree(DefaultDependencyCollectorTest.java:152)
	at org.eclipse.aether.internal.impl.collect.DefaultDependencyCollectorTest.assertEqualSubtree(DefaultDependencyCollectorTest.java:122)
	at org.eclipse.aether.internal.impl.collect.DefaultDependencyCollectorTest.testDependencyManagement_DependencySelectorProcessesManagedState(DefaultDependencyCollectorTest.java:555)


FAILED:  org.eclipse.aether.internal.impl.collect.DefaultDependencyCollectorTest.windows-jdk7
/ Build windows-jdk7 / testSelectionWithScopeDependencySelector

Error Message:
path: [gid:root:ext:ver (root-scope)], expected: [gid:direct:ext:ver (direct-scope)], actual:
[] expected:<1> but was:<0>

Stack Trace:
java.lang.AssertionError: path: [gid:root:ext:ver (root-scope)], expected: [gid:direct:ext:ver
(direct-scope)], actual: [] expected:<1> but was:<0>
	at org.eclipse.aether.internal.impl.collect.DefaultDependencyCollectorTest.assertEqualSubtree(DefaultDependencyCollectorTest.java:144)
	at org.eclipse.aether.internal.impl.collect.DefaultDependencyCollectorTest.assertEqualSubtree(DefaultDependencyCollectorTest.java:122)
	at org.eclipse.aether.internal.impl.collect.DefaultDependencyCollectorTest.testSelectionWithScopeDependencySelector(DefaultDependencyCollectorTest.java:729)


FAILED:  org.eclipse.aether.internal.impl.collect.DefaultDependencyCollectorTest.windows-jdk7
/ Build windows-jdk7 / testDependencyManagement_DependencySelectorProcessesManagedState

Error Message:
path: [gid:root:ext:ver (root-scope), gid:direct-of-root:ext:ver (direct-of-root-scope), gid:transitive-of-root:ext:ver
(transitive-of-root-scope)], expected: [], actual: [gid:transitive-of-transitive-of-root:ext:ver
(managed)] expected:<0> but was:<1>

Stack Trace:
java.lang.AssertionError: path: [gid:root:ext:ver (root-scope), gid:direct-of-root:ext:ver
(direct-of-root-scope), gid:transitive-of-root:ext:ver (transitive-of-root-scope)], expected:
[], actual: [gid:transitive-of-transitive-of-root:ext:ver (managed)] expected:<0> but
was:<1>
	at org.eclipse.aether.internal.impl.collect.DefaultDependencyCollectorTest.assertEqualSubtree(DefaultDependencyCollectorTest.java:144)
	at org.eclipse.aether.internal.impl.collect.DefaultDependencyCollectorTest.assertEqualSubtree(DefaultDependencyCollectorTest.java:152)
	at org.eclipse.aether.internal.impl.collect.DefaultDependencyCollectorTest.assertEqualSubtree(DefaultDependencyCollectorTest.java:152)
	at org.eclipse.aether.internal.impl.collect.DefaultDependencyCollectorTest.assertEqualSubtree(DefaultDependencyCollectorTest.java:122)
	at org.eclipse.aether.internal.impl.collect.DefaultDependencyCollectorTest.testDependencyManagement_DependencySelectorProcessesManagedState(DefaultDependencyCollectorTest.java:555)


FAILED:  org.eclipse.aether.internal.impl.collect.DefaultDependencyCollectorTest.windows-jdk8
/ Build windows-jdk8 / testSelectionWithScopeDependencySelector

Error Message:
path: [gid:root:ext:ver (root-scope)], expected: [gid:direct:ext:ver (direct-scope)], actual:
[] expected:<1> but was:<0>

Stack Trace:
java.lang.AssertionError: path: [gid:root:ext:ver (root-scope)], expected: [gid:direct:ext:ver
(direct-scope)], actual: [] expected:<1> but was:<0>
	at org.eclipse.aether.internal.impl.collect.DefaultDependencyCollectorTest.assertEqualSubtree(DefaultDependencyCollectorTest.java:144)
	at org.eclipse.aether.internal.impl.collect.DefaultDependencyCollectorTest.assertEqualSubtree(DefaultDependencyCollectorTest.java:122)
	at org.eclipse.aether.internal.impl.collect.DefaultDependencyCollectorTest.testSelectionWithScopeDependencySelector(DefaultDependencyCollectorTest.java:729)


FAILED:  org.eclipse.aether.internal.impl.collect.DefaultDependencyCollectorTest.windows-jdk8
/ Build windows-jdk8 / testDependencyManagement_DependencySelectorProcessesManagedState

Error Message:
path: [gid:root:ext:ver (root-scope), gid:direct-of-root:ext:ver (direct-of-root-scope), gid:transitive-of-root:ext:ver
(transitive-of-root-scope)], expected: [], actual: [gid:transitive-of-transitive-of-root:ext:ver
(managed)] expected:<0> but was:<1>

Stack Trace:
java.lang.AssertionError: path: [gid:root:ext:ver (root-scope), gid:direct-of-root:ext:ver
(direct-of-root-scope), gid:transitive-of-root:ext:ver (transitive-of-root-scope)], expected:
[], actual: [gid:transitive-of-transitive-of-root:ext:ver (managed)] expected:<0> but
was:<1>
	at org.eclipse.aether.internal.impl.collect.DefaultDependencyCollectorTest.assertEqualSubtree(DefaultDependencyCollectorTest.java:144)
	at org.eclipse.aether.internal.impl.collect.DefaultDependencyCollectorTest.assertEqualSubtree(DefaultDependencyCollectorTest.java:152)
	at org.eclipse.aether.internal.impl.collect.DefaultDependencyCollectorTest.assertEqualSubtree(DefaultDependencyCollectorTest.java:152)
	at org.eclipse.aether.internal.impl.collect.DefaultDependencyCollectorTest.assertEqualSubtree(DefaultDependencyCollectorTest.java:122)
	at org.eclipse.aether.internal.impl.collect.DefaultDependencyCollectorTest.testDependencyManagement_DependencySelectorProcessesManagedState(DefaultDependencyCollectorTest.java:555)


FAILED:  org.eclipse.aether.internal.impl.collect.DefaultDependencyCollectorTest.windows-jdk11
/ Build windows-jdk11 / testSelectionWithScopeDependencySelector

Error Message:
path: [gid:root:ext:ver (root-scope)], expected: [gid:direct:ext:ver (direct-scope)], actual:
[] expected:<1> but was:<0>

Stack Trace:
java.lang.AssertionError: path: [gid:root:ext:ver (root-scope)], expected: [gid:direct:ext:ver
(direct-scope)], actual: [] expected:<1> but was:<0>
	at org.eclipse.aether.internal.impl.collect.DefaultDependencyCollectorTest.assertEqualSubtree(DefaultDependencyCollectorTest.java:144)
	at org.eclipse.aether.internal.impl.collect.DefaultDependencyCollectorTest.assertEqualSubtree(DefaultDependencyCollectorTest.java:122)
	at org.eclipse.aether.internal.impl.collect.DefaultDependencyCollectorTest.testSelectionWithScopeDependencySelector(DefaultDependencyCollectorTest.java:729)


FAILED:  org.eclipse.aether.internal.impl.collect.DefaultDependencyCollectorTest.windows-jdk11
/ Build windows-jdk11 / testDependencyManagement_DependencySelectorProcessesManagedState

Error Message:
path: [gid:root:ext:ver (root-scope), gid:direct-of-root:ext:ver (direct-of-root-scope), gid:transitive-of-root:ext:ver
(transitive-of-root-scope)], expected: [], actual: [gid:transitive-of-transitive-of-root:ext:ver
(managed)] expected:<0> but was:<1>

Stack Trace:
java.lang.AssertionError: path: [gid:root:ext:ver (root-scope), gid:direct-of-root:ext:ver
(direct-of-root-scope), gid:transitive-of-root:ext:ver (transitive-of-root-scope)], expected:
[], actual: [gid:transitive-of-transitive-of-root:ext:ver (managed)] expected:<0> but
was:<1>
	at org.eclipse.aether.internal.impl.collect.DefaultDependencyCollectorTest.assertEqualSubtree(DefaultDependencyCollectorTest.java:144)
	at org.eclipse.aether.internal.impl.collect.DefaultDependencyCollectorTest.assertEqualSubtree(DefaultDependencyCollectorTest.java:152)
	at org.eclipse.aether.internal.impl.collect.DefaultDependencyCollectorTest.assertEqualSubtree(DefaultDependencyCollectorTest.java:152)
	at org.eclipse.aether.internal.impl.collect.DefaultDependencyCollectorTest.assertEqualSubtree(DefaultDependencyCollectorTest.java:122)
	at org.eclipse.aether.internal.impl.collect.DefaultDependencyCollectorTest.testDependencyManagement_DependencySelectorProcessesManagedState(DefaultDependencyCollectorTest.java:555)




Build log:
[...truncated 20300 lines...]
[INFO] --- maven-invoker-plugin:3.0.1:run (integration-test) @ maven-resolver-demo-maven-plugin
---
[INFO] Running Setup Jobs
[INFO] Building: resolve-artifact\pom.xml
[INFO]           resolve-artifact\pom.xml ......................... SUCCESS (5.4 s)
[INFO] -------------------------------------------------
[INFO] Build Summary:
[INFO]   Passed: 1, Failed: 0, Errors: 0, Skipped: 0
[INFO] -------------------------------------------------
[INFO] 
[INFO] --- maven-checkstyle-plugin:3.0.0:check (checkstyle-check) @ maven-resolver-demo-maven-plugin
---
[INFO] ------------------------------------------------------------------------
[INFO] Reactor Summary for Maven Artifact Resolver 1.4.0-SNAPSHOT:
[INFO] 
[INFO] Maven Artifact Resolver ............................ SUCCESS [ 36.923 s]
[INFO] Maven Artifact Resolver API ........................ SUCCESS [ 22.454 s]
[INFO] Maven Artifact Resolver SPI ........................ SUCCESS [  3.300 s]
[INFO] Maven Artifact Resolver Test Utilities ............. SUCCESS [  3.691 s]
[INFO] Maven Artifact Resolver Utilities .................. SUCCESS [  8.097 s]
[INFO] Maven Artifact Resolver Implementation ............. SUCCESS [ 22.783 s]
[INFO] Maven Artifact Resolver Connector Basic ............ SUCCESS [  9.023 s]
[INFO] Maven Artifact Resolver Transport Classpath ........ SUCCESS [  3.549 s]
[INFO] Maven Artifact Resolver Transport File ............. SUCCESS [  3.569 s]
[INFO] Maven Artifact Resolver Transport HTTP ............. SUCCESS [ 11.378 s]
[INFO] Maven Artifact Resolver Transport Wagon ............ SUCCESS [  6.509 s]
[INFO] Maven Artifact Resolver Demos ...................... SUCCESS [  0.634 s]
[INFO] Maven Artifact Resolver Demo Snippets .............. SUCCESS [  2.971 s]
[INFO] Maven Artifact Resolver Demo Maven Plugin .......... SUCCESS [ 14.166 s]
[INFO] ------------------------------------------------------------------------
[INFO] BUILD SUCCESS
[INFO] ------------------------------------------------------------------------
[INFO] Total time:  02:30 min
[INFO] Finished at: 2019-05-12T11:56:55-07:00
[INFO] ------------------------------------------------------------------------
[INFO] [jenkins-event-spy] Generated F:\jenkins\jenkins-slave\workspace\-box_maven-resolver_MRESOLVER-12@tmp\withMavena58c90fc\maven-spy-20190512-115424-34615085592573477327245.log
[withMaven] junitPublisher - Archive test results for Maven artifact org.apache.maven.resolver:maven-resolver-impl:jar:1.4.0-SNAPSHOT
generated by maven-surefire-plugin:test (default-test): m/maven-resolver-impl/target/surefire-reports/*.xml
Recording test results
[withMaven] junitPublisher - Archive test results for Maven artifact org.apache.maven.resolver:maven-resolver-transport-http:jar:1.4.0-SNAPSHOT
generated by maven-surefire-plugin:test (default-test): m/maven-resolver-transport-http/target/surefire-reports/*.xml
Recording test results
[withMaven] junitPublisher - Archive test results for Maven artifact org.apache.maven.resolver:maven-resolver-connector-basic:jar:1.4.0-SNAPSHOT
generated by maven-surefire-plugin:test (default-test): m/maven-resolver-connector-basic/target/surefire-reports/*.xml
Recording test results
[withMaven] junitPublisher - Archive test results for Maven artifact org.apache.maven.resolver:maven-resolver-api:jar:1.4.0-SNAPSHOT
generated by maven-surefire-plugin:test (default-test): m\maven-resolver-api\target\surefire-reports\*.xml
Recording test results
[withMaven] junitPublisher - Archive test results for Maven artifact org.apache.maven.resolver:maven-resolver-impl:jar:1.4.0-SNAPSHOT
generated by maven-surefire-plugin:test (default-test): m/maven-resolver-impl/target/surefire-reports/*.xml
Recording test results
[Pipeline] }
[withMaven] junitPublisher - Archive test results for Maven artifact org.apache.maven.resolver:maven-resolver-spi:jar:1.4.0-SNAPSHOT
generated by maven-surefire-plugin:test (default-test): m\maven-resolver-spi\target\surefire-reports\*.xml
Recording test results
[Pipeline] // dir
[withMaven] junitPublisher - Archive test results for Maven artifact org.apache.maven.resolver:maven-resolver-connector-basic:jar:1.4.0-SNAPSHOT
generated by maven-surefire-plugin:test (default-test): m/maven-resolver-connector-basic/target/surefire-reports/*.xml
Recording test results
[withMaven] junitPublisher - Archive test results for Maven artifact org.apache.maven.resolver:maven-resolver-transport-classpath:jar:1.4.0-SNAPSHOT
generated by maven-surefire-plugin:test (default-test): m/maven-resolver-transport-classpath/target/surefire-reports/*.xml
Recording test results
[withMaven] junitPublisher - Archive test results for Maven artifact org.apache.maven.resolver:maven-resolver-spi:jar:1.4.0-SNAPSHOT
generated by maven-surefire-plugin:test (default-test): m\maven-resolver-spi\target\surefire-reports\*.xml
Recording test results
[withMaven] junitPublisher - Archive test results for Maven artifact org.apache.maven.resolver:maven-resolver-transport-wagon:jar:1.4.0-SNAPSHOT
generated by maven-surefire-plugin:test (default-test): m/maven-resolver-transport-wagon/target/surefire-reports/*.xml
Recording test results
[withMaven] junitPublisher - Archive test results for Maven artifact org.apache.maven.resolver:maven-resolver-test-util:jar:1.4.0-SNAPSHOT
generated by maven-surefire-plugin:test (default-test): m\maven-resolver-test-util\target\surefire-reports\*.xml
Recording test results
[withMaven] junitPublisher - Archive test results for Maven artifact org.apache.maven.resolver:maven-resolver-transport-file:jar:1.4.0-SNAPSHOT
generated by maven-surefire-plugin:test (default-test): m/maven-resolver-transport-file/target/surefire-reports/*.xml
Recording test results
[withMaven] junitPublisher - Archive test results for Maven artifact org.apache.maven.resolver:maven-resolver-transport-classpath:jar:1.4.0-SNAPSHOT
generated by maven-surefire-plugin:test (default-test): m/maven-resolver-transport-classpath/target/surefire-reports/*.xml
Recording test results
[Pipeline] }
[withMaven] invokerPublisher - Archive invoker results for Maven artifact MavenArtifact{org.apache.maven.resolver:maven-resolver-demo-maven-plugin:maven-plugin:1.4.0-SNAPSHOT(version:
1.4.0-SNAPSHOT, snapshot:false) } generated by PluginInvocation{org.apache.maven.plugins:maven-invoker-plugin:3.0.1@run
 integration-test}: m\maven-resolver-demos\maven-resolver-demo-maven-plugin\target\invoker-reports\*.xml
[withMaven] junitPublisher - Archive test results for Maven artifact org.apache.maven.resolver:maven-resolver-test-util:jar:1.4.0-SNAPSHOT
generated by maven-surefire-plugin:test (default-test): m\maven-resolver-test-util\target\surefire-reports\*.xml
Recording test results
[withMaven] junitPublisher - Archive test results for Maven artifact org.apache.maven.resolver:maven-resolver-transport-http:jar:1.4.0-SNAPSHOT
generated by maven-surefire-plugin:test (default-test): m/maven-resolver-transport-http/target/surefire-reports/*.xml
Recording test results
[withMaven] junitPublisher - Archive test results for Maven artifact org.apache.maven.resolver:maven-resolver-util:jar:1.4.0-SNAPSHOT
generated by maven-surefire-plugin:test (default-test): m\maven-resolver-util\target\surefire-reports\*.xml
Recording test results
[withMaven] junitPublisher - Archive test results for Maven artifact org.apache.maven.resolver:maven-resolver-demo-snippets:jar:1.4.0-SNAPSHOT
generated by maven-surefire-plugin:test (default-test): m/maven-resolver-demos/maven-resolver-demo-snippets/target/surefire-reports/*.xml
Recording test results
[withMaven] junitPublisher - Archive test results for Maven artifact org.apache.maven.resolver:maven-resolver-impl:jar:1.4.0-SNAPSHOT
generated by maven-surefire-plugin:test (default-test): m\maven-resolver-impl\target\surefire-reports\*.xml
Recording test results
[withMaven] junitPublisher - Archive test results for Maven artifact org.apache.maven.resolver:maven-resolver-transport-wagon:jar:1.4.0-SNAPSHOT
generated by maven-surefire-plugin:test (default-test): m/maven-resolver-transport-wagon/target/surefire-reports/*.xml
Recording test results
[withMaven] junitPublisher - Archive test results for Maven artifact org.apache.maven.resolver:maven-resolver-api:jar:1.4.0-SNAPSHOT
generated by maven-surefire-plugin:test (default-test): m\maven-resolver-api\target\surefire-reports\*.xml
Recording test results
[withMaven] junitPublisher - Archive test results for Maven artifact org.apache.maven.resolver:maven-resolver-util:jar:1.4.0-SNAPSHOT
generated by maven-surefire-plugin:test (default-test): m\maven-resolver-util\target\surefire-reports\*.xml
Recording test results
[withMaven] junitPublisher - Archive test results for Maven artifact org.apache.maven.resolver:maven-resolver-transport-file:jar:1.4.0-SNAPSHOT
generated by maven-surefire-plugin:test (default-test): m/maven-resolver-transport-file/target/surefire-reports/*.xml
Recording test results
[withMaven] junitPublisher - Archive test results for Maven artifact org.apache.maven.resolver:maven-resolver-impl:jar:1.4.0-SNAPSHOT
generated by maven-surefire-plugin:test (default-test): m\maven-resolver-impl\target\surefire-reports\*.xml
Recording test results
[withMaven] junitPublisher - Archive test results for Maven artifact org.apache.maven.resolver:maven-resolver-demo-snippets:jar:1.4.0-SNAPSHOT
generated by maven-surefire-plugin:test (default-test): m/maven-resolver-demos/maven-resolver-demo-snippets/target/surefire-reports/*.xml
Recording test results
[withMaven] junitPublisher - Archive test results for Maven artifact org.apache.maven.resolver:maven-resolver-spi:jar:1.4.0-SNAPSHOT
generated by maven-surefire-plugin:test (default-test): m\maven-resolver-spi\target\surefire-reports\*.xml
Recording test results
[withMaven] junitPublisher - Archive test results for Maven artifact org.apache.maven.resolver:maven-resolver-connector-basic:jar:1.4.0-SNAPSHOT
generated by maven-surefire-plugin:test (default-test): m\maven-resolver-connector-basic\target\surefire-reports\*.xml
Recording test results
None of the test reports contained any result
[withMaven] junitPublisher - Archive test results for Maven artifact org.apache.maven.resolver:maven-resolver-demo-maven-plugin:maven-plugin:1.4.0-SNAPSHOT
generated by maven-surefire-plugin:test (default-test): m/maven-resolver-demos/maven-resolver-demo-maven-plugin/target/surefire-reports/*.xml
Recording test results
[withMaven] junitPublisher - Archive test results for Maven artifact org.apache.maven.resolver:maven-resolver-transport-classpath:jar:1.4.0-SNAPSHOT
generated by maven-surefire-plugin:test (default-test): m\maven-resolver-transport-classpath\target\surefire-reports\*.xml
Recording test results
[withMaven] junitPublisher - Archive test results for Maven artifact org.apache.maven.resolver:maven-resolver-test-util:jar:1.4.0-SNAPSHOT
generated by maven-surefire-plugin:test (default-test): m\maven-resolver-test-util\target\surefire-reports\*.xml
Recording test results
None of the test reports contained any result
[withMaven] junitPublisher - Archive test results for Maven artifact org.apache.maven.resolver:maven-resolver-demo-maven-plugin:maven-plugin:1.4.0-SNAPSHOT
generated by maven-surefire-plugin:test (default-test): m/maven-resolver-demos/maven-resolver-demo-maven-plugin/target/surefire-reports/*.xml
Recording test results
[withMaven] junitPublisher - Archive test results for Maven artifact org.apache.maven.resolver:maven-resolver-connector-basic:jar:1.4.0-SNAPSHOT
generated by maven-surefire-plugin:test (default-test): m\maven-resolver-connector-basic\target\surefire-reports\*.xml
Recording test results
[withMaven] junitPublisher - Archive test results for Maven artifact org.apache.maven.resolver:maven-resolver-transport-http:jar:1.4.0-SNAPSHOT
generated by maven-surefire-plugin:test (default-test): m/maven-resolver-transport-http/target/surefire-reports/*.xml
Recording test results
[withMaven] junitPublisher - Archive test results for Maven artifact org.apache.maven.resolver:maven-resolver-transport-classpath:jar:1.4.0-SNAPSHOT
generated by maven-surefire-plugin:test (default-test): m\maven-resolver-transport-classpath\target\surefire-reports\*.xml
Recording test results
None of the test reports contained any result
[withMaven] junitPublisher - Archive test results for Maven artifact org.apache.maven.resolver:maven-resolver-util:jar:1.4.0-SNAPSHOT
generated by maven-surefire-plugin:test (default-test): m\maven-resolver-util\target\surefire-reports\*.xml
Recording test results
[withMaven] junitPublisher - Archive test results for Maven artifact org.apache.maven.resolver:maven-resolver-transport-file:jar:1.4.0-SNAPSHOT
generated by maven-surefire-plugin:test (default-test): m\maven-resolver-transport-file\target\surefire-reports\*.xml
Recording test results
None of the test reports contained any result
[withMaven] junitPublisher - Archive test results for Maven artifact org.apache.maven.resolver:maven-resolver-transport-http:jar:1.4.0-SNAPSHOT
generated by maven-surefire-plugin:test (default-test): m\maven-resolver-transport-http\target\surefire-reports\*.xml
Recording test results
[withMaven] junitPublisher - Archive test results for Maven artifact org.apache.maven.resolver:maven-resolver-impl:jar:1.4.0-SNAPSHOT
generated by maven-surefire-plugin:test (default-test): m\maven-resolver-impl\target\surefire-reports\*.xml
Recording test results
[withMaven] junitPublisher - Archive test results for Maven artifact org.apache.maven.resolver:maven-resolver-transport-file:jar:1.4.0-SNAPSHOT
generated by maven-surefire-plugin:test (default-test): m\maven-resolver-transport-file\target\surefire-reports\*.xml
Recording test results
[withMaven] junitPublisher - Archive test results for Maven artifact org.apache.maven.resolver:maven-resolver-transport-wagon:jar:1.4.0-SNAPSHOT
generated by maven-surefire-plugin:test (default-test): m/maven-resolver-transport-wagon/target/surefire-reports/*.xml
Recording test results
[withMaven] junitPublisher - Archive test results for Maven artifact org.apache.maven.resolver:maven-resolver-transport-http:jar:1.4.0-SNAPSHOT
generated by maven-surefire-plugin:test (default-test): m\maven-resolver-transport-http\target\surefire-reports\*.xml
Recording test results
[withMaven] junitPublisher - Archive test results for Maven artifact org.apache.maven.resolver:maven-resolver-connector-basic:jar:1.4.0-SNAPSHOT
generated by maven-surefire-plugin:test (default-test): m\maven-resolver-connector-basic\target\surefire-reports\*.xml
Recording test results
[withMaven] junitPublisher - Archive test results for Maven artifact org.apache.maven.resolver:maven-resolver-transport-wagon:jar:1.4.0-SNAPSHOT
generated by maven-surefire-plugin:test (default-test): m\maven-resolver-transport-wagon\target\surefire-reports\*.xml
Recording test results
[withMaven] junitPublisher - Archive test results for Maven artifact org.apache.maven.resolver:maven-resolver-transport-classpath:jar:1.4.0-SNAPSHOT
generated by maven-surefire-plugin:test (default-test): m\maven-resolver-transport-classpath\target\surefire-reports\*.xml
Recording test results
[withMaven] junitPublisher - Archive test results for Maven artifact org.apache.maven.resolver:maven-resolver-transport-wagon:jar:1.4.0-SNAPSHOT
generated by maven-surefire-plugin:test (default-test): m\maven-resolver-transport-wagon\target\surefire-reports\*.xml
Recording test results
[withMaven] junitPublisher - Archive test results for Maven artifact org.apache.maven.resolver:maven-resolver-demo-snippets:jar:1.4.0-SNAPSHOT
generated by maven-surefire-plugin:test (default-test): m/maven-resolver-demos/maven-resolver-demo-snippets/target/surefire-reports/*.xml
Recording test results
[withMaven] junitPublisher - Archive test results for Maven artifact org.apache.maven.resolver:maven-resolver-demo-snippets:jar:1.4.0-SNAPSHOT
generated by maven-surefire-plugin:test (default-test): m\maven-resolver-demos\maven-resolver-demo-snippets\target\surefire-reports\*.xml
Recording test results
[withMaven] junitPublisher - Archive test results for Maven artifact org.apache.maven.resolver:maven-resolver-transport-file:jar:1.4.0-SNAPSHOT
generated by maven-surefire-plugin:test (default-test): m\maven-resolver-transport-file\target\surefire-reports\*.xml
Recording test results
[withMaven] junitPublisher - Archive test results for Maven artifact org.apache.maven.resolver:maven-resolver-demo-snippets:jar:1.4.0-SNAPSHOT
generated by maven-surefire-plugin:test (default-test): m\maven-resolver-demos\maven-resolver-demo-snippets\target\surefire-reports\*.xml
Recording test results
[withMaven] junitPublisher - Archive test results for Maven artifact org.apache.maven.resolver:maven-resolver-transport-http:jar:1.4.0-SNAPSHOT
generated by maven-surefire-plugin:test (default-test): m\maven-resolver-transport-http\target\surefire-reports\*.xml
Recording test results
[withMaven] Publishers: Pipeline Graph Publisher: 10 ms, Invoker Publisher: 5838 ms, Junit
Publisher: 104598 ms, Concordion Publisher: 1 ms, Dependencies Fingerprint Publisher: 9102
ms
None of the test reports contained any result
[withMaven] junitPublisher - Archive test results for Maven artifact org.apache.maven.resolver:maven-resolver-demo-maven-plugin:maven-plugin:1.4.0-SNAPSHOT
generated by maven-surefire-plugin:test (default-test): m\maven-resolver-demos\maven-resolver-demo-maven-plugin\target\surefire-reports\*.xml
Recording test results
None of the test reports contained any result
[withMaven] junitPublisher - Archive test results for Maven artifact org.apache.maven.resolver:maven-resolver-demo-maven-plugin:maven-plugin:1.4.0-SNAPSHOT
generated by maven-surefire-plugin:test (default-test): m/maven-resolver-demos/maven-resolver-demo-maven-plugin/target/surefire-reports/*.xml
Recording test results
None of the test reports contained any result
[Pipeline] // withMaven
[withMaven] junitPublisher - Archive test results for Maven artifact org.apache.maven.resolver:maven-resolver-transport-wagon:jar:1.4.0-SNAPSHOT
generated by maven-surefire-plugin:test (default-test): m\maven-resolver-transport-wagon\target\surefire-reports\*.xml
Recording test results
None of the test reports contained any result
[withMaven] junitPublisher - Archive test results for Maven artifact org.apache.maven.resolver:maven-resolver-demo-maven-plugin:maven-plugin:1.4.0-SNAPSHOT
generated by maven-surefire-plugin:test (default-test): m\maven-resolver-demos\maven-resolver-demo-maven-plugin\target\surefire-reports\*.xml
Recording test results
[withMaven] junitPublisher - Archive test results for Maven artifact org.apache.maven.resolver:maven-resolver-demo-snippets:jar:1.4.0-SNAPSHOT
generated by maven-surefire-plugin:test (default-test): m\maven-resolver-demos\maven-resolver-demo-snippets\target\surefire-reports\*.xml
Recording test results
[withMaven] Publishers: Pipeline Graph Publisher: 11 ms, Invoker Publisher: 1138 ms, Junit
Publisher: 155888 ms, Dependencies Fingerprint Publisher: 9485 ms, JGiven Publisher: 1 ms
None of the test reports contained any result
[Pipeline] cleanWs
None of the test reports contained any result
[withMaven] junitPublisher - Archive test results for Maven artifact org.apache.maven.resolver:maven-resolver-demo-maven-plugin:maven-plugin:1.4.0-SNAPSHOT
generated by maven-surefire-plugin:test (default-test): m\maven-resolver-demos\maven-resolver-demo-maven-plugin\target\surefire-reports\*.xml
Recording test results
None of the test reports contained any result
[WS-CLEANUP] Deleting project workspace...
[WS-CLEANUP] Deferred wipeout is used...
[withMaven] Publishers: Pipeline Graph Publisher: 7 ms, Invoker Publisher: 5270 ms, Junit
Publisher: 100715 ms, Dependencies Fingerprint Publisher: 1042 ms
None of the test reports contained any result
[Pipeline] // withMaven
[Pipeline] // withMaven
[Pipeline] cleanWs
[Pipeline] cleanWs
[WS-CLEANUP] Deleting project workspace...
[WS-CLEANUP] Deferred wipeout is used...
[WS-CLEANUP] done
[Pipeline] }
[Pipeline] // stage
[Pipeline] }
[WS-CLEANUP] done
[Pipeline] // node
[Pipeline] }
[Pipeline] }
[WS-CLEANUP] Deleting project workspace...
[WS-CLEANUP] Deferred wipeout is used...
[Pipeline] // stage
[Pipeline] }
[Pipeline] // node
[Pipeline] }
[WS-CLEANUP] done
[Pipeline] }
[Pipeline] // stage
[Pipeline] }
[Pipeline] // node
[Pipeline] }
[withMaven] Publishers: Pipeline Graph Publisher: 5 ms, Invoker Publisher: 33217 ms, Junit
Publisher: 68391 ms, Dependencies Fingerprint Publisher: 949 ms
[Pipeline] // withMaven
[Pipeline] cleanWs
[WS-CLEANUP] Deleting project workspace...
[WS-CLEANUP] Deferred wipeout is used...
[withMaven] Publishers: Pipeline Graph Publisher: 12 ms, Invoker Publisher: 6071 ms, Junit
Publisher: 20853 ms, Dependencies Fingerprint Publisher: 959 ms
[Pipeline] // withMaven
[WS-CLEANUP] done
[Pipeline] cleanWs
[Pipeline] }
[WS-CLEANUP] Deleting project workspace...
[WS-CLEANUP] Deferred wipeout is used...
[Pipeline] // stage
[WS-CLEANUP] done
[Pipeline] }
[Pipeline] // node
[Pipeline] }
[Pipeline] }
[Pipeline] // stage
[Pipeline] }
[Pipeline] // node
[Pipeline] }
[withMaven] openTasksPublisher - Scan Tasks for Maven artifact org.apache.maven.resolver:maven-resolver-api:jar:1.4.0-SNAPSHOT
in source directory m/maven-resolver-api/src/main/java
[withMaven] openTasksPublisher - Scan Tasks for Maven artifact org.apache.maven.resolver:maven-resolver-spi:jar:1.4.0-SNAPSHOT
in source directory m/maven-resolver-spi/src/main/java
[withMaven] openTasksPublisher - Scan Tasks for Maven artifact org.apache.maven.resolver:maven-resolver-test-util:jar:1.4.0-SNAPSHOT
in source directory m/maven-resolver-test-util/src/main/java
[withMaven] openTasksPublisher - Scan Tasks for Maven artifact org.apache.maven.resolver:maven-resolver-util:jar:1.4.0-SNAPSHOT
in source directory m/maven-resolver-util/src/main/java
[withMaven] openTasksPublisher - Scan Tasks for Maven artifact org.apache.maven.resolver:maven-resolver-impl:jar:1.4.0-SNAPSHOT
in source directory m/maven-resolver-impl/src/main/java
[withMaven] openTasksPublisher - Scan Tasks for Maven artifact org.apache.maven.resolver:maven-resolver-connector-basic:jar:1.4.0-SNAPSHOT
in source directory m/maven-resolver-connector-basic/src/main/java
[withMaven] openTasksPublisher - Scan Tasks for Maven artifact org.apache.maven.resolver:maven-resolver-transport-classpath:jar:1.4.0-SNAPSHOT
in source directory m/maven-resolver-transport-classpath/src/main/java
[withMaven] openTasksPublisher - Scan Tasks for Maven artifact org.apache.maven.resolver:maven-resolver-transport-file:jar:1.4.0-SNAPSHOT
in source directory m/maven-resolver-transport-file/src/main/java
[withMaven] openTasksPublisher - Scan Tasks for Maven artifact org.apache.maven.resolver:maven-resolver-transport-http:jar:1.4.0-SNAPSHOT
in source directory m/maven-resolver-transport-http/src/main/java
[withMaven] openTasksPublisher - Scan Tasks for Maven artifact org.apache.maven.resolver:maven-resolver-transport-wagon:jar:1.4.0-SNAPSHOT
in source directory m/maven-resolver-transport-wagon/src/main/java
[withMaven] openTasksPublisher - Scan Tasks for Maven artifact org.apache.maven.resolver:maven-resolver-demo-snippets:jar:1.4.0-SNAPSHOT
in source directory m/maven-resolver-demos/maven-resolver-demo-snippets/src/main/java
[withMaven] openTasksPublisher - Scan Tasks for Maven artifact org.apache.maven.resolver:maven-resolver-demo-maven-plugin:maven-plugin:1.4.0-SNAPSHOT
in source directory m/maven-resolver-demos/maven-resolver-demo-maven-plugin/src/main/java
[TASKS] Scanning folder '/home/jenkins/jenkins-slave/workspace/-box_maven-resolver_MRESOLVER-12'
for files matching the pattern 'm/maven-resolver-api/src/main/java/**/*,m/maven-resolver-spi/src/main/java/**/*,m/maven-resolver-test-util/src/main/java/**/*,m/maven-resolver-util/src/main/java/**/*,m/maven-resolver-impl/src/main/java/**/*,m/maven-resolver-connector-basic/src/main/java/**/*,m/maven-resolver-transport-classpath/src/main/java/**/*,m/maven-resolver-transport-file/src/main/java/**/*,m/maven-resolver-transport-http/src/main/java/**/*,m/maven-resolver-transport-wagon/src/main/java/**/*,m/maven-resolver-demos/maven-resolver-demo-snippets/src/main/java/**/*,m/maven-resolver-demos/maven-resolver-demo-maven-plugin/src/main/java/**/*'
- excludes: null
[TASKS] Found 415 files to scan for tasks
[TASKS] Found 0 open tasks.
Skipping warnings blame since pipelines do not have an SCM link.%n
[withMaven] Publishers: Pipeline Graph Publisher: 10 ms, Generated Artifacts Publisher: 12734
ms, Invoker Publisher: 9188 ms, Junit Publisher: 135620 ms, Concordion Publisher: 1 ms, Dependencies
Fingerprint Publisher: 9029 ms, Open Task Scanner Publisher: 2678 ms
[Pipeline] // withMaven
[Pipeline] cleanWs
[WS-CLEANUP] Deleting project workspace...
[WS-CLEANUP] Deferred wipeout is used...
[WS-CLEANUP] done
[Pipeline] }
[Pipeline] // stage
[Pipeline] }
[Pipeline] // node
[Pipeline] }
[Pipeline] // parallel
[Pipeline] stage
[Pipeline] { (Notifications)
[Pipeline] echo
Build result: UNSTABLE
[Pipeline] jiraIssueSelector
[Pipeline] emailext
Mime
  • Unnamed multipart/mixed (inline, None, 0 bytes)
View raw message