maven-notifications mailing list archives

Site index · List index
Message view « Date » · « Thread »
Top « Date » · « Thread »
From Apache Jenkins Server <jenk...@builds.apache.org>
Subject Build failed in Jenkins: Maven TLP » maven-surefire » 1546-1222 #30
Date Wed, 15 May 2019 01:38:35 GMT
See https://builds.apache.org/job/maven-box/job/maven-surefire/job/1546-1222/30/

Changes:

* removed unused code
* jacoco 0.8.4
* removed jacoco.instrumentation.skip
* the last unit tests
* removed unused code
* jacoco 0.8.4
* removed jacoco.instrumentation.skip
* the last unit tests
* removed unused code
* jacoco 0.8.4
* removed jacoco.instrumentation.skip
* the last unit tests
* removed unused code
* jacoco 0.8.4
* removed jacoco.instrumentation.skip
* the last unit tests
* removed unused code
* jacoco 0.8.4
* removed jacoco.instrumentation.skip
* the last unit tests
* removed unused code
* jacoco 0.8.4
* removed jacoco.instrumentation.skip
* the last unit tests
* removed unused code
* jacoco 0.8.4
* removed jacoco.instrumentation.skip
* the last unit tests
* removed unused code
* jacoco 0.8.4
* removed jacoco.instrumentation.skip
* the last unit tests

All tests passed

Build log:
[...truncated 18359 lines...]
[2019-05-15T01:38:33.494Z] [INFO] Surefire Extensions API ............................ SKIPPED
[2019-05-15T01:38:33.494Z] [INFO] SureFire Booter .................................... SKIPPED
[2019-05-15T01:38:33.494Z] [INFO] Maven Surefire Test-Grouping Support ............... SKIPPED
[2019-05-15T01:38:33.494Z] [INFO] SureFire Providers ................................. SKIPPED
[2019-05-15T01:38:33.494Z] [INFO] Shared JUnit3 Provider Code ........................ SKIPPED
[2019-05-15T01:38:33.494Z] [INFO] Shared Java 5 Provider Base ........................ SKIPPED
[2019-05-15T01:38:33.494Z] [INFO] Shared JUnit4 Provider Code ........................ SKIPPED
[2019-05-15T01:38:33.494Z] [INFO] Shared JUnit48 Provider Code ....................... SKIPPED
[2019-05-15T01:38:33.494Z] [INFO] SureFire JUnit Runner .............................. SKIPPED
[2019-05-15T01:38:33.494Z] [INFO] SureFire JUnit4 Runner ............................. SKIPPED
[2019-05-15T01:38:33.494Z] [INFO] Maven Surefire Common .............................. SKIPPED
[2019-05-15T01:38:33.494Z] [INFO] SureFire JUnitCore Runner .......................... SKIPPED
[2019-05-15T01:38:33.494Z] [INFO] SureFire JUnit Platform Runner ..................... SKIPPED
[2019-05-15T01:38:33.494Z] [INFO] SureFire TestNG Utils .............................. SKIPPED
[2019-05-15T01:38:33.494Z] [INFO] SureFire TestNG Runner ............................. SKIPPED
[2019-05-15T01:38:33.494Z] [INFO] ShadeFire JUnit3 Provider .......................... SKIPPED
[2019-05-15T01:38:33.494Z] [INFO] Surefire Report Parser ............................. SKIPPED
[2019-05-15T01:38:33.494Z] [INFO] Maven Surefire Plugin .............................. SKIPPED
[2019-05-15T01:38:33.494Z] [INFO] Maven Failsafe Plugin .............................. SKIPPED
[2019-05-15T01:38:33.494Z] [INFO] Maven Surefire Report Plugin ....................... SKIPPED
[2019-05-15T01:38:33.494Z] [INFO] Maven Surefire Integration Tests ................... SKIPPED
[2019-05-15T01:38:33.494Z] [INFO] ------------------------------------------------------------------------
[2019-05-15T01:38:33.494Z] [INFO] BUILD FAILURE
[2019-05-15T01:38:33.494Z] [INFO] ------------------------------------------------------------------------
[2019-05-15T01:38:33.494Z] [INFO] Total time:  01:57 min
[2019-05-15T01:38:33.494Z] [INFO] Finished at: 2019-05-14T18:38:33-07:00
[2019-05-15T01:38:33.494Z] [INFO] ------------------------------------------------------------------------
[2019-05-15T01:38:33.494Z] [ERROR] Failed to execute goal org.apache.maven.plugins:maven-checkstyle-plugin:3.0.0:check
(checkstyle-check) on project surefire-api: You have 1 Checkstyle violation. -> [Help 1]
[2019-05-15T01:38:33.494Z] org.apache.maven.lifecycle.LifecycleExecutionException: Failed
to execute goal org.apache.maven.plugins:maven-checkstyle-plugin:3.0.0:check (checkstyle-check)
on project surefire-api: You have 1 Checkstyle violation.
[2019-05-15T01:38:33.494Z]     at org.apache.maven.lifecycle.internal.MojoExecutor.execute
(MojoExecutor.java:215)
[2019-05-15T01:38:33.494Z]     at org.apache.maven.lifecycle.internal.MojoExecutor.execute
(MojoExecutor.java:156)
[2019-05-15T01:38:33.494Z]     at org.apache.maven.lifecycle.internal.MojoExecutor.execute
(MojoExecutor.java:148)
[2019-05-15T01:38:33.494Z]     at org.apache.maven.lifecycle.internal.LifecycleModuleBuilder.buildProject
(LifecycleModuleBuilder.java:117)
[2019-05-15T01:38:33.494Z]     at org.apache.maven.lifecycle.internal.LifecycleModuleBuilder.buildProject
(LifecycleModuleBuilder.java:81)
[2019-05-15T01:38:33.494Z]     at org.apache.maven.lifecycle.internal.builder.singlethreaded.SingleThreadedBuilder.build
(SingleThreadedBuilder.java:56)
[2019-05-15T01:38:33.494Z]     at org.apache.maven.lifecycle.internal.LifecycleStarter.execute
(LifecycleStarter.java:128)
[2019-05-15T01:38:33.494Z]     at org.apache.maven.DefaultMaven.doExecute (DefaultMaven.java:305)
[2019-05-15T01:38:33.494Z]     at org.apache.maven.DefaultMaven.doExecute (DefaultMaven.java:192)
[2019-05-15T01:38:33.494Z]     at org.apache.maven.DefaultMaven.execute (DefaultMaven.java:105)
[2019-05-15T01:38:33.494Z]     at org.apache.maven.cli.MavenCli.execute (MavenCli.java:956)
[2019-05-15T01:38:33.494Z]     at org.apache.maven.cli.MavenCli.doMain (MavenCli.java:288)
[2019-05-15T01:38:33.494Z]     at org.apache.maven.cli.MavenCli.main (MavenCli.java:192)
[2019-05-15T01:38:33.494Z]     at sun.reflect.NativeMethodAccessorImpl.invoke0 (Native Method)
[2019-05-15T01:38:33.494Z]     at sun.reflect.NativeMethodAccessorImpl.invoke (NativeMethodAccessorImpl.java:62)
[2019-05-15T01:38:33.494Z]     at sun.reflect.DelegatingMethodAccessorImpl.invoke (DelegatingMethodAccessorImpl.java:43)
[2019-05-15T01:38:33.494Z]     at java.lang.reflect.Method.invoke (Method.java:498)
[2019-05-15T01:38:33.494Z]     at org.codehaus.plexus.classworlds.launcher.Launcher.launchEnhanced
(Launcher.java:289)
[2019-05-15T01:38:33.494Z]     at org.codehaus.plexus.classworlds.launcher.Launcher.launch
(Launcher.java:229)
[2019-05-15T01:38:33.494Z]     at org.codehaus.plexus.classworlds.launcher.Launcher.mainWithExitCode
(Launcher.java:415)
[2019-05-15T01:38:33.494Z]     at org.codehaus.plexus.classworlds.launcher.Launcher.main (Launcher.java:356)
[2019-05-15T01:38:33.494Z] Caused by: org.apache.maven.plugin.MojoFailureException: You have
1 Checkstyle violation.
[2019-05-15T01:38:33.494Z]     at org.apache.maven.plugins.checkstyle.CheckstyleViolationCheckMojo.execute
(CheckstyleViolationCheckMojo.java:576)
[2019-05-15T01:38:33.494Z]     at org.apache.maven.plugin.DefaultBuildPluginManager.executeMojo
(DefaultBuildPluginManager.java:137)
[2019-05-15T01:38:33.494Z]     at org.apache.maven.lifecycle.internal.MojoExecutor.execute
(MojoExecutor.java:210)
[2019-05-15T01:38:33.494Z]     at org.apache.maven.lifecycle.internal.MojoExecutor.execute
(MojoExecutor.java:156)
[2019-05-15T01:38:33.494Z]     at org.apache.maven.lifecycle.internal.MojoExecutor.execute
(MojoExecutor.java:148)
[2019-05-15T01:38:33.494Z]     at org.apache.maven.lifecycle.internal.LifecycleModuleBuilder.buildProject
(LifecycleModuleBuilder.java:117)
[2019-05-15T01:38:33.494Z]     at org.apache.maven.lifecycle.internal.LifecycleModuleBuilder.buildProject
(LifecycleModuleBuilder.java:81)
[2019-05-15T01:38:33.494Z]     at org.apache.maven.lifecycle.internal.builder.singlethreaded.SingleThreadedBuilder.build
(SingleThreadedBuilder.java:56)
[2019-05-15T01:38:33.494Z]     at org.apache.maven.lifecycle.internal.LifecycleStarter.execute
(LifecycleStarter.java:128)
[2019-05-15T01:38:33.494Z]     at org.apache.maven.DefaultMaven.doExecute (DefaultMaven.java:305)
[2019-05-15T01:38:33.494Z]     at org.apache.maven.DefaultMaven.doExecute (DefaultMaven.java:192)
[2019-05-15T01:38:33.494Z]     at org.apache.maven.DefaultMaven.execute (DefaultMaven.java:105)
[2019-05-15T01:38:33.494Z]     at org.apache.maven.cli.MavenCli.execute (MavenCli.java:956)
[2019-05-15T01:38:33.494Z]     at org.apache.maven.cli.MavenCli.doMain (MavenCli.java:288)
[2019-05-15T01:38:33.494Z]     at org.apache.maven.cli.MavenCli.main (MavenCli.java:192)
[2019-05-15T01:38:33.494Z]     at sun.reflect.NativeMethodAccessorImpl.invoke0 (Native Method)
[2019-05-15T01:38:33.494Z]     at sun.reflect.NativeMethodAccessorImpl.invoke (NativeMethodAccessorImpl.java:62)
[2019-05-15T01:38:33.495Z]     at sun.reflect.DelegatingMethodAccessorImpl.invoke (DelegatingMethodAccessorImpl.java:43)
[2019-05-15T01:38:33.495Z]     at java.lang.reflect.Method.invoke (Method.java:498)
[2019-05-15T01:38:33.495Z]     at org.codehaus.plexus.classworlds.launcher.Launcher.launchEnhanced
(Launcher.java:289)
[2019-05-15T01:38:33.495Z]     at org.codehaus.plexus.classworlds.launcher.Launcher.launch
(Launcher.java:229)
[2019-05-15T01:38:33.495Z]     at org.codehaus.plexus.classworlds.launcher.Launcher.mainWithExitCode
(Launcher.java:415)
[2019-05-15T01:38:33.495Z]     at org.codehaus.plexus.classworlds.launcher.Launcher.main (Launcher.java:356)
[2019-05-15T01:38:33.495Z] [ERROR] 
[2019-05-15T01:38:33.495Z] [ERROR] Re-run Maven using the -X switch to enable full debug logging.
[2019-05-15T01:38:33.495Z] [ERROR] 
[2019-05-15T01:38:33.495Z] [ERROR] For more information about the errors and possible solutions,
please read the following articles:
[2019-05-15T01:38:33.495Z] [ERROR] [Help 1] http://cwiki.apache.org/confluence/display/MAVEN/MojoFailureException
[2019-05-15T01:38:33.495Z] [ERROR] 
[2019-05-15T01:38:33.495Z] [ERROR] After correcting the problems, you can resume the build
with the command
[2019-05-15T01:38:33.495Z] [ERROR]   mvn <goals> -rf :surefire-api
[Pipeline] // stage
[Pipeline] fileExists
[Pipeline] }
[Pipeline] // withEnv
[Pipeline] fileExists
[Pipeline] }
[Pipeline] // stage
[2019-05-15T01:38:33.760Z] [INFO] Ignored 3 errors, 1 violation remaining.
[2019-05-15T01:38:33.760Z] [INFO] ------------------------------------------------------------------------
[2019-05-15T01:38:33.761Z] [INFO] Reactor Summary for Apache Maven Surefire 3.0.0-SNAPSHOT:
[2019-05-15T01:38:33.761Z] [INFO] 
[2019-05-15T01:38:33.761Z] [INFO] Apache Maven Surefire .............................. SUCCESS
[01:03 min]
[2019-05-15T01:38:33.761Z] [INFO] SureFire Logger API ................................ SUCCESS
[ 31.100 s]
[2019-05-15T01:38:33.761Z] [INFO] SureFire API ....................................... FAILURE
[ 21.743 s]
[2019-05-15T01:38:33.761Z] [INFO] Surefire Extensions API ............................ SKIPPED
[2019-05-15T01:38:33.761Z] [INFO] SureFire Booter .................................... SKIPPED
[2019-05-15T01:38:33.761Z] [INFO] Maven Surefire Test-Grouping Support ............... SKIPPED
[2019-05-15T01:38:33.761Z] [INFO] SureFire Providers ................................. SKIPPED
[2019-05-15T01:38:33.761Z] [INFO] Shared JUnit3 Provider Code ........................ SKIPPED
[2019-05-15T01:38:33.761Z] [INFO] Shared Java 5 Provider Base ........................ SKIPPED
[2019-05-15T01:38:33.761Z] [INFO] Shared JUnit4 Provider Code ........................ SKIPPED
[2019-05-15T01:38:33.761Z] [INFO] Shared JUnit48 Provider Code ....................... SKIPPED
[2019-05-15T01:38:33.761Z] [INFO] SureFire JUnit Runner .............................. SKIPPED
[2019-05-15T01:38:33.761Z] [INFO] SureFire JUnit4 Runner ............................. SKIPPED
[2019-05-15T01:38:33.761Z] [INFO] Maven Surefire Common .............................. SKIPPED
[2019-05-15T01:38:33.761Z] [INFO] SureFire JUnitCore Runner .......................... SKIPPED
[2019-05-15T01:38:33.761Z] [INFO] SureFire JUnit Platform Runner ..................... SKIPPED
[2019-05-15T01:38:33.761Z] [INFO] SureFire TestNG Utils .............................. SKIPPED
[2019-05-15T01:38:33.761Z] [INFO] SureFire TestNG Runner ............................. SKIPPED
[2019-05-15T01:38:33.761Z] [INFO] ShadeFire JUnit3 Provider .......................... SKIPPED
[2019-05-15T01:38:33.761Z] [INFO] Surefire Report Parser ............................. SKIPPED
[2019-05-15T01:38:33.761Z] [INFO] Maven Surefire Plugin .............................. SKIPPED
[2019-05-15T01:38:33.761Z] [INFO] Maven Failsafe Plugin .............................. SKIPPED
[2019-05-15T01:38:33.761Z] [INFO] Maven Surefire Report Plugin ....................... SKIPPED
[2019-05-15T01:38:33.761Z] [INFO] Maven Surefire Integration Tests ................... SKIPPED
[2019-05-15T01:38:33.761Z] [INFO] ------------------------------------------------------------------------
[2019-05-15T01:38:33.761Z] [INFO] BUILD FAILURE
[2019-05-15T01:38:33.761Z] [INFO] ------------------------------------------------------------------------
[2019-05-15T01:38:33.761Z] [INFO] Total time:  01:59 min
[2019-05-15T01:38:33.761Z] [INFO] Finished at: 2019-05-14T18:38:33-07:00
[2019-05-15T01:38:33.761Z] [INFO] ------------------------------------------------------------------------
[2019-05-15T01:38:33.761Z] [ERROR] Failed to execute goal org.apache.maven.plugins:maven-checkstyle-plugin:3.0.0:check
(checkstyle-check) on project surefire-api: You have 1 Checkstyle violation. -> [Help 1]
[2019-05-15T01:38:33.761Z] org.apache.maven.lifecycle.LifecycleExecutionException: Failed
to execute goal org.apache.maven.plugins:maven-checkstyle-plugin:3.0.0:check (checkstyle-check)
on project surefire-api: You have 1 Checkstyle violation.
[2019-05-15T01:38:33.761Z]     at org.apache.maven.lifecycle.internal.MojoExecutor.execute
(MojoExecutor.java:215)
[2019-05-15T01:38:33.761Z]     at org.apache.maven.lifecycle.internal.MojoExecutor.execute
(MojoExecutor.java:156)
[2019-05-15T01:38:33.761Z]     at org.apache.maven.lifecycle.internal.MojoExecutor.execute
(MojoExecutor.java:148)
[2019-05-15T01:38:33.761Z]     at org.apache.maven.lifecycle.internal.LifecycleModuleBuilder.buildProject
(LifecycleModuleBuilder.java:117)
[2019-05-15T01:38:33.761Z]     at org.apache.maven.lifecycle.internal.LifecycleModuleBuilder.buildProject
(LifecycleModuleBuilder.java:81)
[2019-05-15T01:38:33.761Z]     at org.apache.maven.lifecycle.internal.builder.singlethreaded.SingleThreadedBuilder.build
(SingleThreadedBuilder.java:56)
[2019-05-15T01:38:33.761Z]     at org.apache.maven.lifecycle.internal.LifecycleStarter.execute
(LifecycleStarter.java:128)
[2019-05-15T01:38:33.761Z]     at org.apache.maven.DefaultMaven.doExecute (DefaultMaven.java:305)
[2019-05-15T01:38:33.761Z]     at org.apache.maven.DefaultMaven.doExecute (DefaultMaven.java:192)
[2019-05-15T01:38:33.761Z]     at org.apache.maven.DefaultMaven.execute (DefaultMaven.java:105)
[2019-05-15T01:38:33.761Z]     at org.apache.maven.cli.MavenCli.execute (MavenCli.java:956)
[2019-05-15T01:38:33.761Z]     at org.apache.maven.cli.MavenCli.doMain (MavenCli.java:288)
[2019-05-15T01:38:33.761Z]     at org.apache.maven.cli.MavenCli.main (MavenCli.java:192)
[2019-05-15T01:38:33.761Z]     at sun.reflect.NativeMethodAccessorImpl.invoke0 (Native Method)
[2019-05-15T01:38:33.761Z]     at sun.reflect.NativeMethodAccessorImpl.invoke (NativeMethodAccessorImpl.java:62)
[2019-05-15T01:38:33.761Z]     at sun.reflect.DelegatingMethodAccessorImpl.invoke (DelegatingMethodAccessorImpl.java:43)
[2019-05-15T01:38:33.761Z]     at java.lang.reflect.Method.invoke (Method.java:498)
[2019-05-15T01:38:33.761Z]     at org.codehaus.plexus.classworlds.launcher.Launcher.launchEnhanced
(Launcher.java:289)
[2019-05-15T01:38:33.761Z]     at org.codehaus.plexus.classworlds.launcher.Launcher.launch
(Launcher.java:229)
[2019-05-15T01:38:33.761Z]     at org.codehaus.plexus.classworlds.launcher.Launcher.mainWithExitCode
(Launcher.java:415)
[2019-05-15T01:38:33.761Z]     at org.codehaus.plexus.classworlds.launcher.Launcher.main (Launcher.java:356)
[2019-05-15T01:38:33.761Z] Caused by: org.apache.maven.plugin.MojoFailureException: You have
1 Checkstyle violation.
[2019-05-15T01:38:33.761Z]     at org.apache.maven.plugins.checkstyle.CheckstyleViolationCheckMojo.execute
(CheckstyleViolationCheckMojo.java:576)
[2019-05-15T01:38:33.761Z]     at org.apache.maven.plugin.DefaultBuildPluginManager.executeMojo
(DefaultBuildPluginManager.java:137)
[2019-05-15T01:38:33.761Z]     at org.apache.maven.lifecycle.internal.MojoExecutor.execute
(MojoExecutor.java:210)
[2019-05-15T01:38:33.761Z]     at org.apache.maven.lifecycle.internal.MojoExecutor.execute
(MojoExecutor.java:156)
[2019-05-15T01:38:33.761Z]     at org.apache.maven.lifecycle.internal.MojoExecutor.execute
(MojoExecutor.java:148)
[2019-05-15T01:38:33.762Z]     at org.apache.maven.lifecycle.internal.LifecycleModuleBuilder.buildProject
(LifecycleModuleBuilder.java:117)
[2019-05-15T01:38:33.762Z]     at org.apache.maven.lifecycle.internal.LifecycleModuleBuilder.buildProject
(LifecycleModuleBuilder.java:81)
[2019-05-15T01:38:33.762Z]     at org.apache.maven.lifecycle.internal.builder.singlethreaded.SingleThreadedBuilder.build
(SingleThreadedBuilder.java:56)
[2019-05-15T01:38:33.762Z]     at org.apache.maven.lifecycle.internal.LifecycleStarter.execute
(LifecycleStarter.java:128)
[2019-05-15T01:38:33.762Z]     at org.apache.maven.DefaultMaven.doExecute (DefaultMaven.java:305)
[2019-05-15T01:38:33.762Z]     at org.apache.maven.DefaultMaven.doExecute (DefaultMaven.java:192)
[2019-05-15T01:38:33.762Z]     at org.apache.maven.DefaultMaven.execute (DefaultMaven.java:105)
[2019-05-15T01:38:33.762Z]     at org.apache.maven.cli.MavenCli.execute (MavenCli.java:956)
[2019-05-15T01:38:33.762Z]     at org.apache.maven.cli.MavenCli.doMain (MavenCli.java:288)
[2019-05-15T01:38:33.762Z]     at org.apache.maven.cli.MavenCli.main (MavenCli.java:192)
[2019-05-15T01:38:33.762Z]     at sun.reflect.NativeMethodAccessorImpl.invoke0 (Native Method)
[2019-05-15T01:38:33.762Z]     at sun.reflect.NativeMethodAccessorImpl.invoke (NativeMethodAccessorImpl.java:62)
[2019-05-15T01:38:33.762Z]     at sun.reflect.DelegatingMethodAccessorImpl.invoke (DelegatingMethodAccessorImpl.java:43)
[2019-05-15T01:38:33.762Z]     at java.lang.reflect.Method.invoke (Method.java:498)
[2019-05-15T01:38:33.762Z]     at org.codehaus.plexus.classworlds.launcher.Launcher.launchEnhanced
(Launcher.java:289)
[2019-05-15T01:38:33.762Z]     at org.codehaus.plexus.classworlds.launcher.Launcher.launch
(Launcher.java:229)
[2019-05-15T01:38:33.762Z]     at org.codehaus.plexus.classworlds.launcher.Launcher.mainWithExitCode
(Launcher.java:415)
[2019-05-15T01:38:33.762Z]     at org.codehaus.plexus.classworlds.launcher.Launcher.main (Launcher.java:356)
[2019-05-15T01:38:33.762Z] [ERROR] 
[2019-05-15T01:38:33.762Z] [ERROR] Re-run Maven using the -X switch to enable full debug logging.
[2019-05-15T01:38:33.762Z] [ERROR] 
[2019-05-15T01:38:33.762Z] [ERROR] For more information about the errors and possible solutions,
please read the following articles:
[2019-05-15T01:38:33.762Z] [ERROR] [Help 1] http://cwiki.apache.org/confluence/display/MAVEN/MojoFailureException
[2019-05-15T01:38:33.762Z] [ERROR] 
[2019-05-15T01:38:33.762Z] [ERROR] After correcting the problems, you can resume the build
with the command
[2019-05-15T01:38:33.762Z] [ERROR]   mvn <goals> -rf :surefire-api
[Pipeline] fileExists
[Pipeline] archiveArtifacts
[2019-05-15T01:38:33.807Z] Archiving artifacts
[Pipeline] fileExists
[Pipeline] }
[Pipeline] }
[Pipeline] // withEnv
[Pipeline] // withEnv
[Pipeline] archiveArtifacts
[Pipeline] cleanWs
[2019-05-15T01:38:33.965Z] Archiving artifacts
[Pipeline] }
[Pipeline] }
[2019-05-15T01:38:33.992Z] [WS-CLEANUP] Deleting project workspace...
[2019-05-15T01:38:33.993Z] [WS-CLEANUP] Deferred wipeout is used...
[Pipeline] // stage
[2019-05-15T01:38:34.047Z] [WS-CLEANUP] done
[Pipeline] // stage
[Pipeline] fileExists
[Pipeline] cleanWs
[Pipeline] fileExists
[2019-05-15T01:38:34.169Z] [WS-CLEANUP] Deleting project workspace...
[2019-05-15T01:38:34.169Z] [WS-CLEANUP] Deferred wipeout is used...
[Pipeline] }
[2019-05-15T01:38:34.224Z] [WS-CLEANUP] done
[Pipeline] fileExists
[Pipeline] // ws
[Pipeline] }
[Pipeline] fileExists
[Pipeline] }
[Pipeline] archiveArtifacts
[2019-05-15T01:38:34.378Z] Archiving artifacts
[Pipeline] // timestamps
[Pipeline] }
[Pipeline] // ws
[Pipeline] }
[Pipeline] archiveArtifacts
[2019-05-15T01:38:34.490Z] Archiving artifacts
[Pipeline] // node
[Pipeline] }
[Pipeline] cleanWs
[2019-05-15T01:38:34.566Z] [WS-CLEANUP] Deleting project workspace...
[2019-05-15T01:38:34.566Z] [WS-CLEANUP] Deferred wipeout is used...
[Pipeline] // timestamps
[2019-05-15T01:38:34.620Z] [WS-CLEANUP] done
[Pipeline] }
[Pipeline] cleanWs
[2019-05-15T01:38:34.667Z] [WS-CLEANUP] Deleting project workspace...
[2019-05-15T01:38:34.667Z] [WS-CLEANUP] Deferred wipeout is used...
[Pipeline] // node
[2019-05-15T01:38:34.714Z] [WS-CLEANUP] done
[Pipeline] }
[Pipeline] }
[Pipeline] // ws
[Pipeline] }
[Pipeline] }
[Pipeline] // timestamps
[Pipeline] // ws
[Pipeline] }
[Pipeline] }
[Pipeline] // node
[Pipeline] // timestamps
[Pipeline] }
[Pipeline] }
[Pipeline] // node
[Pipeline] }
[Pipeline] // parallel
[Pipeline] echo
Build result: FAILURE
[Pipeline] jiraIssueSelector
[Pipeline] emailext
Mime
  • Unnamed multipart/mixed (inline, None, 0 bytes)
View raw message