maven-notifications mailing list archives

Site index · List index
Message view « Date » · « Thread »
Top « Date » · « Thread »
From Apache Jenkins Server <jenk...@builds.apache.org>
Subject Build failed in Jenkins: Maven TLP » maven-resolver » MRESOLVER-33 #1
Date Tue, 14 May 2019 08:26:28 GMT
See https://builds.apache.org/job/maven-box/job/maven-resolver/job/MRESOLVER-33/1/

No changes.

All tests passed

Build log:
[...truncated 20238 lines...]
ERROR: [withMaven] junitPublisher - Silently ignore exception archiving JUnit results for
Maven artifact MavenArtifact{org.apache.maven.resolver:maven-resolver-test-util:jar:1.4.0-SNAPSHOT(version:
1.4.0-SNAPSHOT, snapshot:false) } generated by PluginInvocation{org.apache.maven.plugins:maven-surefire-plugin:2.22.0@test
 default-test}: hudson.remoting.RequestAbortedException: java.nio.channels.ClosedChannelException
[withMaven] junitPublisher - Archive test results for Maven artifact org.apache.maven.resolver:maven-resolver-util:jar:1.4.0-SNAPSHOT
generated by maven-surefire-plugin:test (default-test): m\maven-resolver-util\target\surefire-reports\*.xml
Recording test results
ERROR: [withMaven] junitPublisher - Silently ignore exception archiving JUnit results for
Maven artifact MavenArtifact{org.apache.maven.resolver:maven-resolver-util:jar:1.4.0-SNAPSHOT(version:
1.4.0-SNAPSHOT, snapshot:false) } generated by PluginInvocation{org.apache.maven.plugins:maven-surefire-plugin:2.22.0@test
 default-test}: hudson.remoting.ChannelClosedException: Channel "unknown": Remote call on
JNLP4-connect connection from 37.48.69.226/37.48.69.226:56320 failed. The channel is closing
down or has closed down
[withMaven] junitPublisher - Archive test results for Maven artifact org.apache.maven.resolver:maven-resolver-impl:jar:1.4.0-SNAPSHOT
generated by maven-surefire-plugin:test (default-test): m\maven-resolver-impl\target\surefire-reports\*.xml
Recording test results
ERROR: [withMaven] junitPublisher - Silently ignore exception archiving JUnit results for
Maven artifact MavenArtifact{org.apache.maven.resolver:maven-resolver-impl:jar:1.4.0-SNAPSHOT(version:
1.4.0-SNAPSHOT, snapshot:false) } generated by PluginInvocation{org.apache.maven.plugins:maven-surefire-plugin:2.22.0@test
 default-test}: hudson.remoting.ChannelClosedException: Channel "unknown": Remote call on
JNLP4-connect connection from 37.48.69.226/37.48.69.226:56320 failed. The channel is closing
down or has closed down
[withMaven] junitPublisher - Archive test results for Maven artifact org.apache.maven.resolver:maven-resolver-connector-basic:jar:1.4.0-SNAPSHOT
generated by maven-surefire-plugin:test (default-test): m\maven-resolver-connector-basic\target\surefire-reports\*.xml
Recording test results
ERROR: [withMaven] junitPublisher - Silently ignore exception archiving JUnit results for
Maven artifact MavenArtifact{org.apache.maven.resolver:maven-resolver-connector-basic:jar:1.4.0-SNAPSHOT(version:
1.4.0-SNAPSHOT, snapshot:false) } generated by PluginInvocation{org.apache.maven.plugins:maven-surefire-plugin:2.22.0@test
 default-test}: hudson.remoting.ChannelClosedException: Channel "unknown": Remote call on
JNLP4-connect connection from 37.48.69.226/37.48.69.226:56320 failed. The channel is closing
down or has closed down
[withMaven] junitPublisher - Archive test results for Maven artifact org.apache.maven.resolver:maven-resolver-transport-classpath:jar:1.4.0-SNAPSHOT
generated by maven-surefire-plugin:test (default-test): m\maven-resolver-transport-classpath\target\surefire-reports\*.xml
Recording test results
ERROR: [withMaven] junitPublisher - Silently ignore exception archiving JUnit results for
Maven artifact MavenArtifact{org.apache.maven.resolver:maven-resolver-transport-classpath:jar:1.4.0-SNAPSHOT(version:
1.4.0-SNAPSHOT, snapshot:false) } generated by PluginInvocation{org.apache.maven.plugins:maven-surefire-plugin:2.22.0@test
 default-test}: hudson.remoting.ChannelClosedException: Channel "unknown": Remote call on
JNLP4-connect connection from 37.48.69.226/37.48.69.226:56320 failed. The channel is closing
down or has closed down
[withMaven] junitPublisher - Archive test results for Maven artifact org.apache.maven.resolver:maven-resolver-transport-file:jar:1.4.0-SNAPSHOT
generated by maven-surefire-plugin:test (default-test): m\maven-resolver-transport-file\target\surefire-reports\*.xml
Recording test results
ERROR: [withMaven] junitPublisher - Silently ignore exception archiving JUnit results for
Maven artifact MavenArtifact{org.apache.maven.resolver:maven-resolver-transport-file:jar:1.4.0-SNAPSHOT(version:
1.4.0-SNAPSHOT, snapshot:false) } generated by PluginInvocation{org.apache.maven.plugins:maven-surefire-plugin:2.22.0@test
 default-test}: hudson.remoting.ChannelClosedException: Channel "unknown": Remote call on
JNLP4-connect connection from 37.48.69.226/37.48.69.226:56320 failed. The channel is closing
down or has closed down
[withMaven] junitPublisher - Archive test results for Maven artifact org.apache.maven.resolver:maven-resolver-transport-http:jar:1.4.0-SNAPSHOT
generated by maven-surefire-plugin:test (default-test): m\maven-resolver-transport-http\target\surefire-reports\*.xml
Recording test results
ERROR: [withMaven] junitPublisher - Silently ignore exception archiving JUnit results for
Maven artifact MavenArtifact{org.apache.maven.resolver:maven-resolver-transport-http:jar:1.4.0-SNAPSHOT(version:
1.4.0-SNAPSHOT, snapshot:false) } generated by PluginInvocation{org.apache.maven.plugins:maven-surefire-plugin:2.22.0@test
 default-test}: hudson.remoting.ChannelClosedException: Channel "unknown": Remote call on
JNLP4-connect connection from 37.48.69.226/37.48.69.226:56320 failed. The channel is closing
down or has closed down
[withMaven] junitPublisher - Archive test results for Maven artifact org.apache.maven.resolver:maven-resolver-transport-wagon:jar:1.4.0-SNAPSHOT
generated by maven-surefire-plugin:test (default-test): m\maven-resolver-transport-wagon\target\surefire-reports\*.xml
Recording test results
ERROR: [withMaven] junitPublisher - Silently ignore exception archiving JUnit results for
Maven artifact MavenArtifact{org.apache.maven.resolver:maven-resolver-transport-wagon:jar:1.4.0-SNAPSHOT(version:
1.4.0-SNAPSHOT, snapshot:false) } generated by PluginInvocation{org.apache.maven.plugins:maven-surefire-plugin:2.22.0@test
 default-test}: hudson.remoting.ChannelClosedException: Channel "unknown": Remote call on
JNLP4-connect connection from 37.48.69.226/37.48.69.226:56320 failed. The channel is closing
down or has closed down
[withMaven] junitPublisher - Archive test results for Maven artifact org.apache.maven.resolver:maven-resolver-demo-snippets:jar:1.4.0-SNAPSHOT
generated by maven-surefire-plugin:test (default-test): m\maven-resolver-demos\maven-resolver-demo-snippets\target\surefire-reports\*.xml
Recording test results
ERROR: [withMaven] junitPublisher - Silently ignore exception archiving JUnit results for
Maven artifact MavenArtifact{org.apache.maven.resolver:maven-resolver-demo-snippets:jar:1.4.0-SNAPSHOT(version:
1.4.0-SNAPSHOT, snapshot:false) } generated by PluginInvocation{org.apache.maven.plugins:maven-surefire-plugin:2.22.0@test
 default-test}: hudson.remoting.ChannelClosedException: Channel "unknown": Remote call on
JNLP4-connect connection from 37.48.69.226/37.48.69.226:56320 failed. The channel is closing
down or has closed down
[withMaven] junitPublisher - Archive test results for Maven artifact org.apache.maven.resolver:maven-resolver-demo-maven-plugin:maven-plugin:1.4.0-SNAPSHOT
generated by maven-surefire-plugin:test (default-test): m\maven-resolver-demos\maven-resolver-demo-maven-plugin\target\surefire-reports\*.xml
Recording test results
ERROR: [withMaven] junitPublisher - Silently ignore exception archiving JUnit results for
Maven artifact MavenArtifact{org.apache.maven.resolver:maven-resolver-demo-maven-plugin:maven-plugin:1.4.0-SNAPSHOT(version:
1.4.0-SNAPSHOT, snapshot:false) } generated by PluginInvocation{org.apache.maven.plugins:maven-surefire-plugin:2.22.0@test
 default-test}: hudson.remoting.ChannelClosedException: Channel "unknown": Remote call on
JNLP4-connect connection from 37.48.69.226/37.48.69.226:56320 failed. The channel is closing
down or has closed down
ERROR: Issue with creating launcher for agent windows-2012-2. The agent has not been fully
initialized yet
ERROR: [withMaven] WARNING Exception processing the logs generated by the Jenkins Maven Event
Spy f:\jenkins\jenkins-slave\workspace\-box_maven-resolver_MRESOLVER-33@2@tmp\withMavenb1e8f317\maven-spy-20190514-081722-8554670974159412688841.log,
ignore file.  Please report a bug associated for the component 'pipeline-maven-plugin' at
https://issues.jenkins-ci.org 
hudson.remoting.ChannelClosedException: Channel "unknown": Remote call on JNLP4-connect connection
from 37.48.69.226/37.48.69.226:56320 failed. The channel is closing down or has closed down
	at hudson.remoting.Channel.call(Channel.java:948)
	at hudson.FilePath.act(FilePath.java:1072)
	at hudson.FilePath.act(FilePath.java:1061)
	at hudson.FilePath.exists(FilePath.java:1581)
	at org.jenkinsci.plugins.pipeline.maven.MavenSpyLogProcessor.processMavenSpyLogs(MavenSpyLogProcessor.java:115)
	at org.jenkinsci.plugins.pipeline.maven.WithMavenStepExecution2$WithMavenStepExecutionCallBack.finished(WithMavenStepExecution2.java:1103)
	at org.jenkinsci.plugins.pipeline.maven.fix.jenkins49337.GeneralNonBlockingStepExecution$TailCall.lambda$onSuccess$0(GeneralNonBlockingStepExecution.java:142)
	at org.jenkinsci.plugins.pipeline.maven.fix.jenkins49337.GeneralNonBlockingStepExecution.lambda$run$0(GeneralNonBlockingStepExecution.java:85)
	at java.util.concurrent.Executors$RunnableAdapter.call(Executors.java:511)
	at java.util.concurrent.FutureTask.run(FutureTask.java:266)
	at java.util.concurrent.ThreadPoolExecutor.runWorker(ThreadPoolExecutor.java:1149)
	at java.util.concurrent.ThreadPoolExecutor$Worker.run(ThreadPoolExecutor.java:624)
	at java.lang.Thread.run(Thread.java:748)
Caused by: java.nio.channels.ClosedChannelException
	at org.jenkinsci.remoting.protocol.impl.ChannelApplicationLayer.onReadClosed(ChannelApplicationLayer.java:209)
	at org.jenkinsci.remoting.protocol.ApplicationLayer.onRecvClosed(ApplicationLayer.java:222)
	at org.jenkinsci.remoting.protocol.ProtocolStack$Ptr.onRecvClosed(ProtocolStack.java:816)
	at org.jenkinsci.remoting.protocol.FilterLayer.onRecvClosed(FilterLayer.java:287)
	at org.jenkinsci.remoting.protocol.impl.SSLEngineFilterLayer.onRecvClosed(SSLEngineFilterLayer.java:181)
	at org.jenkinsci.remoting.protocol.impl.SSLEngineFilterLayer.switchToNoSecure(SSLEngineFilterLayer.java:283)
	at org.jenkinsci.remoting.protocol.impl.SSLEngineFilterLayer.processWrite(SSLEngineFilterLayer.java:503)
	at org.jenkinsci.remoting.protocol.impl.SSLEngineFilterLayer.processQueuedWrites(SSLEngineFilterLayer.java:248)
	at org.jenkinsci.remoting.protocol.impl.SSLEngineFilterLayer.doSend(SSLEngineFilterLayer.java:200)
	at org.jenkinsci.remoting.protocol.impl.SSLEngineFilterLayer.doCloseSend(SSLEngineFilterLayer.java:213)
	at org.jenkinsci.remoting.protocol.ProtocolStack$Ptr.doCloseSend(ProtocolStack.java:784)
	at org.jenkinsci.remoting.protocol.ApplicationLayer.doCloseWrite(ApplicationLayer.java:173)
	at org.jenkinsci.remoting.protocol.impl.ChannelApplicationLayer$ByteBufferCommandTransport.closeWrite(ChannelApplicationLayer.java:314)
	at hudson.remoting.Channel.close(Channel.java:1450)
	at hudson.remoting.Channel.close(Channel.java:1403)
	at hudson.slaves.SlaveComputer.closeChannel(SlaveComputer.java:821)
	at hudson.slaves.SlaveComputer.access$800(SlaveComputer.java:105)
	at hudson.slaves.SlaveComputer$3.run(SlaveComputer.java:737)
	at jenkins.util.ContextResettingExecutorService$1.run(ContextResettingExecutorService.java:28)
	at jenkins.security.ImpersonatingExecutorService$1.run(ImpersonatingExecutorService.java:59)
	... 5 more
[withMaven] Publishers: Pipeline Graph Publisher: 10 ms, Invoker Publisher: 2638 ms, Junit
Publisher: 358130 ms
[withMaven] junitPublisher - Archive test results for Maven artifact org.apache.maven.resolver:maven-resolver-impl:jar:1.4.0-SNAPSHOT
generated by maven-surefire-plugin:test (default-test): m\maven-resolver-impl\target\surefire-reports\*.xml
Recording test results
[withMaven] junitPublisher - Archive test results for Maven artifact org.apache.maven.resolver:maven-resolver-transport-file:jar:1.4.0-SNAPSHOT
generated by maven-surefire-plugin:test (default-test): m/maven-resolver-transport-file/target/surefire-reports/*.xml
Recording test results
[withMaven] junitPublisher - Archive test results for Maven artifact org.apache.maven.resolver:maven-resolver-transport-wagon:jar:1.4.0-SNAPSHOT
generated by maven-surefire-plugin:test (default-test): m/maven-resolver-transport-wagon/target/surefire-reports/*.xml
Recording test results
ERROR: Issue with creating launcher for agent windows-2012-2. The agent has not been fully
initialized yet
ERROR: [withMaven] WARNING Exception processing the logs generated by the Jenkins Maven Event
Spy f:\jenkins\jenkins-slave\workspace\-box_maven-resolver_MRESOLVER-33@tmp\withMaven39787119\maven-spy-20190514-081722-9623921901642104400185.log,
ignore file.  Please report a bug associated for the component 'pipeline-maven-plugin' at
https://issues.jenkins-ci.org 
hudson.remoting.ChannelClosedException: Channel "unknown": Remote call on JNLP4-connect connection
from 37.48.69.226/37.48.69.226:56320 failed. The channel is closing down or has closed down
	at hudson.remoting.Channel.call(Channel.java:948)
	at hudson.FilePath.act(FilePath.java:1072)
	at hudson.FilePath.act(FilePath.java:1061)
	at hudson.FilePath.exists(FilePath.java:1581)
	at org.jenkinsci.plugins.pipeline.maven.MavenSpyLogProcessor.processMavenSpyLogs(MavenSpyLogProcessor.java:115)
	at org.jenkinsci.plugins.pipeline.maven.WithMavenStepExecution2$WithMavenStepExecutionCallBack.finished(WithMavenStepExecution2.java:1103)
	at org.jenkinsci.plugins.pipeline.maven.fix.jenkins49337.GeneralNonBlockingStepExecution$TailCall.lambda$onSuccess$0(GeneralNonBlockingStepExecution.java:142)
	at org.jenkinsci.plugins.pipeline.maven.fix.jenkins49337.GeneralNonBlockingStepExecution.lambda$run$0(GeneralNonBlockingStepExecution.java:85)
	at java.util.concurrent.Executors$RunnableAdapter.call(Executors.java:511)
	at java.util.concurrent.FutureTask.run(FutureTask.java:266)
	at java.util.concurrent.ThreadPoolExecutor.runWorker(ThreadPoolExecutor.java:1149)
	at java.util.concurrent.ThreadPoolExecutor$Worker.run(ThreadPoolExecutor.java:624)
	at java.lang.Thread.run(Thread.java:748)
Caused by: java.nio.channels.ClosedChannelException
	at org.jenkinsci.remoting.protocol.impl.ChannelApplicationLayer.onReadClosed(ChannelApplicationLayer.java:209)
	at org.jenkinsci.remoting.protocol.ApplicationLayer.onRecvClosed(ApplicationLayer.java:222)
	at org.jenkinsci.remoting.protocol.ProtocolStack$Ptr.onRecvClosed(ProtocolStack.java:816)
	at org.jenkinsci.remoting.protocol.FilterLayer.onRecvClosed(FilterLayer.java:287)
	at org.jenkinsci.remoting.protocol.impl.SSLEngineFilterLayer.onRecvClosed(SSLEngineFilterLayer.java:181)
	at org.jenkinsci.remoting.protocol.impl.SSLEngineFilterLayer.switchToNoSecure(SSLEngineFilterLayer.java:283)
	at org.jenkinsci.remoting.protocol.impl.SSLEngineFilterLayer.processWrite(SSLEngineFilterLayer.java:503)
	at org.jenkinsci.remoting.protocol.impl.SSLEngineFilterLayer.processQueuedWrites(SSLEngineFilterLayer.java:248)
	at org.jenkinsci.remoting.protocol.impl.SSLEngineFilterLayer.doSend(SSLEngineFilterLayer.java:200)
	at org.jenkinsci.remoting.protocol.impl.SSLEngineFilterLayer.doCloseSend(SSLEngineFilterLayer.java:213)
	at org.jenkinsci.remoting.protocol.ProtocolStack$Ptr.doCloseSend(ProtocolStack.java:784)
	at org.jenkinsci.remoting.protocol.ApplicationLayer.doCloseWrite(ApplicationLayer.java:173)
	at org.jenkinsci.remoting.protocol.impl.ChannelApplicationLayer$ByteBufferCommandTransport.closeWrite(ChannelApplicationLayer.java:314)
	at hudson.remoting.Channel.close(Channel.java:1450)
	at hudson.remoting.Channel.close(Channel.java:1403)
	at hudson.slaves.SlaveComputer.closeChannel(SlaveComputer.java:821)
	at hudson.slaves.SlaveComputer.access$800(SlaveComputer.java:105)
	at hudson.slaves.SlaveComputer$3.run(SlaveComputer.java:737)
	at jenkins.util.ContextResettingExecutorService$1.run(ContextResettingExecutorService.java:28)
	at jenkins.security.ImpersonatingExecutorService$1.run(ImpersonatingExecutorService.java:59)
	... 5 more
[withMaven] Publishers: Pipeline Graph Publisher: 6 ms, Invoker Publisher: 311284 ms
[withMaven] junitPublisher - Archive test results for Maven artifact org.apache.maven.resolver:maven-resolver-demo-snippets:jar:1.4.0-SNAPSHOT
generated by maven-surefire-plugin:test (default-test): m/maven-resolver-demos/maven-resolver-demo-snippets/target/surefire-reports/*.xml
Recording test results
[Pipeline] // withMaven
[Pipeline] // withMaven
[withMaven] junitPublisher - Archive test results for Maven artifact org.apache.maven.resolver:maven-resolver-demo-snippets:jar:1.4.0-SNAPSHOT
generated by maven-surefire-plugin:test (default-test): m/maven-resolver-demos/maven-resolver-demo-snippets/target/surefire-reports/*.xml
Recording test results
[withMaven] junitPublisher - Archive test results for Maven artifact org.apache.maven.resolver:maven-resolver-transport-http:jar:1.4.0-SNAPSHOT
generated by maven-surefire-plugin:test (default-test): m/maven-resolver-transport-http/target/surefire-reports/*.xml
Recording test results
[withMaven] junitPublisher - Archive test results for Maven artifact org.apache.maven.resolver:maven-resolver-connector-basic:jar:1.4.0-SNAPSHOT
generated by maven-surefire-plugin:test (default-test): m\maven-resolver-connector-basic\target\surefire-reports\*.xml
Recording test results
[withMaven] junitPublisher - Archive test results for Maven artifact org.apache.maven.resolver:maven-resolver-transport-wagon:jar:1.4.0-SNAPSHOT
generated by maven-surefire-plugin:test (default-test): m/maven-resolver-transport-wagon/target/surefire-reports/*.xml
Recording test results
None of the test reports contained any result
[withMaven] junitPublisher - Archive test results for Maven artifact org.apache.maven.resolver:maven-resolver-demo-maven-plugin:maven-plugin:1.4.0-SNAPSHOT
generated by maven-surefire-plugin:test (default-test): m/maven-resolver-demos/maven-resolver-demo-maven-plugin/target/surefire-reports/*.xml
Recording test results
None of the test reports contained any result
[withMaven] junitPublisher - Archive test results for Maven artifact org.apache.maven.resolver:maven-resolver-demo-maven-plugin:maven-plugin:1.4.0-SNAPSHOT
generated by maven-surefire-plugin:test (default-test): m/maven-resolver-demos/maven-resolver-demo-maven-plugin/target/surefire-reports/*.xml
Recording test results
[Pipeline] echo
[FAILURE-004] hudson.remoting.ChannelClosedException: Channel "unknown": Remote call on JNLP4-connect
connection from 37.48.69.226/37.48.69.226:56320 failed. The channel is closing down or has
closed down
[Pipeline] cleanWs
ERROR: Issue with creating launcher for agent windows-2012-2. The agent has not been fully
initialized yet
[Pipeline] echo
[FAILURE-004] hudson.remoting.ChannelClosedException: Channel "unknown": Remote call on JNLP4-connect
connection from 37.48.69.226/37.48.69.226:56320 failed. The channel is closing down or has
closed down
[Pipeline] cleanWs
ERROR: Issue with creating launcher for agent windows-2012-2. The agent has not been fully
initialized yet
[withMaven] junitPublisher - Archive test results for Maven artifact org.apache.maven.resolver:maven-resolver-demo-snippets:jar:1.4.0-SNAPSHOT
generated by maven-surefire-plugin:test (default-test): m/maven-resolver-demos/maven-resolver-demo-snippets/target/surefire-reports/*.xml
Recording test results
[withMaven] junitPublisher - Archive test results for Maven artifact org.apache.maven.resolver:maven-resolver-transport-classpath:jar:1.4.0-SNAPSHOT
generated by maven-surefire-plugin:test (default-test): m\maven-resolver-transport-classpath\target\surefire-reports\*.xml
Recording test results
None of the test reports contained any result
[withMaven] junitPublisher - Archive test results for Maven artifact org.apache.maven.resolver:maven-resolver-demo-maven-plugin:maven-plugin:1.4.0-SNAPSHOT
generated by maven-surefire-plugin:test (default-test): m/maven-resolver-demos/maven-resolver-demo-maven-plugin/target/surefire-reports/*.xml
Recording test results
None of the test reports contained any result
[Pipeline] cleanWs
ERROR: Issue with creating launcher for agent windows-2012-2. The agent has not been fully
initialized yet
[Pipeline] cleanWs
ERROR: Issue with creating launcher for agent windows-2012-2. The agent has not been fully
initialized yet
[Pipeline] echo
Failed to clean up workspace: hudson.remoting.ChannelClosedException: Channel "unknown": Remote
call on JNLP4-connect connection from 37.48.69.226/37.48.69.226:56320 failed. The channel
is closing down or has closed down
[Pipeline] }
[Pipeline] echo
Failed to clean up workspace: hudson.remoting.ChannelClosedException: Channel "unknown": Remote
call on JNLP4-connect connection from 37.48.69.226/37.48.69.226:56320 failed. The channel
is closing down or has closed down
[Pipeline] }
None of the test reports contained any result
[Pipeline] // stage
None of the test reports contained any result
[withMaven] junitPublisher - Archive test results for Maven artifact org.apache.maven.resolver:maven-resolver-transport-file:jar:1.4.0-SNAPSHOT
generated by maven-surefire-plugin:test (default-test): m\maven-resolver-transport-file\target\surefire-reports\*.xml
Recording test results
[Pipeline] // stage
[withMaven] junitPublisher - Archive test results for Maven artifact org.apache.maven.resolver:maven-resolver-transport-http:jar:1.4.0-SNAPSHOT
generated by maven-surefire-plugin:test (default-test): m\maven-resolver-transport-http\target\surefire-reports\*.xml
Recording test results
[Pipeline] }
[Pipeline] }
[withMaven] junitPublisher - Archive test results for Maven artifact org.apache.maven.resolver:maven-resolver-transport-wagon:jar:1.4.0-SNAPSHOT
generated by maven-surefire-plugin:test (default-test): m\maven-resolver-transport-wagon\target\surefire-reports\*.xml
Recording test results
[Pipeline] // node
[withMaven] junitPublisher - Archive test results for Maven artifact org.apache.maven.resolver:maven-resolver-demo-snippets:jar:1.4.0-SNAPSHOT
generated by maven-surefire-plugin:test (default-test): m\maven-resolver-demos\maven-resolver-demo-snippets\target\surefire-reports\*.xml
Recording test results
[Pipeline] // node
None of the test reports contained any result
[withMaven] junitPublisher - Archive test results for Maven artifact org.apache.maven.resolver:maven-resolver-demo-maven-plugin:maven-plugin:1.4.0-SNAPSHOT
generated by maven-surefire-plugin:test (default-test): m\maven-resolver-demos\maven-resolver-demo-maven-plugin\target\surefire-reports\*.xml
Recording test results
[Pipeline] }
Failed in branch windows-jdk7
[Pipeline] }
Failed in branch windows-jdk8
None of the test reports contained any result
[withMaven] Publishers: Pipeline Graph Publisher: 11 ms, Invoker Publisher: 22668 ms, Junit
Publisher: 376251 ms, Concordion Publisher: 1 ms, Dependencies Fingerprint Publisher: 960
ms
[Pipeline] // withMaven
[Pipeline] cleanWs
[WS-CLEANUP] Deleting project workspace...
[WS-CLEANUP] Deferred wipeout is used...
[WS-CLEANUP] done
[Pipeline] }
[Pipeline] // stage
[Pipeline] }
[Pipeline] // node
[Pipeline] }
[withMaven] Publishers: Pipeline Graph Publisher: 14 ms, Invoker Publisher: 1154 ms, Junit
Publisher: 457222 ms, Concordion Publisher: 1 ms, Dependencies Fingerprint Publisher: 9078
ms, JGiven Publisher: 1 ms, Jacoco Publisher: 1 ms
[withMaven] Publishers: Pipeline Graph Publisher: 11 ms, Invoker Publisher: 21263 ms, Junit
Publisher: 426480 ms, Concordion Publisher: 1 ms, Dependencies Fingerprint Publisher: 9090
ms
[Pipeline] // withMaven
[Pipeline] cleanWs
[Pipeline] // withMaven
[Pipeline] cleanWs
[WS-CLEANUP] Deleting project workspace...
[WS-CLEANUP] Deferred wipeout is used...
[withMaven] openTasksPublisher - Scan Tasks for Maven artifact org.apache.maven.resolver:maven-resolver-api:jar:1.4.0-SNAPSHOT
in source directory m/maven-resolver-api/src/main/java
[WS-CLEANUP] Deleting project workspace...
[WS-CLEANUP] Deferred wipeout is used...
[withMaven] openTasksPublisher - Scan Tasks for Maven artifact org.apache.maven.resolver:maven-resolver-spi:jar:1.4.0-SNAPSHOT
in source directory m/maven-resolver-spi/src/main/java
[WS-CLEANUP] done
[Pipeline] }
[Pipeline] // stage
[Pipeline] }
[withMaven] openTasksPublisher - Scan Tasks for Maven artifact org.apache.maven.resolver:maven-resolver-test-util:jar:1.4.0-SNAPSHOT
in source directory m/maven-resolver-test-util/src/main/java
[Pipeline] // node
[Pipeline] }
[WS-CLEANUP] done
[Pipeline] }
[withMaven] openTasksPublisher - Scan Tasks for Maven artifact org.apache.maven.resolver:maven-resolver-util:jar:1.4.0-SNAPSHOT
in source directory m/maven-resolver-util/src/main/java
[Pipeline] // stage
[Pipeline] }
[Pipeline] // node
[Pipeline] }
[withMaven] openTasksPublisher - Scan Tasks for Maven artifact org.apache.maven.resolver:maven-resolver-impl:jar:1.4.0-SNAPSHOT
in source directory m/maven-resolver-impl/src/main/java
[withMaven] openTasksPublisher - Scan Tasks for Maven artifact org.apache.maven.resolver:maven-resolver-connector-basic:jar:1.4.0-SNAPSHOT
in source directory m/maven-resolver-connector-basic/src/main/java
[withMaven] openTasksPublisher - Scan Tasks for Maven artifact org.apache.maven.resolver:maven-resolver-transport-classpath:jar:1.4.0-SNAPSHOT
in source directory m/maven-resolver-transport-classpath/src/main/java
[withMaven] openTasksPublisher - Scan Tasks for Maven artifact org.apache.maven.resolver:maven-resolver-transport-file:jar:1.4.0-SNAPSHOT
in source directory m/maven-resolver-transport-file/src/main/java
[withMaven] openTasksPublisher - Scan Tasks for Maven artifact org.apache.maven.resolver:maven-resolver-transport-http:jar:1.4.0-SNAPSHOT
in source directory m/maven-resolver-transport-http/src/main/java
[withMaven] openTasksPublisher - Scan Tasks for Maven artifact org.apache.maven.resolver:maven-resolver-transport-wagon:jar:1.4.0-SNAPSHOT
in source directory m/maven-resolver-transport-wagon/src/main/java
[withMaven] openTasksPublisher - Scan Tasks for Maven artifact org.apache.maven.resolver:maven-resolver-demo-snippets:jar:1.4.0-SNAPSHOT
in source directory m/maven-resolver-demos/maven-resolver-demo-snippets/src/main/java
[withMaven] openTasksPublisher - Scan Tasks for Maven artifact org.apache.maven.resolver:maven-resolver-demo-maven-plugin:maven-plugin:1.4.0-SNAPSHOT
in source directory m/maven-resolver-demos/maven-resolver-demo-maven-plugin/src/main/java
[TASKS] Scanning folder '/home/jenkins/jenkins-slave/workspace/-box_maven-resolver_MRESOLVER-33'
for files matching the pattern 'm/maven-resolver-api/src/main/java/**/*,m/maven-resolver-spi/src/main/java/**/*,m/maven-resolver-test-util/src/main/java/**/*,m/maven-resolver-util/src/main/java/**/*,m/maven-resolver-impl/src/main/java/**/*,m/maven-resolver-connector-basic/src/main/java/**/*,m/maven-resolver-transport-classpath/src/main/java/**/*,m/maven-resolver-transport-file/src/main/java/**/*,m/maven-resolver-transport-http/src/main/java/**/*,m/maven-resolver-transport-wagon/src/main/java/**/*,m/maven-resolver-demos/maven-resolver-demo-snippets/src/main/java/**/*,m/maven-resolver-demos/maven-resolver-demo-maven-plugin/src/main/java/**/*'
- excludes: null
[TASKS] Found 417 files to scan for tasks
[TASKS] Found 0 open tasks.
Skipping warnings blame since pipelines do not have an SCM link.%n
[withMaven] Publishers: Pipeline Graph Publisher: 29 ms, Generated Artifacts Publisher: 12491
ms, Invoker Publisher: 9165 ms, Junit Publisher: 426603 ms, Concordion Publisher: 1 ms, Dependencies
Fingerprint Publisher: 8951 ms, Open Task Scanner Publisher: 2660 ms
[Pipeline] // withMaven
[Pipeline] cleanWs
[WS-CLEANUP] Deleting project workspace...
[WS-CLEANUP] Deferred wipeout is used...
[WS-CLEANUP] done
[Pipeline] }
[Pipeline] // stage
[Pipeline] }
[Pipeline] // node
[Pipeline] }
[Pipeline] // parallel
[Pipeline] echo
[FAILURE-001] hudson.remoting.ChannelClosedException: Channel "unknown": Remote call on JNLP4-connect
connection from 37.48.69.226/37.48.69.226:56320 failed. The channel is closing down or has
closed down
[Pipeline] stage
[Pipeline] { (Notifications)
[Pipeline] echo
Build result: FAILURE
[Pipeline] jiraIssueSelector
[Pipeline] emailext
Mime
  • Unnamed multipart/mixed (inline, None, 0 bytes)
View raw message