maven-notifications mailing list archives

Site index · List index
Message view « Date » · « Thread »
Top « Date » · « Thread »
From Apache Jenkins Server <jenk...@builds.apache.org>
Subject Build failed in Jenkins: Maven TLP » maven-surefire » SUREFIRE-1617 #12
Date Thu, 09 May 2019 01:18:20 GMT
See https://builds.apache.org/job/maven-box/job/maven-surefire/job/SUREFIRE-1617/12/

Changes:

* IT fix
* IT fix
* IT fix
* IT fix
* IT fix
* IT fix
* IT fix

1 tests failed.
FAILED:  org.apache.maven.surefire.its.UmlautDirIT.surefire1617

Error Message:
Exit code was non-zero: 1; command line and log = 
/home/jenkins/tools/maven/apache-maven-3.6.0/bin/mvn -e --batch-mode -Dmaven.repo.local=/home/jenkins/jenkins-slave/workspace/box_maven-surefire_SUREFIRE-1617@2/surefire-its/target/local repo for : SUREFIRE-1617 org.apache.maven.plugins:maven-clean-plugin:clean -Dsurefire.version=3.0.0-SNAPSHOT -Djacoco.agent=-javaagent:/home/jenkins/jenkins-slave/workspace/box_maven-surefire_SUREFIRE-1617@2/.m2/org/jacoco/org.jacoco.agent/0.8.3/org.jacoco.agent-0.8.3-runtime.jar=destfile=/home/jenkins/jenkins-slave/workspace/box_maven-surefire_SUREFIRE-1617@2/surefire-its/target/jacoco-it.exec,append=true,includes=**/failsafe/*:**/failsafe/**/*:**/surefire/*:**/surefire/**/*,inclnolocationclasses=true,jmx=false -Dhttps.protocols=TLSv1,TLSv1.1,TLSv1.2 test
[INFO] Error stacktraces are turned on.
[INFO] Scanning for projects...
[INFO] Downloading from central: https://repo.maven.apache.org/maven2/org/apache/maven/plugins/maven-clean-plugin/3.0.0/maven-clean-plugin-3.0.0.pom
[INFO] Downloaded from central: https://repo.maven.apache.org/maven2/org/apache/maven/plugins/maven-clean-plugin/3.0.0/maven-clean-plugin-3.0.0.pom (4.8 kB at 15 kB/s)
[INFO] Downloading from central: https://repo.maven.apache.org/maven2/org/apache/maven/plugins/maven-plugins/28/maven-plugins-28.pom
[INFO] Downloaded from central: https://repo.maven.apache.org/maven2/org/apache/maven/plugins/maven-plugins/28/maven-plugins-28.pom (12 kB at 547 kB/s)
[INFO] Downloading from central: https://repo.maven.apache.org/maven2/org/apache/maven/plugins/maven-clean-plugin/3.0.0/maven-clean-plugin-3.0.0.jar
[INFO] Downloaded from central: https://repo.maven.apache.org/maven2/org/apache/maven/plugins/maven-clean-plugin/3.0.0/maven-clean-plugin-3.0.0.jar (31 kB at 1.3 MB/s)
[INFO] 
[INFO] ------< org.apache.maven.plugins.surefire:junit-path-with-umlaut >------
[INFO] Building Test path with Ümlaut 1.0-SNAPSHOT
[INFO] --------------------------------[ jar ]---------------------------------
[INFO] Downloading from central: https://repo.maven.apache.org/maven2/org/apache/maven/plugins/maven-resources-plugin/2.6/maven-resources-plugin-2.6.pom
[INFO] Downloaded from central: https://repo.maven.apache.org/maven2/org/apache/maven/plugins/maven-resources-plugin/2.6/maven-resources-plugin-2.6.pom (8.1 kB at 451 kB/s)
[INFO] Downloading from central: https://repo.maven.apache.org/maven2/org/apache/maven/plugins/maven-plugins/23/maven-plugins-23.pom
[INFO] Downloaded from central: https://repo.maven.apache.org/maven2/org/apache/maven/plugins/maven-plugins/23/maven-plugins-23.pom (9.2 kB at 511 kB/s)
[INFO] Downloading from central: https://repo.maven.apache.org/maven2/org/apache/maven/plugins/maven-resources-plugin/2.6/maven-resources-plugin-2.6.jar
[INFO] Downloaded from central: https://repo.maven.apache.org/maven2/org/apache/maven/plugins/maven-resources-plugin/2.6/maven-resources-plugin-2.6.jar (30 kB at 1.6 MB/s)
[INFO] Downloading from central: https://repo.maven.apache.org/maven2/org/apache/maven/plugins/maven-compiler-plugin/3.1/maven-compiler-plugin-3.1.pom
[INFO] Downloaded from central: https://repo.maven.apache.org/maven2/org/apache/maven/plugins/maven-compiler-plugin/3.1/maven-compiler-plugin-3.1.pom (10 kB at 601 kB/s)
[INFO] Downloading from central: https://repo.maven.apache.org/maven2/org/apache/maven/plugins/maven-compiler-plugin/3.1/maven-compiler-plugin-3.1.jar
[INFO] Downloaded from central: https://repo.maven.apache.org/maven2/org/apache/maven/plugins/maven-compiler-plugin/3.1/maven-compiler-plugin-3.1.jar (43 kB at 2.0 MB/s)
[INFO] 
[INFO] --- maven-clean-plugin:3.0.0:clean (default-cli) @ junit-path-with-umlaut ---
[INFO] 
[INFO] --- maven-resources-plugin:2.6:resources (default-resources) @ junit-path-with-umlaut ---
[INFO] Downloading from central: https://repo.maven.apache.org/maven2/org/codehaus/plexus/plexus-interpolation/1.13/plexus-interpolation-1.13.pom
[INFO] Downloaded from central: https://repo.maven.apache.org/maven2/org/codehaus/plexus/plexus-interpolation/1.13/plexus-interpolation-1.13.pom (890 B at 59 kB/s)
[INFO] Downloading from central: https://repo.maven.apache.org/maven2/org/apache/maven/maven-plugin-api/2.0.6/maven-plugin-api-2.0.6.jar
[INFO] Downloading from central: https://repo.maven.apache.org/maven2/org/apache/maven/maven-project/2.0.6/maven-project-2.0.6.jar
[INFO] Downloading from central: https://repo.maven.apache.org/maven2/org/apache/maven/maven-artifact-manager/2.0.6/maven-artifact-manager-2.0.6.jar
[INFO] Downloading from central: https://repo.maven.apache.org/maven2/org/apache/maven/maven-plugin-registry/2.0.6/maven-plugin-registry-2.0.6.jar
[INFO] Downloading from central: https://repo.maven.apache.org/maven2/org/apache/maven/maven-profile/2.0.6/maven-profile-2.0.6.jar
[INFO] Downloaded from central: https://repo.maven.apache.org/maven2/org/apache/maven/maven-plugin-api/2.0.6/maven-plugin-api-2.0.6.jar (13 kB at 415 kB/s)
[INFO] Downloading from central: https://repo.maven.apache.org/maven2/org/apache/maven/maven-core/2.0.6/maven-core-2.0.6.jar
[INFO] Downloaded from central: https://repo.maven.apache.org/maven2/org/apache/maven/maven-profile/2.0.6/maven-profile-2.0.6.jar (35 kB at 476 kB/s)
[INFO] Downloading from central: https://repo.maven.apache.org/maven2/org/apache/maven/maven-plugin-parameter-documenter/2.0.6/maven-plugin-parameter-documenter-2.0.6.jar
[INFO] Downloaded from central: https://repo.maven.apache.org/maven2/org/apache/maven/maven-artifact-manager/2.0.6/maven-artifact-manager-2.0.6.jar (57 kB at 753 kB/s)
[INFO] Downloading from central: https://repo.maven.apache.org/maven2/org/apache/maven/reporting/maven-reporting-api/2.0.6/maven-reporting-api-2.0.6.jar
[INFO] Downloaded from central: https://repo.maven.apache.org/maven2/org/apache/maven/maven-project/2.0.6/maven-project-2.0.6.jar (116 kB at 1.3 MB/s)
[INFO] Downloading from central: https://repo.maven.apache.org/maven2/org/apache/maven/doxia/doxia-sink-api/1.0-alpha-7/doxia-sink-api-1.0-alpha-7.jar
[INFO] Downloaded from central: https://repo.maven.apache.org/maven2/org/apache/maven/maven-core/2.0.6/maven-core-2.0.6.jar (152 kB at 1.7 MB/s)
[INFO] Downloading from central: https://repo.maven.apache.org/maven2/org/apache/maven/maven-repository-metadata/2.0.6/maven-repository-metadata-2.0.6.jar
[INFO] Downloaded from central: https://repo.maven.apache.org/maven2/org/apache/maven/reporting/maven-reporting-api/2.0.6/maven-reporting-api-2.0.6.jar (9.9 kB at 108 kB/s)
[INFO] Downloading from central: https://repo.maven.apache.org/maven2/org/apache/maven/maven-error-diagnostics/2.0.6/maven-error-diagnostics-2.0.6.jar
[INFO] Downloaded from central: https://repo.maven.apache.org/maven2/org/apache/maven/maven-plugin-parameter-documenter/2.0.6/maven-plugin-parameter-documenter-2.0.6.jar (21 kB at 226 kB/s)
[INFO] Downloading from central: https://repo.maven.apache.org/maven2/commons-cli/commons-cli/1.0/commons-cli-1.0.jar
[INFO] Downloaded from central: https://repo.maven.apache.org/maven2/org/apache/maven/doxia/doxia-sink-api/1.0-alpha-7/doxia-sink-api-1.0-alpha-7.jar (5.9 kB at 62 kB/s)
[INFO] Downloading from central: https://repo.maven.apache.org/maven2/org/apache/maven/maven-plugin-descriptor/2.0.6/maven-plugin-descriptor-2.0.6.jar
[INFO] Downloaded from central: https://repo.maven.apache.org/maven2/org/apache/maven/maven-error-diagnostics/2.0.6/maven-error-diagnostics-2.0.6.jar (14 kB at 128 kB/s)
[INFO] Downloaded from central: https://repo.maven.apache.org/maven2/org/apache/maven/maven-repository-metadata/2.0.6/maven-repository-metadata-2.0.6.jar (24 kB at 231 kB/s)
[INFO] Downloading from central: https://repo.maven.apache.org/maven2/org/apache/maven/maven-artifact/2.0.6/maven-artifact-2.0.6.jar
[INFO] Downloading from central: https://repo.maven.apache.org/maven2/org/apache/maven/maven-settings/2.0.6/maven-settings-2.0.6.jar
[INFO] Downloaded from central: https://repo.maven.apache.org/maven2/commons-cli/commons-cli/1.0/commons-cli-1.0.jar (30 kB at 276 kB/s)
[INFO] Downloading from central: https://repo.maven.apache.org/maven2/org/apache/maven/maven-model/2.0.6/maven-model-2.0.6.jar
[INFO] Downloaded from central: https://repo.maven.apache.org/maven2/org/apache/maven/maven-plugin-descriptor/2.0.6/maven-plugin-descriptor-2.0.6.jar (37 kB at 321 kB/s)
[INFO] Downloading from central: https://repo.maven.apache.org/maven2/org/apache/maven/maven-monitor/2.0.6/maven-monitor-2.0.6.jar
[INFO] Downloaded from central: https://repo.maven.apache.org/maven2/org/apache/maven/maven-settings/2.0.6/maven-settings-2.0.6.jar (49 kB at 390 kB/s)
[INFO] Downloading from central: https://repo.maven.apache.org/maven2/org/codehaus/plexus/plexus-utils/2.0.5/plexus-utils-2.0.5.jar
[INFO] Downloaded from central: https://repo.maven.apache.org/maven2/org/apache/maven/maven-artifact/2.0.6/maven-artifact-2.0.6.jar (87 kB at 677 kB/s)
[INFO] Downloading from central: https://repo.maven.apache.org/maven2/org/codehaus/plexus/plexus-interpolation/1.13/plexus-interpolation-1.13.jar
[INFO] Downloaded from central: https://repo.maven.apache.org/maven2/org/apache/maven/maven-monitor/2.0.6/maven-monitor-2.0.6.jar (10 kB at 76 kB/s)
[INFO] Downloaded from central: https://repo.maven.apache.org/maven2/org/apache/maven/maven-plugin-registry/2.0.6/maven-plugin-registry-2.0.6.jar (29 kB at 210 kB/s)
[INFO] Downloaded from central: https://repo.maven.apache.org/maven2/org/apache/maven/maven-model/2.0.6/maven-model-2.0.6.jar (86 kB at 635 kB/s)
[INFO] Downloaded from central: https://repo.maven.apache.org/maven2/org/codehaus/plexus/plexus-interpolation/1.13/plexus-interpolation-1.13.jar (61 kB at 389 kB/s)
[INFO] Downloaded from central: https://repo.maven.apache.org/maven2/org/codehaus/plexus/plexus-utils/2.0.5/plexus-utils-2.0.5.jar (223 kB at 1.4 MB/s)
[WARNING] Using platform encoding (ISO-8859-1 actually) to copy filtered resources, i.e. build is platform dependent!
[INFO] skip non existing resourceDirectory /home/jenkins/jenkins-slave/workspace/box_maven-surefire_SUREFIRE-1617@2/surefire-its/target/UmlautDirIT_surefire1617/src/main/resources
[INFO] 
[INFO] --- maven-compiler-plugin:3.1:compile (default-compile) @ junit-path-with-umlaut ---
[INFO] Downloading from central: https://repo.maven.apache.org/maven2/org/apache/maven/maven-plugin-api/2.0.9/maven-plugin-api-2.0.9.pom
[INFO] Downloaded from central: https://repo.maven.apache.org/maven2/org/apache/maven/maven-plugin-api/2.0.9/maven-plugin-api-2.0.9.pom (1.5 kB at 100 kB/s)
[INFO] Downloading from central: https://repo.maven.apache.org/maven2/org/apache/maven/maven/2.0.9/maven-2.0.9.pom
[INFO] Downloaded from central: https://repo.maven.apache.org/maven2/org/apache/maven/maven/2.0.9/maven-2.0.9.pom (19 kB at 1.1 MB/s)
[INFO] Downloading from central: https://repo.maven.apache.org/maven2/org/apache/maven/maven-parent/8/maven-parent-8.pom
[INFO] Downloaded from central: https://repo.maven.apache.org/maven2/org/apache/maven/maven-parent/8/maven-parent-8.pom (24 kB at 1.5 MB/s)
[INFO] Downloading from central: https://repo.maven.apache.org/maven2/org/apache/maven/maven-artifact/2.0.9/maven-artifact-2.0.9.pom
[INFO] Downloaded from central: https://repo.maven.apache.org/maven2/org/apache/maven/maven-artifact/2.0.9/maven-artifact-2.0.9.pom (1.6 kB at 125 kB/s)
[INFO] Downloading from central: https://repo.maven.apache.org/maven2/org/apache/maven/maven-core/2.0.9/maven-core-2.0.9.pom
[INFO] Downloaded from central: https://repo.maven.apache.org/maven2/org/apache/maven/maven-core/2.0.9/maven-core-2.0.9.pom (7.8 kB at 487 kB/s)
[INFO] Downloading from central: https://repo.maven.apache.org/maven2/org/apache/maven/maven-settings/2.0.9/maven-settings-2.0.9.pom
[INFO] Downloaded from central: https://repo.maven.apache.org/maven2/org/apache/maven/maven-settings/2.0.9/maven-settings-2.0.9.pom (2.1 kB at 147 kB/s)
[INFO] Downloading from central: https://repo.maven.apache.org/maven2/org/apache/maven/maven-model/2.0.9/maven-model-2.0.9.pom
[INFO] Downloaded from central: https://repo.maven.apache.org/maven2/org/apache/maven/maven-model/2.0.9/maven-model-2.0.9.pom (3.1 kB at 224 kB/s)
[INFO] Downloading from central: https://repo.maven.apache.org/maven2/org/apache/maven/maven-plugin-parameter-documenter/2.0.9/maven-plugin-parameter-documenter-2.0.9.pom
[INFO] Downloaded from central: https://repo.maven.apache.org/maven2/org/apache/maven/maven-plugin-parameter-documenter/2.0.9/maven-plugin-parameter-documenter-2.0.9.pom (2.0 kB at 116 kB/s)
[INFO] Downloading from central: https://repo.maven.apache.org/maven2/org/apache/maven/maven-profile/2.0.9/maven-profile-2.0.9.pom
[INFO] Downloaded from central: https://repo.maven.apache.org/maven2/org/apache/maven/maven-profile/2.0.9/maven-profile-2.0.9.pom (2.0 kB at 146 kB/s)
[INFO] Downloading from central: https://repo.maven.apache.org/maven2/org/apache/maven/maven-repository-metadata/2.0.9/maven-repository-metadata-2.0.9.pom
[INFO] Downloaded from central: https://repo.maven.apache.org/maven2/org/apache/maven/maven-repository-metadata/2.0.9/maven-repository-metadata-2.0.9.pom (1.9 kB at 136 kB/s)
[INFO] Downloading from central: https://repo.maven.apache.org/maven2/org/apache/maven/maven-error-diagnostics/2.0.9/maven-error-diagnostics-2.0.9.pom
[INFO] Downloaded from central: https://repo.maven.apache.org/maven2/org/apache/maven/maven-error-diagnostics/2.0.9/maven-error-diagnostics-2.0.9.pom (1.7 kB at 134 kB/s)
[INFO] Downloading from central: https://repo.maven.apache.org/maven2/org/apache/maven/maven-project/2.0.9/maven-project-2.0.9.pom
[INFO] Downloaded from central: https://repo.maven.apache.org/maven2/org/apache/maven/maven-project/2.0.9/maven-project-2.0.9.pom (2.7 kB at 194 kB/s)
[INFO] Downloading from central: https://repo.maven.apache.org/maven2/org/apache/maven/maven-artifact-manager/2.0.9/maven-artifact-manager-2.0.9.pom
[INFO] Downloaded from central: https://repo.maven.apache.org/maven2/org/apache/maven/maven-artifact-manager/2.0.9/maven-artifact-manager-2.0.9.pom (2.7 kB at 180 kB/s)
[INFO] Downloading from central: https://repo.maven.apache.org/maven2/org/apache/maven/maven-plugin-registry/2.0.9/maven-plugin-registry-2.0.9.pom
[INFO] Downloaded from central: https://repo.maven.apache.org/maven2/org/apache/maven/maven-plugin-registry/2.0.9/maven-plugin-registry-2.0.9.pom (2.0 kB at 152 kB/s)
[INFO] Downloading from central: https://repo.maven.apache.org/maven2/org/apache/maven/maven-plugin-descriptor/2.0.9/maven-plugin-descriptor-2.0.9.pom
[INFO] Downloaded from central: https://repo.maven.apache.org/maven2/org/apache/maven/maven-plugin-descriptor/2.0.9/maven-plugin-descriptor-2.0.9.pom (2.1 kB at 138 kB/s)
[INFO] Downloading from central: https://repo.maven.apache.org/maven2/org/apache/maven/maven-monitor/2.0.9/maven-monitor-2.0.9.pom
[INFO] Downloaded from central: https://repo.maven.apache.org/maven2/org/apache/maven/maven-monitor/2.0.9/maven-monitor-2.0.9.pom (1.3 kB at 92 kB/s)
[INFO] Downloading from central: https://repo.maven.apache.org/maven2/org/apache/maven/maven-toolchain/1.0/maven-toolchain-1.0.pom
[INFO] Downloaded from central: https://repo.maven.apache.org/maven2/org/apache/maven/maven-toolchain/1.0/maven-toolchain-1.0.pom (3.4 kB at 213 kB/s)
[INFO] Downloading from central: https://repo.maven.apache.org/maven2/org/codehaus/plexus/plexus-compiler-api/2.2/plexus-compiler-api-2.2.pom
[INFO] Downloaded from central: https://repo.maven.apache.org/maven2/org/codehaus/plexus/plexus-compiler-api/2.2/plexus-compiler-api-2.2.pom (865 B at 62 kB/s)
[INFO] Downloading from central: https://repo.maven.apache.org/maven2/org/codehaus/plexus/plexus-compiler/2.2/plexus-compiler-2.2.pom
[INFO] Downloaded from central: https://repo.maven.apache.org/maven2/org/codehaus/plexus/plexus-compiler/2.2/plexus-compiler-2.2.pom (3.6 kB at 241 kB/s)
[INFO] Downloading from central: https://repo.maven.apache.org/maven2/org/codehaus/plexus/plexus-utils/3.0.8/plexus-utils-3.0.8.pom
[INFO] Downloaded from central: https://repo.maven.apache.org/maven2/org/codehaus/plexus/plexus-utils/3.0.8/plexus-utils-3.0.8.pom (3.1 kB at 165 kB/s)
[INFO] Downloading from central: https://repo.maven.apache.org/maven2/org/codehaus/plexus/plexus-compiler-manager/2.2/plexus-compiler-manager-2.2.pom
[INFO] Downloaded from central: https://repo.maven.apache.org/maven2/org/codehaus/plexus/plexus-compiler-manager/2.2/plexus-compiler-manager-2.2.pom (690 B at 53 kB/s)
[INFO] Downloading from central: https://repo.maven.apache.org/maven2/org/codehaus/plexus/plexus-compiler-javac/2.2/plexus-compiler-javac-2.2.pom
[INFO] Downloaded from central: https://repo.maven.apache.org/maven2/org/codehaus/plexus/plexus-compiler-javac/2.2/plexus-compiler-javac-2.2.pom (769 B at 59 kB/s)
[INFO] Downloading from central: https://repo.maven.apache.org/maven2/org/codehaus/plexus/plexus-compilers/2.2/plexus-compilers-2.2.pom
[INFO] Downloaded from central: https://repo.maven.apache.org/maven2/org/codehaus/plexus/plexus-compilers/2.2/plexus-compilers-2.2.pom (1.2 kB at 95 kB/s)
[INFO] Downloading from central: https://repo.maven.apache.org/maven2/org/apache/maven/maven-plugin-api/2.0.9/maven-plugin-api-2.0.9.jar
[INFO] Downloading from central: https://repo.maven.apache.org/maven2/org/apache/maven/maven-artifact/2.0.9/maven-artifact-2.0.9.jar
[INFO] Downloading from central: https://repo.maven.apache.org/maven2/org/codehaus/plexus/plexus-utils/1.5.1/plexus-utils-1.5.1.jar
[INFO] Downloading from central: https://repo.maven.apache.org/maven2/org/apache/maven/maven-core/2.0.9/maven-core-2.0.9.jar
[INFO] Downloading from central: https://repo.maven.apache.org/maven2/org/apache/maven/maven-settings/2.0.9/maven-settings-2.0.9.jar
[INFO] Downloaded from central: https://repo.maven.apache.org/maven2/org/apache/maven/maven-plugin-api/2.0.9/maven-plugin-api-2.0.9.jar (13 kB at 537 kB/s)
[INFO] Downloading from central: https://repo.maven.apache.org/maven2/org/apache/maven/maven-plugin-parameter-documenter/2.0.9/maven-plugin-parameter-documenter-2.0.9.jar
[INFO] Downloaded from central: https://repo.maven.apache.org/maven2/org/apache/maven/maven-settings/2.0.9/maven-settings-2.0.9.jar (49 kB at 1.8 MB/s)
[INFO] Downloading from central: https://repo.maven.apache.org/maven2/org/apache/maven/maven-profile/2.0.9/maven-profile-2.0.9.jar
[INFO] Downloaded from central: https://repo.maven.apache.org/maven2/org/apache/maven/maven-artifact/2.0.9/maven-artifact-2.0.9.jar (89 kB at 2.8 MB/s)
[INFO] Downloading from central: https://repo.maven.apache.org/maven2/org/apache/maven/maven-model/2.0.9/maven-model-2.0.9.jar
[INFO] Downloaded from central: https://repo.maven.apache.org/maven2/org/codehaus/plexus/plexus-utils/1.5.1/plexus-utils-1.5.1.jar (211 kB at 5.3 MB/s)
[INFO] Downloading from central: https://repo.maven.apache.org/maven2/org/apache/maven/maven-repository-metadata/2.0.9/maven-repository-metadata-2.0.9.jar
[INFO] Downloaded from central: https://repo.maven.apache.org/maven2/org/apache/maven/maven-plugin-parameter-documenter/2.0.9/maven-plugin-parameter-documenter-2.0.9.jar (21 kB at 522 kB/s)
[INFO] Downloading from central: https://repo.maven.apache.org/maven2/org/apache/maven/maven-error-diagnostics/2.0.9/maven-error-diagnostics-2.0.9.jar
[INFO] Downloaded from central: https://repo.maven.apache.org/maven2/org/apache/maven/maven-core/2.0.9/maven-core-2.0.9.jar (160 kB at 3.6 MB/s)
[INFO] Downloading from central: https://repo.maven.apache.org/maven2/org/apache/maven/maven-project/2.0.9/maven-project-2.0.9.jar
[INFO] Downloaded from central: https://repo.maven.apache.org/maven2/org/apache/maven/maven-repository-metadata/2.0.9/maven-repository-metadata-2.0.9.jar (25 kB at 472 kB/s)
[INFO] Downloading from central: https://repo.maven.apache.org/maven2/org/apache/maven/maven-plugin-registry/2.0.9/maven-plugin-registry-2.0.9.jar
[INFO] Downloaded from central: https://repo.maven.apache.org/maven2/org/apache/maven/maven-model/2.0.9/maven-model-2.0.9.jar (87 kB at 1.6 MB/s)
[INFO] Downloading from central: https://repo.maven.apache.org/maven2/org/apache/maven/maven-plugin-descriptor/2.0.9/maven-plugin-descriptor-2.0.9.jar
[INFO] Downloaded from central: https://repo.maven.apache.org/maven2/org/apache/maven/maven-profile/2.0.9/maven-profile-2.0.9.jar (35 kB at 655 kB/s)
[INFO] Downloading from central: https://repo.maven.apache.org/maven2/org/apache/maven/maven-artifact-manager/2.0.9/maven-artifact-manager-2.0.9.jar
[INFO] Downloaded from central: https://repo.maven.apache.org/maven2/org/apache/maven/maven-error-diagnostics/2.0.9/maven-error-diagnostics-2.0.9.jar (14 kB at 251 kB/s)
[INFO] Downloading from central: https://repo.maven.apache.org/maven2/org/apache/maven/maven-monitor/2.0.9/maven-monitor-2.0.9.jar
[INFO] Downloaded from central: https://repo.maven.apache.org/maven2/org/apache/maven/maven-plugin-registry/2.0.9/maven-plugin-registry-2.0.9.jar (29 kB at 428 kB/s)
[INFO] Downloading from central: https://repo.maven.apache.org/maven2/org/apache/maven/maven-toolchain/1.0/maven-toolchain-1.0.jar
[INFO] Downloaded from central: https://repo.maven.apache.org/maven2/org/apache/maven/maven-plugin-descriptor/2.0.9/maven-plugin-descriptor-2.0.9.jar (37 kB at 529 kB/s)
[INFO] Downloading from central: https://repo.maven.apache.org/maven2/org/apache/maven/shared/maven-shared-utils/0.1/maven-shared-utils-0.1.jar
[INFO] Downloaded from central: https://repo.maven.apache.org/maven2/org/apache/maven/maven-project/2.0.9/maven-project-2.0.9.jar (122 kB at 1.7 MB/s)
[INFO] Downloading from central: https://repo.maven.apache.org/maven2/org/codehaus/plexus/plexus-compiler-api/2.2/plexus-compiler-api-2.2.jar
[INFO] Downloaded from central: https://repo.maven.apache.org/maven2/org/apache/maven/maven-monitor/2.0.9/maven-monitor-2.0.9.jar (10 kB at 143 kB/s)
[INFO] Downloaded from central: https://repo.maven.apache.org/maven2/org/apache/maven/maven-artifact-manager/2.0.9/maven-artifact-manager-2.0.9.jar (58 kB at 792 kB/s)
[INFO] Downloading from central: https://repo.maven.apache.org/maven2/org/codehaus/plexus/plexus-compiler-javac/2.2/plexus-compiler-javac-2.2.jar
[INFO] Downloading from central: https://repo.maven.apache.org/maven2/org/codehaus/plexus/plexus-compiler-manager/2.2/plexus-compiler-manager-2.2.jar
[INFO] Downloaded from central: https://repo.maven.apache.org/maven2/org/apache/maven/maven-toolchain/1.0/maven-toolchain-1.0.jar (33 kB at 366 kB/s)
[INFO] Downloading from central: https://repo.maven.apache.org/maven2/org/codehaus/plexus/plexus-container-default/1.5.5/plexus-container-default-1.5.5.jar
[INFO] Downloaded from central: https://repo.maven.apache.org/maven2/org/codehaus/plexus/plexus-compiler-api/2.2/plexus-compiler-api-2.2.jar (25 kB at 278 kB/s)
[INFO] Downloading from central: https://repo.maven.apache.org/maven2/org/codehaus/plexus/plexus-classworlds/2.2.2/plexus-classworlds-2.2.2.jar
[INFO] Downloaded from central: https://repo.maven.apache.org/maven2/org/codehaus/plexus/plexus-compiler-javac/2.2/plexus-compiler-javac-2.2.jar (19 kB at 204 kB/s)
[INFO] Downloading from central: https://repo.maven.apache.org/maven2/org/apache/xbean/xbean-reflect/3.4/xbean-reflect-3.4.jar
[INFO] Downloaded from central: https://repo.maven.apache.org/maven2/org/codehaus/plexus/plexus-compiler-manager/2.2/plexus-compiler-manager-2.2.jar (4.6 kB at 49 kB/s)
[INFO] Downloading from central: https://repo.maven.apache.org/maven2/log4j/log4j/1.2.12/log4j-1.2.12.jar
[INFO] Downloaded from central: https://repo.maven.apache.org/maven2/org/apache/maven/shared/maven-shared-utils/0.1/maven-shared-utils-0.1.jar (155 kB at 1.5 MB/s)
[INFO] Downloading from central: https://repo.maven.apache.org/maven2/commons-logging/commons-logging-api/1.1/commons-logging-api-1.1.jar
[INFO] Downloaded from central: https://repo.maven.apache.org/maven2/org/codehaus/plexus/plexus-classworlds/2.2.2/plexus-classworlds-2.2.2.jar (46 kB at 408 kB/s)
[INFO] Downloaded from central: https://repo.maven.apache.org/maven2/commons-logging/commons-logging-api/1.1/commons-logging-api-1.1.jar (45 kB at 354 kB/s)
[INFO] Downloaded from central: https://repo.maven.apache.org/maven2/org/apache/xbean/xbean-reflect/3.4/xbean-reflect-3.4.jar (134 kB at 1.1 MB/s)
[INFO] Downloaded from central: https://repo.maven.apache.org/maven2/org/codehaus/plexus/plexus-container-default/1.5.5/plexus-container-default-1.5.5.jar (217 kB at 1.7 MB/s)
[INFO] Downloaded from central: https://repo.maven.apache.org/maven2/log4j/log4j/1.2.12/log4j-1.2.12.jar (358 kB at 2.3 MB/s)
[INFO] No sources to compile
[INFO] 
[INFO] --- maven-resources-plugin:2.6:testResources (default-testResources) @ junit-path-with-umlaut ---
[WARNING] Using platform encoding (ISO-8859-1 actually) to copy filtered resources, i.e. build is platform dependent!
[INFO] skip non existing resourceDirectory /home/jenkins/jenkins-slave/workspace/box_maven-surefire_SUREFIRE-1617@2/surefire-its/target/UmlautDirIT_surefire1617/src/test/resources
[INFO] 
[INFO] --- maven-compiler-plugin:3.1:testCompile (default-testCompile) @ junit-path-with-umlaut ---
[INFO] Changes detected - recompiling the module!
[WARNING] File encoding has not been set, using platform encoding ISO-8859-1, i.e. build is platform dependent!
[INFO] Compiling 1 source file to /home/jenkins/jenkins-slave/workspace/box_maven-surefire_SUREFIRE-1617@2/surefire-its/target/UmlautDirIT_surefire1617/target/test-classes
[INFO] -------------------------------------------------------------
[ERROR] COMPILATION ERROR : 
[INFO] -------------------------------------------------------------
[ERROR] /home/jenkins/jenkins-slave/workspace/box_maven-surefire_SUREFIRE-1617@2/surefire-its/target/UmlautDirIT_surefire1617/src/test/java/umlautTest/BasicTest.java:[23,24] package junit.extensions does not exist
[ERROR] /home/jenkins/jenkins-slave/workspace/box_maven-surefire_SUREFIRE-1617@2/surefire-its/target/UmlautDirIT_surefire1617/src/test/java/umlautTest/BasicTest.java:[24,23] package junit.framework does not exist
[ERROR] /home/jenkins/jenkins-slave/workspace/box_maven-surefire_SUREFIRE-1617@2/surefire-its/target/UmlautDirIT_surefire1617/src/test/java/umlautTest/BasicTest.java:[25,23] package junit.framework does not exist
[ERROR] /home/jenkins/jenkins-slave/workspace/box_maven-surefire_SUREFIRE-1617@2/surefire-its/target/UmlautDirIT_surefire1617/src/test/java/umlautTest/BasicTest.java:[26,23] package junit.framework does not exist
[ERROR] /home/jenkins/jenkins-slave/workspace/box_maven-surefire_SUREFIRE-1617@2/surefire-its/target/UmlautDirIT_surefire1617/src/test/java/umlautTest/BasicTest.java:[29,13] cannot find symbol
  symbol: class TestCase
[ERROR] /home/jenkins/jenkins-slave/workspace/box_maven-surefire_SUREFIRE-1617@2/surefire-its/target/UmlautDirIT_surefire1617/src/test/java/umlautTest/BasicTest.java:[41,19] cannot find symbol
  symbol:   class Test
  location: class umlautTest.BasicTest
[ERROR] /home/jenkins/jenkins-slave/workspace/box_maven-surefire_SUREFIRE-1617@2/surefire-its/target/UmlautDirIT_surefire1617/src/test/java/umlautTest/BasicTest.java:[43,9] cannot find symbol
  symbol:   class TestSuite
  location: class umlautTest.BasicTest
[ERROR] /home/jenkins/jenkins-slave/workspace/box_maven-surefire_SUREFIRE-1617@2/surefire-its/target/UmlautDirIT_surefire1617/src/test/java/umlautTest/BasicTest.java:[43,31] cannot find symbol
  symbol:   class TestSuite
  location: class umlautTest.BasicTest
[ERROR] /home/jenkins/jenkins-slave/workspace/box_maven-surefire_SUREFIRE-1617@2/surefire-its/target/UmlautDirIT_surefire1617/src/test/java/umlautTest/BasicTest.java:[44,9] cannot find symbol
  symbol:   class Test
  location: class umlautTest.BasicTest
[ERROR] /home/jenkins/jenkins-slave/workspace/box_maven-surefire_SUREFIRE-1617@2/surefire-its/target/UmlautDirIT_surefire1617/src/test/java/umlautTest/BasicTest.java:[47,20] cannot find symbol
  symbol:   class TestSetup
  location: class umlautTest.BasicTest
[ERROR] /home/jenkins/jenkins-slave/workspace/box_maven-surefire_SUREFIRE-1617@2/surefire-its/target/UmlautDirIT_surefire1617/src/test/java/umlautTest/BasicTest.java:[79,9] cannot find symbol
  symbol:   method assertTrue(java.lang.String,boolean)
  location: class umlautTest.BasicTest
[ERROR] /home/jenkins/jenkins-slave/workspace/box_maven-surefire_SUREFIRE-1617@2/surefire-its/target/UmlautDirIT_surefire1617/src/test/java/umlautTest/BasicTest.java:[84,9] cannot find symbol
  symbol:   method assertTrue(java.lang.String,boolean)
  location: class umlautTest.BasicTest
[INFO] 12 errors 
[INFO] -------------------------------------------------------------
[INFO] ------------------------------------------------------------------------
[INFO] BUILD FAILURE
[INFO] ------------------------------------------------------------------------
[INFO] Total time:  3.001 s
[INFO] Finished at: 2019-05-09T01:12:32Z
[INFO] ------------------------------------------------------------------------
[ERROR] Failed to execute goal org.apache.maven.plugins:maven-compiler-plugin:3.1:testCompile (default-testCompile) on project junit-path-with-umlaut: Compilation failure: Compilation failure: 
[ERROR] /home/jenkins/jenkins-slave/workspace/box_maven-surefire_SUREFIRE-1617@2/surefire-its/target/UmlautDirIT_surefire1617/src/test/java/umlautTest/BasicTest.java:[23,24] package junit.extensions does not exist
[ERROR] /home/jenkins/jenkins-slave/workspace/box_maven-surefire_SUREFIRE-1617@2/surefire-its/target/UmlautDirIT_surefire1617/src/test/java/umlautTest/BasicTest.java:[24,23] package junit.framework does not exist
[ERROR] /home/jenkins/jenkins-slave/workspace/box_maven-surefire_SUREFIRE-1617@2/surefire-its/target/UmlautDirIT_surefire1617/src/test/java/umlautTest/BasicTest.java:[25,23] package junit.framework does not exist
[ERROR] /home/jenkins/jenkins-slave/workspace/box_maven-surefire_SUREFIRE-1617@2/surefire-its/target/UmlautDirIT_surefire1617/src/test/java/umlautTest/BasicTest.java:[26,23] package junit.framework does not exist
[ERROR] /home/jenkins/jenkins-slave/workspace/box_maven-surefire_SUREFIRE-1617@2/surefire-its/target/UmlautDirIT_surefire1617/src/test/java/umlautTest/BasicTest.java:[29,13] cannot find symbol
[ERROR]   symbol: class TestCase
[ERROR] /home/jenkins/jenkins-slave/workspace/box_maven-surefire_SUREFIRE-1617@2/surefire-its/target/UmlautDirIT_surefire1617/src/test/java/umlautTest/BasicTest.java:[41,19] cannot find symbol
[ERROR]   symbol:   class Test
[ERROR]   location: class umlautTest.BasicTest
[ERROR] /home/jenkins/jenkins-slave/workspace/box_maven-surefire_SUREFIRE-1617@2/surefire-its/target/UmlautDirIT_surefire1617/src/test/java/umlautTest/BasicTest.java:[43,9] cannot find symbol
[ERROR]   symbol:   class TestSuite
[ERROR]   location: class umlautTest.BasicTest
[ERROR] /home/jenkins/jenkins-slave/workspace/box_maven-surefire_SUREFIRE-1617@2/surefire-its/target/UmlautDirIT_surefire1617/src/test/java/umlautTest/BasicTest.java:[43,31] cannot find symbol
[ERROR]   symbol:   class TestSuite
[ERROR]   location: class umlautTest.BasicTest
[ERROR] /home/jenkins/jenkins-slave/workspace/box_maven-surefire_SUREFIRE-1617@2/surefire-its/target/UmlautDirIT_surefire1617/src/test/java/umlautTest/BasicTest.java:[44,9] cannot find symbol
[ERROR]   symbol:   class Test
[ERROR]   location: class umlautTest.BasicTest
[ERROR] /home/jenkins/jenkins-slave/workspace/box_maven-surefire_SUREFIRE-1617@2/surefire-its/target/UmlautDirIT_surefire1617/src/test/java/umlautTest/BasicTest.java:[47,20] cannot find symbol
[ERROR]   symbol:   class TestSetup
[ERROR]   location: class umlautTest.BasicTest
[ERROR] /home/jenkins/jenkins-slave/workspace/box_maven-surefire_SUREFIRE-1617@2/surefire-its/target/UmlautDirIT_surefire1617/src/test/java/umlautTest/BasicTest.java:[79,9] cannot find symbol
[ERROR]   symbol:   method assertTrue(java.lang.String,boolean)
[ERROR]   location: class umlautTest.BasicTest
[ERROR] /home/jenkins/jenkins-slave/workspace/box_maven-surefire_SUREFIRE-1617@2/surefire-its/target/UmlautDirIT_surefire1617/src/test/java/umlautTest/BasicTest.java:[84,9] cannot find symbol
[ERROR]   symbol:   method assertTrue(java.lang.String,boolean)
[ERROR]   location: class umlautTest.BasicTest
[ERROR] -> [Help 1]
org.apache.maven.lifecycle.LifecycleExecutionException: Failed to execute goal org.apache.maven.plugins:maven-compiler-plugin:3.1:testCompile (default-testCompile) on project junit-path-with-umlaut: Compilation failure
    at org.apache.maven.lifecycle.internal.MojoExecutor.execute (MojoExecutor.java:215)
    at org.apache.maven.lifecycle.internal.MojoExecutor.execute (MojoExecutor.java:156)
    at org.apache.maven.lifecycle.internal.MojoExecutor.execute (MojoExecutor.java:148)
    at org.apache.maven.lifecycle.internal.LifecycleModuleBuilder.buildProject (LifecycleModuleBuilder.java:117)
    at org.apache.maven.lifecycle.internal.LifecycleModuleBuilder.buildProject (LifecycleModuleBuilder.java:81)
    at org.apache.maven.lifecycle.internal.builder.singlethreaded.SingleThreadedBuilder.build (SingleThreadedBuilder.java:56)
    at org.apache.maven.lifecycle.internal.LifecycleStarter.execute (LifecycleStarter.java:128)
    at org.apache.maven.DefaultMaven.doExecute (DefaultMaven.java:305)
    at org.apache.maven.DefaultMaven.doExecute (DefaultMaven.java:192)
    at org.apache.maven.DefaultMaven.execute (DefaultMaven.java:105)
    at org.apache.maven.cli.MavenCli.execute (MavenCli.java:956)
    at org.apache.maven.cli.MavenCli.doMain (MavenCli.java:288)
    at org.apache.maven.cli.MavenCli.main (MavenCli.java:192)
    at jdk.internal.reflect.NativeMethodAccessorImpl.invoke0 (Native Method)
    at jdk.internal.reflect.NativeMethodAccessorImpl.invoke (NativeMethodAccessorImpl.java:62)
    at jdk.internal.reflect.DelegatingMethodAccessorImpl.invoke (DelegatingMethodAccessorImpl.java:43)
    at java.lang.reflect.Method.invoke (Method.java:567)
    at org.codehaus.plexus.classworlds.launcher.Launcher.launchEnhanced (Launcher.java:289)
    at org.codehaus.plexus.classworlds.launcher.Launcher.launch (Launcher.java:229)
    at org.codehaus.plexus.classworlds.launcher.Launcher.mainWithExitCode (Launcher.java:415)
    at org.codehaus.plexus.classworlds.launcher.Launcher.main (Launcher.java:356)
Caused by: org.apache.maven.plugin.compiler.CompilationFailureException: Compilation failure
    at org.apache.maven.plugin.compiler.AbstractCompilerMojo.execute (AbstractCompilerMojo.java:858)
    at org.apache.maven.plugin.compiler.TestCompilerMojo.execute (TestCompilerMojo.java:152)
    at org.apache.maven.plugin.DefaultBuildPluginManager.executeMojo (DefaultBuildPluginManager.java:137)
    at org.apache.maven.lifecycle.internal.MojoExecutor.execute (MojoExecutor.java:210)
    at org.apache.maven.lifecycle.internal.MojoExecutor.execute (MojoExecutor.java:156)
    at org.apache.maven.lifecycle.internal.MojoExecutor.execute (MojoExecutor.java:148)
    at org.apache.maven.lifecycle.internal.LifecycleModuleBuilder.buildProject (LifecycleModuleBuilder.java:117)
    at org.apache.maven.lifecycle.internal.LifecycleModuleBuilder.buildProject (LifecycleModuleBuilder.java:81)
    at org.apache.maven.lifecycle.internal.builder.singlethreaded.SingleThreadedBuilder.build (SingleThreadedBuilder.java:56)
    at org.apache.maven.lifecycle.internal.LifecycleStarter.execute (LifecycleStarter.java:128)
    at org.apache.maven.DefaultMaven.doExecute (DefaultMaven.java:305)
    at org.apache.maven.DefaultMaven.doExecute (DefaultMaven.java:192)
    at org.apache.maven.DefaultMaven.execute (DefaultMaven.java:105)
    at org.apache.maven.cli.MavenCli.execute (MavenCli.java:956)
    at org.apache.maven.cli.MavenCli.doMain (MavenCli.java:288)
    at org.apache.maven.cli.MavenCli.main (MavenCli.java:192)
    at jdk.internal.reflect.NativeMethodAccessorImpl.invoke0 (Native Method)
    at jdk.internal.reflect.NativeMethodAccessorImpl.invoke (NativeMethodAccessorImpl.java:62)
    at jdk.internal.reflect.DelegatingMethodAccessorImpl.invoke (DelegatingMethodAccessorImpl.java:43)
    at java.lang.reflect.Method.invoke (Method.java:567)
    at org.codehaus.plexus.classworlds.launcher.Launcher.launchEnhanced (Launcher.java:289)
    at org.codehaus.plexus.classworlds.launcher.Launcher.launch (Launcher.java:229)
    at org.codehaus.plexus.classworlds.launcher.Launcher.mainWithExitCode (Launcher.java:415)
    at org.codehaus.plexus.classworlds.launcher.Launcher.main (Launcher.java:356)
[ERROR] 
[ERROR] Re-run Maven using the -X switch to enable full debug logging.
[ERROR] 
[ERROR] For more information about the errors and possible solutions, please read the following articles:
[ERROR] [Help 1] http://cwiki.apache.org/confluence/display/MAVEN/MojoFailureException


Stack Trace:
org.apache.maven.surefire.its.fixture.SurefireVerifierException: 
Exit code was non-zero: 1; command line and log = 
/home/jenkins/tools/maven/apache-maven-3.6.0/bin/mvn -e --batch-mode -Dmaven.repo.local=/home/jenkins/jenkins-slave/workspace/box_maven-surefire_SUREFIRE-1617@2/surefire-its/target/local repo for : SUREFIRE-1617 org.apache.maven.plugins:maven-clean-plugin:clean -Dsurefire.version=3.0.0-SNAPSHOT -Djacoco.agent=-javaagent:/home/jenkins/jenkins-slave/workspace/box_maven-surefire_SUREFIRE-1617@2/.m2/org/jacoco/org.jacoco.agent/0.8.3/org.jacoco.agent-0.8.3-runtime.jar=destfile=/home/jenkins/jenkins-slave/workspace/box_maven-surefire_SUREFIRE-1617@2/surefire-its/target/jacoco-it.exec,append=true,includes=**/failsafe/*:**/failsafe/**/*:**/surefire/*:**/surefire/**/*,inclnolocationclasses=true,jmx=false -Dhttps.protocols=TLSv1,TLSv1.1,TLSv1.2 test
[INFO] Error stacktraces are turned on.
[INFO] Scanning for projects...
[INFO] Downloading from central: https://repo.maven.apache.org/maven2/org/apache/maven/plugins/maven-clean-plugin/3.0.0/maven-clean-plugin-3.0.0.pom
[INFO] Downloaded from central: https://repo.maven.apache.org/maven2/org/apache/maven/plugins/maven-clean-plugin/3.0.0/maven-clean-plugin-3.0.0.pom (4.8 kB at 15 kB/s)
[INFO] Downloading from central: https://repo.maven.apache.org/maven2/org/apache/maven/plugins/maven-plugins/28/maven-plugins-28.pom
[INFO] Downloaded from central: https://repo.maven.apache.org/maven2/org/apache/maven/plugins/maven-plugins/28/maven-plugins-28.pom (12 kB at 547 kB/s)
[INFO] Downloading from central: https://repo.maven.apache.org/maven2/org/apache/maven/plugins/maven-clean-plugin/3.0.0/maven-clean-plugin-3.0.0.jar
[INFO] Downloaded from central: https://repo.maven.apache.org/maven2/org/apache/maven/plugins/maven-clean-plugin/3.0.0/maven-clean-plugin-3.0.0.jar (31 kB at 1.3 MB/s)
[INFO] 
[INFO] ------< org.apache.maven.plugins.surefire:junit-path-with-umlaut >------
[INFO] Building Test path with Ümlaut 1.0-SNAPSHOT
[INFO] --------------------------------[ jar ]---------------------------------
[INFO] Downloading from central: https://repo.maven.apache.org/maven2/org/apache/maven/plugins/maven-resources-plugin/2.6/maven-resources-plugin-2.6.pom
[INFO] Downloaded from central: https://repo.maven.apache.org/maven2/org/apache/maven/plugins/maven-resources-plugin/2.6/maven-resources-plugin-2.6.pom (8.1 kB at 451 kB/s)
[INFO] Downloading from central: https://repo.maven.apache.org/maven2/org/apache/maven/plugins/maven-plugins/23/maven-plugins-23.pom
[INFO] Downloaded from central: https://repo.maven.apache.org/maven2/org/apache/maven/plugins/maven-plugins/23/maven-plugins-23.pom (9.2 kB at 511 kB/s)
[INFO] Downloading from central: https://repo.maven.apache.org/maven2/org/apache/maven/plugins/maven-resources-plugin/2.6/maven-resources-plugin-2.6.jar
[INFO] Downloaded from central: https://repo.maven.apache.org/maven2/org/apache/maven/plugins/maven-resources-plugin/2.6/maven-resources-plugin-2.6.jar (30 kB at 1.6 MB/s)
[INFO] Downloading from central: https://repo.maven.apache.org/maven2/org/apache/maven/plugins/maven-compiler-plugin/3.1/maven-compiler-plugin-3.1.pom
[INFO] Downloaded from central: https://repo.maven.apache.org/maven2/org/apache/maven/plugins/maven-compiler-plugin/3.1/maven-compiler-plugin-3.1.pom (10 kB at 601 kB/s)
[INFO] Downloading from central: https://repo.maven.apache.org/maven2/org/apache/maven/plugins/maven-compiler-plugin/3.1/maven-compiler-plugin-3.1.jar
[INFO] Downloaded from central: https://repo.maven.apache.org/maven2/org/apache/maven/plugins/maven-compiler-plugin/3.1/maven-compiler-plugin-3.1.jar (43 kB at 2.0 MB/s)
[INFO] 
[INFO] --- maven-clean-plugin:3.0.0:clean (default-cli) @ junit-path-with-umlaut ---
[INFO] 
[INFO] --- maven-resources-plugin:2.6:resources (default-resources) @ junit-path-with-umlaut ---
[INFO] Downloading from central: https://repo.maven.apache.org/maven2/org/codehaus/plexus/plexus-interpolation/1.13/plexus-interpolation-1.13.pom
[INFO] Downloaded from central: https://repo.maven.apache.org/maven2/org/codehaus/plexus/plexus-interpolation/1.13/plexus-interpolation-1.13.pom (890 B at 59 kB/s)
[INFO] Downloading from central: https://repo.maven.apache.org/maven2/org/apache/maven/maven-plugin-api/2.0.6/maven-plugin-api-2.0.6.jar
[INFO] Downloading from central: https://repo.maven.apache.org/maven2/org/apache/maven/maven-project/2.0.6/maven-project-2.0.6.jar
[INFO] Downloading from central: https://repo.maven.apache.org/maven2/org/apache/maven/maven-artifact-manager/2.0.6/maven-artifact-manager-2.0.6.jar
[INFO] Downloading from central: https://repo.maven.apache.org/maven2/org/apache/maven/maven-plugin-registry/2.0.6/maven-plugin-registry-2.0.6.jar
[INFO] Downloading from central: https://repo.maven.apache.org/maven2/org/apache/maven/maven-profile/2.0.6/maven-profile-2.0.6.jar
[INFO] Downloaded from central: https://repo.maven.apache.org/maven2/org/apache/maven/maven-plugin-api/2.0.6/maven-plugin-api-2.0.6.jar (13 kB at 415 kB/s)
[INFO] Downloading from central: https://repo.maven.apache.org/maven2/org/apache/maven/maven-core/2.0.6/maven-core-2.0.6.jar
[INFO] Downloaded from central: https://repo.maven.apache.org/maven2/org/apache/maven/maven-profile/2.0.6/maven-profile-2.0.6.jar (35 kB at 476 kB/s)
[INFO] Downloading from central: https://repo.maven.apache.org/maven2/org/apache/maven/maven-plugin-parameter-documenter/2.0.6/maven-plugin-parameter-documenter-2.0.6.jar
[INFO] Downloaded from central: https://repo.maven.apache.org/maven2/org/apache/maven/maven-artifact-manager/2.0.6/maven-artifact-manager-2.0.6.jar (57 kB at 753 kB/s)
[INFO] Downloading from central: https://repo.maven.apache.org/maven2/org/apache/maven/reporting/maven-reporting-api/2.0.6/maven-reporting-api-2.0.6.jar
[INFO] Downloaded from central: https://repo.maven.apache.org/maven2/org/apache/maven/maven-project/2.0.6/maven-project-2.0.6.jar (116 kB at 1.3 MB/s)
[INFO] Downloading from central: https://repo.maven.apache.org/maven2/org/apache/maven/doxia/doxia-sink-api/1.0-alpha-7/doxia-sink-api-1.0-alpha-7.jar
[INFO] Downloaded from central: https://repo.maven.apache.org/maven2/org/apache/maven/maven-core/2.0.6/maven-core-2.0.6.jar (152 kB at 1.7 MB/s)
[INFO] Downloading from central: https://repo.maven.apache.org/maven2/org/apache/maven/maven-repository-metadata/2.0.6/maven-repository-metadata-2.0.6.jar
[INFO] Downloaded from central: https://repo.maven.apache.org/maven2/org/apache/maven/reporting/maven-reporting-api/2.0.6/maven-reporting-api-2.0.6.jar (9.9 kB at 108 kB/s)
[INFO] Downloading from central: https://repo.maven.apache.org/maven2/org/apache/maven/maven-error-diagnostics/2.0.6/maven-error-diagnostics-2.0.6.jar
[INFO] Downloaded from central: https://repo.maven.apache.org/maven2/org/apache/maven/maven-plugin-parameter-documenter/2.0.6/maven-plugin-parameter-documenter-2.0.6.jar (21 kB at 226 kB/s)
[INFO] Downloading from central: https://repo.maven.apache.org/maven2/commons-cli/commons-cli/1.0/commons-cli-1.0.jar
[INFO] Downloaded from central: https://repo.maven.apache.org/maven2/org/apache/maven/doxia/doxia-sink-api/1.0-alpha-7/doxia-sink-api-1.0-alpha-7.jar (5.9 kB at 62 kB/s)
[INFO] Downloading from central: https://repo.maven.apache.org/maven2/org/apache/maven/maven-plugin-descriptor/2.0.6/maven-plugin-descriptor-2.0.6.jar
[INFO] Downloaded from central: https://repo.maven.apache.org/maven2/org/apache/maven/maven-error-diagnostics/2.0.6/maven-error-diagnostics-2.0.6.jar (14 kB at 128 kB/s)
[INFO] Downloaded from central: https://repo.maven.apache.org/maven2/org/apache/maven/maven-repository-metadata/2.0.6/maven-repository-metadata-2.0.6.jar (24 kB at 231 kB/s)
[INFO] Downloading from central: https://repo.maven.apache.org/maven2/org/apache/maven/maven-artifact/2.0.6/maven-artifact-2.0.6.jar
[INFO] Downloading from central: https://repo.maven.apache.org/maven2/org/apache/maven/maven-settings/2.0.6/maven-settings-2.0.6.jar
[INFO] Downloaded from central: https://repo.maven.apache.org/maven2/commons-cli/commons-cli/1.0/commons-cli-1.0.jar (30 kB at 276 kB/s)
[INFO] Downloading from central: https://repo.maven.apache.org/maven2/org/apache/maven/maven-model/2.0.6/maven-model-2.0.6.jar
[INFO] Downloaded from central: https://repo.maven.apache.org/maven2/org/apache/maven/maven-plugin-descriptor/2.0.6/maven-plugin-descriptor-2.0.6.jar (37 kB at 321 kB/s)
[INFO] Downloading from central: https://repo.maven.apache.org/maven2/org/apache/maven/maven-monitor/2.0.6/maven-monitor-2.0.6.jar
[INFO] Downloaded from central: https://repo.maven.apache.org/maven2/org/apache/maven/maven-settings/2.0.6/maven-settings-2.0.6.jar (49 kB at 390 kB/s)
[INFO] Downloading from central: https://repo.maven.apache.org/maven2/org/codehaus/plexus/plexus-utils/2.0.5/plexus-utils-2.0.5.jar
[INFO] Downloaded from central: https://repo.maven.apache.org/maven2/org/apache/maven/maven-artifact/2.0.6/maven-artifact-2.0.6.jar (87 kB at 677 kB/s)
[INFO] Downloading from central: https://repo.maven.apache.org/maven2/org/codehaus/plexus/plexus-interpolation/1.13/plexus-interpolation-1.13.jar
[INFO] Downloaded from central: https://repo.maven.apache.org/maven2/org/apache/maven/maven-monitor/2.0.6/maven-monitor-2.0.6.jar (10 kB at 76 kB/s)
[INFO] Downloaded from central: https://repo.maven.apache.org/maven2/org/apache/maven/maven-plugin-registry/2.0.6/maven-plugin-registry-2.0.6.jar (29 kB at 210 kB/s)
[INFO] Downloaded from central: https://repo.maven.apache.org/maven2/org/apache/maven/maven-model/2.0.6/maven-model-2.0.6.jar (86 kB at 635 kB/s)
[INFO] Downloaded from central: https://repo.maven.apache.org/maven2/org/codehaus/plexus/plexus-interpolation/1.13/plexus-interpolation-1.13.jar (61 kB at 389 kB/s)
[INFO] Downloaded from central: https://repo.maven.apache.org/maven2/org/codehaus/plexus/plexus-utils/2.0.5/plexus-utils-2.0.5.jar (223 kB at 1.4 MB/s)
[WARNING] Using platform encoding (ISO-8859-1 actually) to copy filtered resources, i.e. build is platform dependent!
[INFO] skip non existing resourceDirectory /home/jenkins/jenkins-slave/workspace/box_maven-surefire_SUREFIRE-1617@2/surefire-its/target/UmlautDirIT_surefire1617/src/main/resources
[INFO] 
[INFO] --- maven-compiler-plugin:3.1:compile (default-compile) @ junit-path-with-umlaut ---
[INFO] Downloading from central: https://repo.maven.apache.org/maven2/org/apache/maven/maven-plugin-api/2.0.9/maven-plugin-api-2.0.9.pom
[INFO] Downloaded from central: https://repo.maven.apache.org/maven2/org/apache/maven/maven-plugin-api/2.0.9/maven-plugin-api-2.0.9.pom (1.5 kB at 100 kB/s)
[INFO] Downloading from central: https://repo.maven.apache.org/maven2/org/apache/maven/maven/2.0.9/maven-2.0.9.pom
[INFO] Downloaded from central: https://repo.maven.apache.org/maven2/org/apache/maven/maven/2.0.9/maven-2.0.9.pom (19 kB at 1.1 MB/s)
[INFO] Downloading from central: https://repo.maven.apache.org/maven2/org/apache/maven/maven-parent/8/maven-parent-8.pom
[INFO] Downloaded from central: https://repo.maven.apache.org/maven2/org/apache/maven/maven-parent/8/maven-parent-8.pom (24 kB at 1.5 MB/s)
[INFO] Downloading from central: https://repo.maven.apache.org/maven2/org/apache/maven/maven-artifact/2.0.9/maven-artifact-2.0.9.pom
[INFO] Downloaded from central: https://repo.maven.apache.org/maven2/org/apache/maven/maven-artifact/2.0.9/maven-artifact-2.0.9.pom (1.6 kB at 125 kB/s)
[INFO] Downloading from central: https://repo.maven.apache.org/maven2/org/apache/maven/maven-core/2.0.9/maven-core-2.0.9.pom
[INFO] Downloaded from central: https://repo.maven.apache.org/maven2/org/apache/maven/maven-core/2.0.9/maven-core-2.0.9.pom (7.8 kB at 487 kB/s)
[INFO] Downloading from central: https://repo.maven.apache.org/maven2/org/apache/maven/maven-settings/2.0.9/maven-settings-2.0.9.pom
[INFO] Downloaded from central: https://repo.maven.apache.org/maven2/org/apache/maven/maven-settings/2.0.9/maven-settings-2.0.9.pom (2.1 kB at 147 kB/s)
[INFO] Downloading from central: https://repo.maven.apache.org/maven2/org/apache/maven/maven-model/2.0.9/maven-model-2.0.9.pom
[INFO] Downloaded from central: https://repo.maven.apache.org/maven2/org/apache/maven/maven-model/2.0.9/maven-model-2.0.9.pom (3.1 kB at 224 kB/s)
[INFO] Downloading from central: https://repo.maven.apache.org/maven2/org/apache/maven/maven-plugin-parameter-documenter/2.0.9/maven-plugin-parameter-documenter-2.0.9.pom
[INFO] Downloaded from central: https://repo.maven.apache.org/maven2/org/apache/maven/maven-plugin-parameter-documenter/2.0.9/maven-plugin-parameter-documenter-2.0.9.pom (2.0 kB at 116 kB/s)
[INFO] Downloading from central: https://repo.maven.apache.org/maven2/org/apache/maven/maven-profile/2.0.9/maven-profile-2.0.9.pom
[INFO] Downloaded from central: https://repo.maven.apache.org/maven2/org/apache/maven/maven-profile/2.0.9/maven-profile-2.0.9.pom (2.0 kB at 146 kB/s)
[INFO] Downloading from central: https://repo.maven.apache.org/maven2/org/apache/maven/maven-repository-metadata/2.0.9/maven-repository-metadata-2.0.9.pom
[INFO] Downloaded from central: https://repo.maven.apache.org/maven2/org/apache/maven/maven-repository-metadata/2.0.9/maven-repository-metadata-2.0.9.pom (1.9 kB at 136 kB/s)
[INFO] Downloading from central: https://repo.maven.apache.org/maven2/org/apache/maven/maven-error-diagnostics/2.0.9/maven-error-diagnostics-2.0.9.pom
[INFO] Downloaded from central: https://repo.maven.apache.org/maven2/org/apache/maven/maven-error-diagnostics/2.0.9/maven-error-diagnostics-2.0.9.pom (1.7 kB at 134 kB/s)
[INFO] Downloading from central: https://repo.maven.apache.org/maven2/org/apache/maven/maven-project/2.0.9/maven-project-2.0.9.pom
[INFO] Downloaded from central: https://repo.maven.apache.org/maven2/org/apache/maven/maven-project/2.0.9/maven-project-2.0.9.pom (2.7 kB at 194 kB/s)
[INFO] Downloading from central: https://repo.maven.apache.org/maven2/org/apache/maven/maven-artifact-manager/2.0.9/maven-artifact-manager-2.0.9.pom
[INFO] Downloaded from central: https://repo.maven.apache.org/maven2/org/apache/maven/maven-artifact-manager/2.0.9/maven-artifact-manager-2.0.9.pom (2.7 kB at 180 kB/s)
[INFO] Downloading from central: https://repo.maven.apache.org/maven2/org/apache/maven/maven-plugin-registry/2.0.9/maven-plugin-registry-2.0.9.pom
[INFO] Downloaded from central: https://repo.maven.apache.org/maven2/org/apache/maven/maven-plugin-registry/2.0.9/maven-plugin-registry-2.0.9.pom (2.0 kB at 152 kB/s)
[INFO] Downloading from central: https://repo.maven.apache.org/maven2/org/apache/maven/maven-plugin-descriptor/2.0.9/maven-plugin-descriptor-2.0.9.pom
[INFO] Downloaded from central: https://repo.maven.apache.org/maven2/org/apache/maven/maven-plugin-descriptor/2.0.9/maven-plugin-descriptor-2.0.9.pom (2.1 kB at 138 kB/s)
[INFO] Downloading from central: https://repo.maven.apache.org/maven2/org/apache/maven/maven-monitor/2.0.9/maven-monitor-2.0.9.pom
[INFO] Downloaded from central: https://repo.maven.apache.org/maven2/org/apache/maven/maven-monitor/2.0.9/maven-monitor-2.0.9.pom (1.3 kB at 92 kB/s)
[INFO] Downloading from central: https://repo.maven.apache.org/maven2/org/apache/maven/maven-toolchain/1.0/maven-toolchain-1.0.pom
[INFO] Downloaded from central: https://repo.maven.apache.org/maven2/org/apache/maven/maven-toolchain/1.0/maven-toolchain-1.0.pom (3.4 kB at 213 kB/s)
[INFO] Downloading from central: https://repo.maven.apache.org/maven2/org/codehaus/plexus/plexus-compiler-api/2.2/plexus-compiler-api-2.2.pom
[INFO] Downloaded from central: https://repo.maven.apache.org/maven2/org/codehaus/plexus/plexus-compiler-api/2.2/plexus-compiler-api-2.2.pom (865 B at 62 kB/s)
[INFO] Downloading from central: https://repo.maven.apache.org/maven2/org/codehaus/plexus/plexus-compiler/2.2/plexus-compiler-2.2.pom
[INFO] Downloaded from central: https://repo.maven.apache.org/maven2/org/codehaus/plexus/plexus-compiler/2.2/plexus-compiler-2.2.pom (3.6 kB at 241 kB/s)
[INFO] Downloading from central: https://repo.maven.apache.org/maven2/org/codehaus/plexus/plexus-utils/3.0.8/plexus-utils-3.0.8.pom
[INFO] Downloaded from central: https://repo.maven.apache.org/maven2/org/codehaus/plexus/plexus-utils/3.0.8/plexus-utils-3.0.8.pom (3.1 kB at 165 kB/s)
[INFO] Downloading from central: https://repo.maven.apache.org/maven2/org/codehaus/plexus/plexus-compiler-manager/2.2/plexus-compiler-manager-2.2.pom
[INFO] Downloaded from central: https://repo.maven.apache.org/maven2/org/codehaus/plexus/plexus-compiler-manager/2.2/plexus-compiler-manager-2.2.pom (690 B at 53 kB/s)
[INFO] Downloading from central: https://repo.maven.apache.org/maven2/org/codehaus/plexus/plexus-compiler-javac/2.2/plexus-compiler-javac-2.2.pom
[INFO] Downloaded from central: https://repo.maven.apache.org/maven2/org/codehaus/plexus/plexus-compiler-javac/2.2/plexus-compiler-javac-2.2.pom (769 B at 59 kB/s)
[INFO] Downloading from central: https://repo.maven.apache.org/maven2/org/codehaus/plexus/plexus-compilers/2.2/plexus-compilers-2.2.pom
[INFO] Downloaded from central: https://repo.maven.apache.org/maven2/org/codehaus/plexus/plexus-compilers/2.2/plexus-compilers-2.2.pom (1.2 kB at 95 kB/s)
[INFO] Downloading from central: https://repo.maven.apache.org/maven2/org/apache/maven/maven-plugin-api/2.0.9/maven-plugin-api-2.0.9.jar
[INFO] Downloading from central: https://repo.maven.apache.org/maven2/org/apache/maven/maven-artifact/2.0.9/maven-artifact-2.0.9.jar
[INFO] Downloading from central: https://repo.maven.apache.org/maven2/org/codehaus/plexus/plexus-utils/1.5.1/plexus-utils-1.5.1.jar
[INFO] Downloading from central: https://repo.maven.apache.org/maven2/org/apache/maven/maven-core/2.0.9/maven-core-2.0.9.jar
[INFO] Downloading from central: https://repo.maven.apache.org/maven2/org/apache/maven/maven-settings/2.0.9/maven-settings-2.0.9.jar
[INFO] Downloaded from central: https://repo.maven.apache.org/maven2/org/apache/maven/maven-plugin-api/2.0.9/maven-plugin-api-2.0.9.jar (13 kB at 537 kB/s)
[INFO] Downloading from central: https://repo.maven.apache.org/maven2/org/apache/maven/maven-plugin-parameter-documenter/2.0.9/maven-plugin-parameter-documenter-2.0.9.jar
[INFO] Downloaded from central: https://repo.maven.apache.org/maven2/org/apache/maven/maven-settings/2.0.9/maven-settings-2.0.9.jar (49 kB at 1.8 MB/s)
[INFO] Downloading from central: https://repo.maven.apache.org/maven2/org/apache/maven/maven-profile/2.0.9/maven-profile-2.0.9.jar
[INFO] Downloaded from central: https://repo.maven.apache.org/maven2/org/apache/maven/maven-artifact/2.0.9/maven-artifact-2.0.9.jar (89 kB at 2.8 MB/s)
[INFO] Downloading from central: https://repo.maven.apache.org/maven2/org/apache/maven/maven-model/2.0.9/maven-model-2.0.9.jar
[INFO] Downloaded from central: https://repo.maven.apache.org/maven2/org/codehaus/plexus/plexus-utils/1.5.1/plexus-utils-1.5.1.jar (211 kB at 5.3 MB/s)
[INFO] Downloading from central: https://repo.maven.apache.org/maven2/org/apache/maven/maven-repository-metadata/2.0.9/maven-repository-metadata-2.0.9.jar
[INFO] Downloaded from central: https://repo.maven.apache.org/maven2/org/apache/maven/maven-plugin-parameter-documenter/2.0.9/maven-plugin-parameter-documenter-2.0.9.jar (21 kB at 522 kB/s)
[INFO] Downloading from central: https://repo.maven.apache.org/maven2/org/apache/maven/maven-error-diagnostics/2.0.9/maven-error-diagnostics-2.0.9.jar
[INFO] Downloaded from central: https://repo.maven.apache.org/maven2/org/apache/maven/maven-core/2.0.9/maven-core-2.0.9.jar (160 kB at 3.6 MB/s)
[INFO] Downloading from central: https://repo.maven.apache.org/maven2/org/apache/maven/maven-project/2.0.9/maven-project-2.0.9.jar
[INFO] Downloaded from central: https://repo.maven.apache.org/maven2/org/apache/maven/maven-repository-metadata/2.0.9/maven-repository-metadata-2.0.9.jar (25 kB at 472 kB/s)
[INFO] Downloading from central: https://repo.maven.apache.org/maven2/org/apache/maven/maven-plugin-registry/2.0.9/maven-plugin-registry-2.0.9.jar
[INFO] Downloaded from central: https://repo.maven.apache.org/maven2/org/apache/maven/maven-model/2.0.9/maven-model-2.0.9.jar (87 kB at 1.6 MB/s)
[INFO] Downloading from central: https://repo.maven.apache.org/maven2/org/apache/maven/maven-plugin-descriptor/2.0.9/maven-plugin-descriptor-2.0.9.jar
[INFO] Downloaded from central: https://repo.maven.apache.org/maven2/org/apache/maven/maven-profile/2.0.9/maven-profile-2.0.9.jar (35 kB at 655 kB/s)
[INFO] Downloading from central: https://repo.maven.apache.org/maven2/org/apache/maven/maven-artifact-manager/2.0.9/maven-artifact-manager-2.0.9.jar
[INFO] Downloaded from central: https://repo.maven.apache.org/maven2/org/apache/maven/maven-error-diagnostics/2.0.9/maven-error-diagnostics-2.0.9.jar (14 kB at 251 kB/s)
[INFO] Downloading from central: https://repo.maven.apache.org/maven2/org/apache/maven/maven-monitor/2.0.9/maven-monitor-2.0.9.jar
[INFO] Downloaded from central: https://repo.maven.apache.org/maven2/org/apache/maven/maven-plugin-registry/2.0.9/maven-plugin-registry-2.0.9.jar (29 kB at 428 kB/s)
[INFO] Downloading from central: https://repo.maven.apache.org/maven2/org/apache/maven/maven-toolchain/1.0/maven-toolchain-1.0.jar
[INFO] Downloaded from central: https://repo.maven.apache.org/maven2/org/apache/maven/maven-plugin-descriptor/2.0.9/maven-plugin-descriptor-2.0.9.jar (37 kB at 529 kB/s)
[INFO] Downloading from central: https://repo.maven.apache.org/maven2/org/apache/maven/shared/maven-shared-utils/0.1/maven-shared-utils-0.1.jar
[INFO] Downloaded from central: https://repo.maven.apache.org/maven2/org/apache/maven/maven-project/2.0.9/maven-project-2.0.9.jar (122 kB at 1.7 MB/s)
[INFO] Downloading from central: https://repo.maven.apache.org/maven2/org/codehaus/plexus/plexus-compiler-api/2.2/plexus-compiler-api-2.2.jar
[INFO] Downloaded from central: https://repo.maven.apache.org/maven2/org/apache/maven/maven-monitor/2.0.9/maven-monitor-2.0.9.jar (10 kB at 143 kB/s)
[INFO] Downloaded from central: https://repo.maven.apache.org/maven2/org/apache/maven/maven-artifact-manager/2.0.9/maven-artifact-manager-2.0.9.jar (58 kB at 792 kB/s)
[INFO] Downloading from central: https://repo.maven.apache.org/maven2/org/codehaus/plexus/plexus-compiler-javac/2.2/plexus-compiler-javac-2.2.jar
[INFO] Downloading from central: https://repo.maven.apache.org/maven2/org/codehaus/plexus/plexus-compiler-manager/2.2/plexus-compiler-manager-2.2.jar
[INFO] Downloaded from central: https://repo.maven.apache.org/maven2/org/apache/maven/maven-toolchain/1.0/maven-toolchain-1.0.jar (33 kB at 366 kB/s)
[INFO] Downloading from central: https://repo.maven.apache.org/maven2/org/codehaus/plexus/plexus-container-default/1.5.5/plexus-container-default-1.5.5.jar
[INFO] Downloaded from central: https://repo.maven.apache.org/maven2/org/codehaus/plexus/plexus-compiler-api/2.2/plexus-compiler-api-2.2.jar (25 kB at 278 kB/s)
[INFO] Downloading from central: https://repo.maven.apache.org/maven2/org/codehaus/plexus/plexus-classworlds/2.2.2/plexus-classworlds-2.2.2.jar
[INFO] Downloaded from central: https://repo.maven.apache.org/maven2/org/codehaus/plexus/plexus-compiler-javac/2.2/plexus-compiler-javac-2.2.jar (19 kB at 204 kB/s)
[INFO] Downloading from central: https://repo.maven.apache.org/maven2/org/apache/xbean/xbean-reflect/3.4/xbean-reflect-3.4.jar
[INFO] Downloaded from central: https://repo.maven.apache.org/maven2/org/codehaus/plexus/plexus-compiler-manager/2.2/plexus-compiler-manager-2.2.jar (4.6 kB at 49 kB/s)
[INFO] Downloading from central: https://repo.maven.apache.org/maven2/log4j/log4j/1.2.12/log4j-1.2.12.jar
[INFO] Downloaded from central: https://repo.maven.apache.org/maven2/org/apache/maven/shared/maven-shared-utils/0.1/maven-shared-utils-0.1.jar (155 kB at 1.5 MB/s)
[INFO] Downloading from central: https://repo.maven.apache.org/maven2/commons-logging/commons-logging-api/1.1/commons-logging-api-1.1.jar
[INFO] Downloaded from central: https://repo.maven.apache.org/maven2/org/codehaus/plexus/plexus-classworlds/2.2.2/plexus-classworlds-2.2.2.jar (46 kB at 408 kB/s)
[INFO] Downloaded from central: https://repo.maven.apache.org/maven2/commons-logging/commons-logging-api/1.1/commons-logging-api-1.1.jar (45 kB at 354 kB/s)
[INFO] Downloaded from central: https://repo.maven.apache.org/maven2/org/apache/xbean/xbean-reflect/3.4/xbean-reflect-3.4.jar (134 kB at 1.1 MB/s)
[INFO] Downloaded from central: https://repo.maven.apache.org/maven2/org/codehaus/plexus/plexus-container-default/1.5.5/plexus-container-default-1.5.5.jar (217 kB at 1.7 MB/s)
[INFO] Downloaded from central: https://repo.maven.apache.org/maven2/log4j/log4j/1.2.12/log4j-1.2.12.jar (358 kB at 2.3 MB/s)
[INFO] No sources to compile
[INFO] 
[INFO] --- maven-resources-plugin:2.6:testResources (default-testResources) @ junit-path-with-umlaut ---
[WARNING] Using platform encoding (ISO-8859-1 actually) to copy filtered resources, i.e. build is platform dependent!
[INFO] skip non existing resourceDirectory /home/jenkins/jenkins-slave/workspace/box_maven-surefire_SUREFIRE-1617@2/surefire-its/target/UmlautDirIT_surefire1617/src/test/resources
[INFO] 
[INFO] --- maven-compiler-plugin:3.1:testCompile (default-testCompile) @ junit-path-with-umlaut ---
[INFO] Changes detected - recompiling the module!
[WARNING] File encoding has not been set, using platform encoding ISO-8859-1, i.e. build is platform dependent!
[INFO] Compiling 1 source file to /home/jenkins/jenkins-slave/workspace/box_maven-surefire_SUREFIRE-1617@2/surefire-its/target/UmlautDirIT_surefire1617/target/test-classes
[INFO] -------------------------------------------------------------
[ERROR] COMPILATION ERROR : 
[INFO] -------------------------------------------------------------
[ERROR] /home/jenkins/jenkins-slave/workspace/box_maven-surefire_SUREFIRE-1617@2/surefire-its/target/UmlautDirIT_surefire1617/src/test/java/umlautTest/BasicTest.java:[23,24] package junit.extensions does not exist
[ERROR] /home/jenkins/jenkins-slave/workspace/box_maven-surefire_SUREFIRE-1617@2/surefire-its/target/UmlautDirIT_surefire1617/src/test/java/umlautTest/BasicTest.java:[24,23] package junit.framework does not exist
[ERROR] /home/jenkins/jenkins-slave/workspace/box_maven-surefire_SUREFIRE-1617@2/surefire-its/target/UmlautDirIT_surefire1617/src/test/java/umlautTest/BasicTest.java:[25,23] package junit.framework does not exist
[ERROR] /home/jenkins/jenkins-slave/workspace/box_maven-surefire_SUREFIRE-1617@2/surefire-its/target/UmlautDirIT_surefire1617/src/test/java/umlautTest/BasicTest.java:[26,23] package junit.framework does not exist
[ERROR] /home/jenkins/jenkins-slave/workspace/box_maven-surefire_SUREFIRE-1617@2/surefire-its/target/UmlautDirIT_surefire1617/src/test/java/umlautTest/BasicTest.java:[29,13] cannot find symbol
  symbol: class TestCase
[ERROR] /home/jenkins/jenkins-slave/workspace/box_maven-surefire_SUREFIRE-1617@2/surefire-its/target/UmlautDirIT_surefire1617/src/test/java/umlautTest/BasicTest.java:[41,19] cannot find symbol
  symbol:   class Test
  location: class umlautTest.BasicTest
[ERROR] /home/jenkins/jenkins-slave/workspace/box_maven-surefire_SUREFIRE-1617@2/surefire-its/target/UmlautDirIT_surefire1617/src/test/java/umlautTest/BasicTest.java:[43,9] cannot find symbol
  symbol:   class TestSuite
  location: class umlautTest.BasicTest
[ERROR] /home/jenkins/jenkins-slave/workspace/box_maven-surefire_SUREFIRE-1617@2/surefire-its/target/UmlautDirIT_surefire1617/src/test/java/umlautTest/BasicTest.java:[43,31] cannot find symbol
  symbol:   class TestSuite
  location: class umlautTest.BasicTest
[ERROR] /home/jenkins/jenkins-slave/workspace/box_maven-surefire_SUREFIRE-1617@2/surefire-its/target/UmlautDirIT_surefire1617/src/test/java/umlautTest/BasicTest.java:[44,9] cannot find symbol
  symbol:   class Test
  location: class umlautTest.BasicTest
[ERROR] /home/jenkins/jenkins-slave/workspace/box_maven-surefire_SUREFIRE-1617@2/surefire-its/target/UmlautDirIT_surefire1617/src/test/java/umlautTest/BasicTest.java:[47,20] cannot find symbol
  symbol:   class TestSetup
  location: class umlautTest.BasicTest
[ERROR] /home/jenkins/jenkins-slave/workspace/box_maven-surefire_SUREFIRE-1617@2/surefire-its/target/UmlautDirIT_surefire1617/src/test/java/umlautTest/BasicTest.java:[79,9] cannot find symbol
  symbol:   method assertTrue(java.lang.String,boolean)
  location: class umlautTest.BasicTest
[ERROR] /home/jenkins/jenkins-slave/workspace/box_maven-surefire_SUREFIRE-1617@2/surefire-its/target/UmlautDirIT_surefire1617/src/test/java/umlautTest/BasicTest.java:[84,9] cannot find symbol
  symbol:   method assertTrue(java.lang.String,boolean)
  location: class umlautTest.BasicTest
[INFO] 12 errors 
[INFO] -------------------------------------------------------------
[INFO] ------------------------------------------------------------------------
[INFO] BUILD FAILURE
[INFO] ------------------------------------------------------------------------
[INFO] Total time:  3.001 s
[INFO] Finished at: 2019-05-09T01:12:32Z
[INFO] ------------------------------------------------------------------------
[ERROR] Failed to execute goal org.apache.maven.plugins:maven-compiler-plugin:3.1:testCompile (default-testCompile) on project junit-path-with-umlaut: Compilation failure: Compilation failure: 
[ERROR] /home/jenkins/jenkins-slave/workspace/box_maven-surefire_SUREFIRE-1617@2/surefire-its/target/UmlautDirIT_surefire1617/src/test/java/umlautTest/BasicTest.java:[23,24] package junit.extensions does not exist
[ERROR] /home/jenkins/jenkins-slave/workspace/box_maven-surefire_SUREFIRE-1617@2/surefire-its/target/UmlautDirIT_surefire1617/src/test/java/umlautTest/BasicTest.java:[24,23] package junit.framework does not exist
[ERROR] /home/jenkins/jenkins-slave/workspace/box_maven-surefire_SUREFIRE-1617@2/surefire-its/target/UmlautDirIT_surefire1617/src/test/java/umlautTest/BasicTest.java:[25,23] package junit.framework does not exist
[ERROR] /home/jenkins/jenkins-slave/workspace/box_maven-surefire_SUREFIRE-1617@2/surefire-its/target/UmlautDirIT_surefire1617/src/test/java/umlautTest/BasicTest.java:[26,23] package junit.framework does not exist
[ERROR] /home/jenkins/jenkins-slave/workspace/box_maven-surefire_SUREFIRE-1617@2/surefire-its/target/UmlautDirIT_surefire1617/src/test/java/umlautTest/BasicTest.java:[29,13] cannot find symbol
[ERROR]   symbol: class TestCase
[ERROR] /home/jenkins/jenkins-slave/workspace/box_maven-surefire_SUREFIRE-1617@2/surefire-its/target/UmlautDirIT_surefire1617/src/test/java/umlautTest/BasicTest.java:[41,19] cannot find symbol
[ERROR]   symbol:   class Test
[ERROR]   location: class umlautTest.BasicTest
[ERROR] /home/jenkins/jenkins-slave/workspace/box_maven-surefire_SUREFIRE-1617@2/surefire-its/target/UmlautDirIT_surefire1617/src/test/java/umlautTest/BasicTest.java:[43,9] cannot find symbol
[ERROR]   symbol:   class TestSuite
[ERROR]   location: class umlautTest.BasicTest
[ERROR] /home/jenkins/jenkins-slave/workspace/box_maven-surefire_SUREFIRE-1617@2/surefire-its/target/UmlautDirIT_surefire1617/src/test/java/umlautTest/BasicTest.java:[43,31] cannot find symbol
[ERROR]   symbol:   class TestSuite
[ERROR]   location: class umlautTest.BasicTest
[ERROR] /home/jenkins/jenkins-slave/workspace/box_maven-surefire_SUREFIRE-1617@2/surefire-its/target/UmlautDirIT_surefire1617/src/test/java/umlautTest/BasicTest.java:[44,9] cannot find symbol
[ERROR]   symbol:   class Test
[ERROR]   location: class umlautTest.BasicTest
[ERROR] /home/jenkins/jenkins-slave/workspace/box_maven-surefire_SUREFIRE-1617@2/surefire-its/target/UmlautDirIT_surefire1617/src/test/java/umlautTest/BasicTest.java:[47,20] cannot find symbol
[ERROR]   symbol:   class TestSetup
[ERROR]   location: class umlautTest.BasicTest
[ERROR] /home/jenkins/jenkins-slave/workspace/box_maven-surefire_SUREFIRE-1617@2/surefire-its/target/UmlautDirIT_surefire1617/src/test/java/umlautTest/BasicTest.java:[79,9] cannot find symbol
[ERROR]   symbol:   method assertTrue(java.lang.String,boolean)
[ERROR]   location: class umlautTest.BasicTest
[ERROR] /home/jenkins/jenkins-slave/workspace/box_maven-surefire_SUREFIRE-1617@2/surefire-its/target/UmlautDirIT_surefire1617/src/test/java/umlautTest/BasicTest.java:[84,9] cannot find symbol
[ERROR]   symbol:   method assertTrue(java.lang.String,boolean)
[ERROR]   location: class umlautTest.BasicTest
[ERROR] -> [Help 1]
org.apache.maven.lifecycle.LifecycleExecutionException: Failed to execute goal org.apache.maven.plugins:maven-compiler-plugin:3.1:testCompile (default-testCompile) on project junit-path-with-umlaut: Compilation failure
    at org.apache.maven.lifecycle.internal.MojoExecutor.execute (MojoExecutor.java:215)
    at org.apache.maven.lifecycle.internal.MojoExecutor.execute (MojoExecutor.java:156)
    at org.apache.maven.lifecycle.internal.MojoExecutor.execute (MojoExecutor.java:148)
    at org.apache.maven.lifecycle.internal.LifecycleModuleBuilder.buildProject (LifecycleModuleBuilder.java:117)
    at org.apache.maven.lifecycle.internal.LifecycleModuleBuilder.buildProject (LifecycleModuleBuilder.java:81)
    at org.apache.maven.lifecycle.internal.builder.singlethreaded.SingleThreadedBuilder.build (SingleThreadedBuilder.java:56)
    at org.apache.maven.lifecycle.internal.LifecycleStarter.execute (LifecycleStarter.java:128)
    at org.apache.maven.DefaultMaven.doExecute (DefaultMaven.java:305)
    at org.apache.maven.DefaultMaven.doExecute (DefaultMaven.java:192)
    at org.apache.maven.DefaultMaven.execute (DefaultMaven.java:105)
    at org.apache.maven.cli.MavenCli.execute (MavenCli.java:956)
    at org.apache.maven.cli.MavenCli.doMain (MavenCli.java:288)
    at org.apache.maven.cli.MavenCli.main (MavenCli.java:192)
    at jdk.internal.reflect.NativeMethodAccessorImpl.invoke0 (Native Method)
    at jdk.internal.reflect.NativeMethodAccessorImpl.invoke (NativeMethodAccessorImpl.java:62)
    at jdk.internal.reflect.DelegatingMethodAccessorImpl.invoke (DelegatingMethodAccessorImpl.java:43)
    at java.lang.reflect.Method.invoke (Method.java:567)
    at org.codehaus.plexus.classworlds.launcher.Launcher.launchEnhanced (Launcher.java:289)
    at org.codehaus.plexus.classworlds.launcher.Launcher.launch (Launcher.java:229)
    at org.codehaus.plexus.classworlds.launcher.Launcher.mainWithExitCode (Launcher.java:415)
    at org.codehaus.plexus.classworlds.launcher.Launcher.main (Launcher.java:356)
Caused by: org.apache.maven.plugin.compiler.CompilationFailureException: Compilation failure
    at org.apache.maven.plugin.compiler.AbstractCompilerMojo.execute (AbstractCompilerMojo.java:858)
    at org.apache.maven.plugin.compiler.TestCompilerMojo.execute (TestCompilerMojo.java:152)
    at org.apache.maven.plugin.DefaultBuildPluginManager.executeMojo (DefaultBuildPluginManager.java:137)
    at org.apache.maven.lifecycle.internal.MojoExecutor.execute (MojoExecutor.java:210)
    at org.apache.maven.lifecycle.internal.MojoExecutor.execute (MojoExecutor.java:156)
    at org.apache.maven.lifecycle.internal.MojoExecutor.execute (MojoExecutor.java:148)
    at org.apache.maven.lifecycle.internal.LifecycleModuleBuilder.buildProject (LifecycleModuleBuilder.java:117)
    at org.apache.maven.lifecycle.internal.LifecycleModuleBuilder.buildProject (LifecycleModuleBuilder.java:81)
    at org.apache.maven.lifecycle.internal.builder.singlethreaded.SingleThreadedBuilder.build (SingleThreadedBuilder.java:56)
    at org.apache.maven.lifecycle.internal.LifecycleStarter.execute (LifecycleStarter.java:128)
    at org.apache.maven.DefaultMaven.doExecute (DefaultMaven.java:305)
    at org.apache.maven.DefaultMaven.doExecute (DefaultMaven.java:192)
    at org.apache.maven.DefaultMaven.execute (DefaultMaven.java:105)
    at org.apache.maven.cli.MavenCli.execute (MavenCli.java:956)
    at org.apache.maven.cli.MavenCli.doMain (MavenCli.java:288)
    at org.apache.maven.cli.MavenCli.main (MavenCli.java:192)
    at jdk.internal.reflect.NativeMethodAccessorImpl.invoke0 (Native Method)
    at jdk.internal.reflect.NativeMethodAccessorImpl.invoke (NativeMethodAccessorImpl.java:62)
    at jdk.internal.reflect.DelegatingMethodAccessorImpl.invoke (DelegatingMethodAccessorImpl.java:43)
    at java.lang.reflect.Method.invoke (Method.java:567)
    at org.codehaus.plexus.classworlds.launcher.Launcher.launchEnhanced (Launcher.java:289)
    at org.codehaus.plexus.classworlds.launcher.Launcher.launch (Launcher.java:229)
    at org.codehaus.plexus.classworlds.launcher.Launcher.mainWithExitCode (Launcher.java:415)
    at org.codehaus.plexus.classworlds.launcher.Launcher.main (Launcher.java:356)
[ERROR] 
[ERROR] Re-run Maven using the -X switch to enable full debug logging.
[ERROR] 
[ERROR] For more information about the errors and possible solutions, please read the following articles:
[ERROR] [Help 1] http://cwiki.apache.org/confluence/display/MAVEN/MojoFailureException

	at org.apache.maven.surefire.its.UmlautDirIT.surefire1617(UmlautDirIT.java:72)
Caused by: org.apache.maven.it.VerificationException: 
Exit code was non-zero: 1; command line and log = 
/home/jenkins/tools/maven/apache-maven-3.6.0/bin/mvn -e --batch-mode -Dmaven.repo.local=/home/jenkins/jenkins-slave/workspace/box_maven-surefire_SUREFIRE-1617@2/surefire-its/target/local repo for : SUREFIRE-1617 org.apache.maven.plugins:maven-clean-plugin:clean -Dsurefire.version=3.0.0-SNAPSHOT -Djacoco.agent=-javaagent:/home/jenkins/jenkins-slave/workspace/box_maven-surefire_SUREFIRE-1617@2/.m2/org/jacoco/org.jacoco.agent/0.8.3/org.jacoco.agent-0.8.3-runtime.jar=destfile=/home/jenkins/jenkins-slave/workspace/box_maven-surefire_SUREFIRE-1617@2/surefire-its/target/jacoco-it.exec,append=true,includes=**/failsafe/*:**/failsafe/**/*:**/surefire/*:**/surefire/**/*,inclnolocationclasses=true,jmx=false -Dhttps.protocols=TLSv1,TLSv1.1,TLSv1.2 test
[INFO] Error stacktraces are turned on.
[INFO] Scanning for projects...
[INFO] Downloading from central: https://repo.maven.apache.org/maven2/org/apache/maven/plugins/maven-clean-plugin/3.0.0/maven-clean-plugin-3.0.0.pom
[INFO] Downloaded from central: https://repo.maven.apache.org/maven2/org/apache/maven/plugins/maven-clean-plugin/3.0.0/maven-clean-plugin-3.0.0.pom (4.8 kB at 15 kB/s)
[INFO] Downloading from central: https://repo.maven.apache.org/maven2/org/apache/maven/plugins/maven-plugins/28/maven-plugins-28.pom
[INFO] Downloaded from central: https://repo.maven.apache.org/maven2/org/apache/maven/plugins/maven-plugins/28/maven-plugins-28.pom (12 kB at 547 kB/s)
[INFO] Downloading from central: https://repo.maven.apache.org/maven2/org/apache/maven/plugins/maven-clean-plugin/3.0.0/maven-clean-plugin-3.0.0.jar
[INFO] Downloaded from central: https://repo.maven.apache.org/maven2/org/apache/maven/plugins/maven-clean-plugin/3.0.0/maven-clean-plugin-3.0.0.jar (31 kB at 1.3 MB/s)
[INFO] 
[INFO] ------< org.apache.maven.plugins.surefire:junit-path-with-umlaut >------
[INFO] Building Test path with Ümlaut 1.0-SNAPSHOT
[INFO] --------------------------------[ jar ]---------------------------------
[INFO] Downloading from central: https://repo.maven.apache.org/maven2/org/apache/maven/plugins/maven-resources-plugin/2.6/maven-resources-plugin-2.6.pom
[INFO] Downloaded from central: https://repo.maven.apache.org/maven2/org/apache/maven/plugins/maven-resources-plugin/2.6/maven-resources-plugin-2.6.pom (8.1 kB at 451 kB/s)
[INFO] Downloading from central: https://repo.maven.apache.org/maven2/org/apache/maven/plugins/maven-plugins/23/maven-plugins-23.pom
[INFO] Downloaded from central: https://repo.maven.apache.org/maven2/org/apache/maven/plugins/maven-plugins/23/maven-plugins-23.pom (9.2 kB at 511 kB/s)
[INFO] Downloading from central: https://repo.maven.apache.org/maven2/org/apache/maven/plugins/maven-resources-plugin/2.6/maven-resources-plugin-2.6.jar
[INFO] Downloaded from central: https://repo.maven.apache.org/maven2/org/apache/maven/plugins/maven-resources-plugin/2.6/maven-resources-plugin-2.6.jar (30 kB at 1.6 MB/s)
[INFO] Downloading from central: https://repo.maven.apache.org/maven2/org/apache/maven/plugins/maven-compiler-plugin/3.1/maven-compiler-plugin-3.1.pom
[INFO] Downloaded from central: https://repo.maven.apache.org/maven2/org/apache/maven/plugins/maven-compiler-plugin/3.1/maven-compiler-plugin-3.1.pom (10 kB at 601 kB/s)
[INFO] Downloading from central: https://repo.maven.apache.org/maven2/org/apache/maven/plugins/maven-compiler-plugin/3.1/maven-compiler-plugin-3.1.jar
[INFO] Downloaded from central: https://repo.maven.apache.org/maven2/org/apache/maven/plugins/maven-compiler-plugin/3.1/maven-compiler-plugin-3.1.jar (43 kB at 2.0 MB/s)
[INFO] 
[INFO] --- maven-clean-plugin:3.0.0:clean (default-cli) @ junit-path-with-umlaut ---
[INFO] 
[INFO] --- maven-resources-plugin:2.6:resources (default-resources) @ junit-path-with-umlaut ---
[INFO] Downloading from central: https://repo.maven.apache.org/maven2/org/codehaus/plexus/plexus-interpolation/1.13/plexus-interpolation-1.13.pom
[INFO] Downloaded from central: https://repo.maven.apache.org/maven2/org/codehaus/plexus/plexus-interpolation/1.13/plexus-interpolation-1.13.pom (890 B at 59 kB/s)
[INFO] Downloading from central: https://repo.maven.apache.org/maven2/org/apache/maven/maven-plugin-api/2.0.6/maven-plugin-api-2.0.6.jar
[INFO] Downloading from central: https://repo.maven.apache.org/maven2/org/apache/maven/maven-project/2.0.6/maven-project-2.0.6.jar
[INFO] Downloading from central: https://repo.maven.apache.org/maven2/org/apache/maven/maven-artifact-manager/2.0.6/maven-artifact-manager-2.0.6.jar
[INFO] Downloading from central: https://repo.maven.apache.org/maven2/org/apache/maven/maven-plugin-registry/2.0.6/maven-plugin-registry-2.0.6.jar
[INFO] Downloading from central: https://repo.maven.apache.org/maven2/org/apache/maven/maven-profile/2.0.6/maven-profile-2.0.6.jar
[INFO] Downloaded from central: https://repo.maven.apache.org/maven2/org/apache/maven/maven-plugin-api/2.0.6/maven-plugin-api-2.0.6.jar (13 kB at 415 kB/s)
[INFO] Downloading from central: https://repo.maven.apache.org/maven2/org/apache/maven/maven-core/2.0.6/maven-core-2.0.6.jar
[INFO] Downloaded from central: https://repo.maven.apache.org/maven2/org/apache/maven/maven-profile/2.0.6/maven-profile-2.0.6.jar (35 kB at 476 kB/s)
[INFO] Downloading from central: https://repo.maven.apache.org/maven2/org/apache/maven/maven-plugin-parameter-documenter/2.0.6/maven-plugin-parameter-documenter-2.0.6.jar
[INFO] Downloaded from central: https://repo.maven.apache.org/maven2/org/apache/maven/maven-artifact-manager/2.0.6/maven-artifact-manager-2.0.6.jar (57 kB at 753 kB/s)
[INFO] Downloading from central: https://repo.maven.apache.org/maven2/org/apache/maven/reporting/maven-reporting-api/2.0.6/maven-reporting-api-2.0.6.jar
[INFO] Downloaded from central: https://repo.maven.apache.org/maven2/org/apache/maven/maven-project/2.0.6/maven-project-2.0.6.jar (116 kB at 1.3 MB/s)
[INFO] Downloading from central: https://repo.maven.apache.org/maven2/org/apache/maven/doxia/doxia-sink-api/1.0-alpha-7/doxia-sink-api-1.0-alpha-7.jar
[INFO] Downloaded from central: https://repo.maven.apache.org/maven2/org/apache/maven/maven-core/2.0.6/maven-core-2.0.6.jar (152 kB at 1.7 MB/s)
[INFO] Downloading from central: https://repo.maven.apache.org/maven2/org/apache/maven/maven-repository-metadata/2.0.6/maven-repository-metadata-2.0.6.jar
[INFO] Downloaded from central: https://repo.maven.apache.org/maven2/org/apache/maven/reporting/maven-reporting-api/2.0.6/maven-reporting-api-2.0.6.jar (9.9 kB at 108 kB/s)
[INFO] Downloading from central: https://repo.maven.apache.org/maven2/org/apache/maven/maven-error-diagnostics/2.0.6/maven-error-diagnostics-2.0.6.jar
[INFO] Downloaded from central: https://repo.maven.apache.org/maven2/org/apache/maven/maven-plugin-parameter-documenter/2.0.6/maven-plugin-parameter-documenter-2.0.6.jar (21 kB at 226 kB/s)
[INFO] Downloading from central: https://repo.maven.apache.org/maven2/commons-cli/commons-cli/1.0/commons-cli-1.0.jar
[INFO] Downloaded from central: https://repo.maven.apache.org/maven2/org/apache/maven/doxia/doxia-sink-api/1.0-alpha-7/doxia-sink-api-1.0-alpha-7.jar (5.9 kB at 62 kB/s)
[INFO] Downloading from central: https://repo.maven.apache.org/maven2/org/apache/maven/maven-plugin-descriptor/2.0.6/maven-plugin-descriptor-2.0.6.jar
[INFO] Downloaded from central: https://repo.maven.apache.org/maven2/org/apache/maven/maven-error-diagnostics/2.0.6/maven-error-diagnostics-2.0.6.jar (14 kB at 128 kB/s)
[INFO] Downloaded from central: https://repo.maven.apache.org/maven2/org/apache/maven/maven-repository-metadata/2.0.6/maven-repository-metadata-2.0.6.jar (24 kB at 231 kB/s)
[INFO] Downloading from central: https://repo.maven.apache.org/maven2/org/apache/maven/maven-artifact/2.0.6/maven-artifact-2.0.6.jar
[INFO] Downloading from central: https://repo.maven.apache.org/maven2/org/apache/maven/maven-settings/2.0.6/maven-settings-2.0.6.jar
[INFO] Downloaded from central: https://repo.maven.apache.org/maven2/commons-cli/commons-cli/1.0/commons-cli-1.0.jar (30 kB at 276 kB/s)
[INFO] Downloading from central: https://repo.maven.apache.org/maven2/org/apache/maven/maven-model/2.0.6/maven-model-2.0.6.jar
[INFO] Downloaded from central: https://repo.maven.apache.org/maven2/org/apache/maven/maven-plugin-descriptor/2.0.6/maven-plugin-descriptor-2.0.6.jar (37 kB at 321 kB/s)
[INFO] Downloading from central: https://repo.maven.apache.org/maven2/org/apache/maven/maven-monitor/2.0.6/maven-monitor-2.0.6.jar
[INFO] Downloaded from central: https://repo.maven.apache.org/maven2/org/apache/maven/maven-settings/2.0.6/maven-settings-2.0.6.jar (49 kB at 390 kB/s)
[INFO] Downloading from central: https://repo.maven.apache.org/maven2/org/codehaus/plexus/plexus-utils/2.0.5/plexus-utils-2.0.5.jar
[INFO] Downloaded from central: https://repo.maven.apache.org/maven2/org/apache/maven/maven-artifact/2.0.6/maven-artifact-2.0.6.jar (87 kB at 677 kB/s)
[INFO] Downloading from central: https://repo.maven.apache.org/maven2/org/codehaus/plexus/plexus-interpolation/1.13/plexus-interpolation-1.13.jar
[INFO] Downloaded from central: https://repo.maven.apache.org/maven2/org/apache/maven/maven-monitor/2.0.6/maven-monitor-2.0.6.jar (10 kB at 76 kB/s)
[INFO] Downloaded from central: https://repo.maven.apache.org/maven2/org/apache/maven/maven-plugin-registry/2.0.6/maven-plugin-registry-2.0.6.jar (29 kB at 210 kB/s)
[INFO] Downloaded from central: https://repo.maven.apache.org/maven2/org/apache/maven/maven-model/2.0.6/maven-model-2.0.6.jar (86 kB at 635 kB/s)
[INFO] Downloaded from central: https://repo.maven.apache.org/maven2/org/codehaus/plexus/plexus-interpolation/1.13/plexus-interpolation-1.13.jar (61 kB at 389 kB/s)
[INFO] Downloaded from central: https://repo.maven.apache.org/maven2/org/codehaus/plexus/plexus-utils/2.0.5/plexus-utils-2.0.5.jar (223 kB at 1.4 MB/s)
[WARNING] Using platform encoding (ISO-8859-1 actually) to copy filtered resources, i.e. build is platform dependent!
[INFO] skip non existing resourceDirectory /home/jenkins/jenkins-slave/workspace/box_maven-surefire_SUREFIRE-1617@2/surefire-its/target/UmlautDirIT_surefire1617/src/main/resources
[INFO] 
[INFO] --- maven-compiler-plugin:3.1:compile (default-compile) @ junit-path-with-umlaut ---
[INFO] Downloading from central: https://repo.maven.apache.org/maven2/org/apache/maven/maven-plugin-api/2.0.9/maven-plugin-api-2.0.9.pom
[INFO] Downloaded from central: https://repo.maven.apache.org/maven2/org/apache/maven/maven-plugin-api/2.0.9/maven-plugin-api-2.0.9.pom (1.5 kB at 100 kB/s)
[INFO] Downloading from central: https://repo.maven.apache.org/maven2/org/apache/maven/maven/2.0.9/maven-2.0.9.pom
[INFO] Downloaded from central: https://repo.maven.apache.org/maven2/org/apache/maven/maven/2.0.9/maven-2.0.9.pom (19 kB at 1.1 MB/s)
[INFO] Downloading from central: https://repo.maven.apache.org/maven2/org/apache/maven/maven-parent/8/maven-parent-8.pom
[INFO] Downloaded from central: https://repo.maven.apache.org/maven2/org/apache/maven/maven-parent/8/maven-parent-8.pom (24 kB at 1.5 MB/s)
[INFO] Downloading from central: https://repo.maven.apache.org/maven2/org/apache/maven/maven-artifact/2.0.9/maven-artifact-2.0.9.pom
[INFO] Downloaded from central: https://repo.maven.apache.org/maven2/org/apache/maven/maven-artifact/2.0.9/maven-artifact-2.0.9.pom (1.6 kB at 125 kB/s)
[INFO] Downloading from central: https://repo.maven.apache.org/maven2/org/apache/maven/maven-core/2.0.9/maven-core-2.0.9.pom
[INFO] Downloaded from central: https://repo.maven.apache.org/maven2/org/apache/maven/maven-core/2.0.9/maven-core-2.0.9.pom (7.8 kB at 487 kB/s)
[INFO] Downloading from central: https://repo.maven.apache.org/maven2/org/apache/maven/maven-settings/2.0.9/maven-settings-2.0.9.pom
[INFO] Downloaded from central: https://repo.maven.apache.org/maven2/org/apache/maven/maven-settings/2.0.9/maven-settings-2.0.9.pom (2.1 kB at 147 kB/s)
[INFO] Downloading from central: https://repo.maven.apache.org/maven2/org/apache/maven/maven-model/2.0.9/maven-model-2.0.9.pom
[INFO] Downloaded from central: https://repo.maven.apache.org/maven2/org/apache/maven/maven-model/2.0.9/maven-model-2.0.9.pom (3.1 kB at 224 kB/s)
[INFO] Downloading from central: https://repo.maven.apache.org/maven2/org/apache/maven/maven-plugin-parameter-documenter/2.0.9/maven-plugin-parameter-documenter-2.0.9.pom
[INFO] Downloaded from central: https://repo.maven.apache.org/maven2/org/apache/maven/maven-plugin-parameter-documenter/2.0.9/maven-plugin-parameter-documenter-2.0.9.pom (2.0 kB at 116 kB/s)
[INFO] Downloading from central: https://repo.maven.apache.org/maven2/org/apache/maven/maven-profile/2.0.9/maven-profile-2.0.9.pom
[INFO] Downloaded from central: https://repo.maven.apache.org/maven2/org/apache/maven/maven-profile/2.0.9/maven-profile-2.0.9.pom (2.0 kB at 146 kB/s)
[INFO] Downloading from central: https://repo.maven.apache.org/maven2/org/apache/maven/maven-repository-metadata/2.0.9/maven-repository-metadata-2.0.9.pom
[INFO] Downloaded from central: https://repo.maven.apache.org/maven2/org/apache/maven/maven-repository-metadata/2.0.9/maven-repository-metadata-2.0.9.pom (1.9 kB at 136 kB/s)
[INFO] Downloading from central: https://repo.maven.apache.org/maven2/org/apache/maven/maven-error-diagnostics/2.0.9/maven-error-diagnostics-2.0.9.pom
[INFO] Downloaded from central: https://repo.maven.apache.org/maven2/org/apache/maven/maven-error-diagnostics/2.0.9/maven-error-diagnostics-2.0.9.pom (1.7 kB at 134 kB/s)
[INFO] Downloading from central: https://repo.maven.apache.org/maven2/org/apache/maven/maven-project/2.0.9/maven-project-2.0.9.pom
[INFO] Downloaded from central: https://repo.maven.apache.org/maven2/org/apache/maven/maven-project/2.0.9/maven-project-2.0.9.pom (2.7 kB at 194 kB/s)
[INFO] Downloading from central: https://repo.maven.apache.org/maven2/org/apache/maven/maven-artifact-manager/2.0.9/maven-artifact-manager-2.0.9.pom
[INFO] Downloaded from central: https://repo.maven.apache.org/maven2/org/apache/maven/maven-artifact-manager/2.0.9/maven-artifact-manager-2.0.9.pom (2.7 kB at 180 kB/s)
[INFO] Downloading from central: https://repo.maven.apache.org/maven2/org/apache/maven/maven-plugin-registry/2.0.9/maven-plugin-registry-2.0.9.pom
[INFO] Downloaded from central: https://repo.maven.apache.org/maven2/org/apache/maven/maven-plugin-registry/2.0.9/maven-plugin-registry-2.0.9.pom (2.0 kB at 152 kB/s)
[INFO] Downloading from central: https://repo.maven.apache.org/maven2/org/apache/maven/maven-plugin-descriptor/2.0.9/maven-plugin-descriptor-2.0.9.pom
[INFO] Downloaded from central: https://repo.maven.apache.org/maven2/org/apache/maven/maven-plugin-descriptor/2.0.9/maven-plugin-descriptor-2.0.9.pom (2.1 kB at 138 kB/s)
[INFO] Downloading from central: https://repo.maven.apache.org/maven2/org/apache/maven/maven-monitor/2.0.9/maven-monitor-2.0.9.pom
[INFO] Downloaded from central: https://repo.maven.apache.org/maven2/org/apache/maven/maven-monitor/2.0.9/maven-monitor-2.0.9.pom (1.3 kB at 92 kB/s)
[INFO] Downloading from central: https://repo.maven.apache.org/maven2/org/apache/maven/maven-toolchain/1.0/maven-toolchain-1.0.pom
[INFO] Downloaded from central: https://repo.maven.apache.org/maven2/org/apache/maven/maven-toolchain/1.0/maven-toolchain-1.0.pom (3.4 kB at 213 kB/s)
[INFO] Downloading from central: https://repo.maven.apache.org/maven2/org/codehaus/plexus/plexus-compiler-api/2.2/plexus-compiler-api-2.2.pom
[INFO] Downloaded from central: https://repo.maven.apache.org/maven2/org/codehaus/plexus/plexus-compiler-api/2.2/plexus-compiler-api-2.2.pom (865 B at 62 kB/s)
[INFO] Downloading from central: https://repo.maven.apache.org/maven2/org/codehaus/plexus/plexus-compiler/2.2/plexus-compiler-2.2.pom
[INFO] Downloaded from central: https://repo.maven.apache.org/maven2/org/codehaus/plexus/plexus-compiler/2.2/plexus-compiler-2.2.pom (3.6 kB at 241 kB/s)
[INFO] Downloading from central: https://repo.maven.apache.org/maven2/org/codehaus/plexus/plexus-utils/3.0.8/plexus-utils-3.0.8.pom
[INFO] Downloaded from central: https://repo.maven.apache.org/maven2/org/codehaus/plexus/plexus-utils/3.0.8/plexus-utils-3.0.8.pom (3.1 kB at 165 kB/s)
[INFO] Downloading from central: https://repo.maven.apache.org/maven2/org/codehaus/plexus/plexus-compiler-manager/2.2/plexus-compiler-manager-2.2.pom
[INFO] Downloaded from central: https://repo.maven.apache.org/maven2/org/codehaus/plexus/plexus-compiler-manager/2.2/plexus-compiler-manager-2.2.pom (690 B at 53 kB/s)
[INFO] Downloading from central: https://repo.maven.apache.org/maven2/org/codehaus/plexus/plexus-compiler-javac/2.2/plexus-compiler-javac-2.2.pom
[INFO] Downloaded from central: https://repo.maven.apache.org/maven2/org/codehaus/plexus/plexus-compiler-javac/2.2/plexus-compiler-javac-2.2.pom (769 B at 59 kB/s)
[INFO] Downloading from central: https://repo.maven.apache.org/maven2/org/codehaus/plexus/plexus-compilers/2.2/plexus-compilers-2.2.pom
[INFO] Downloaded from central: https://repo.maven.apache.org/maven2/org/codehaus/plexus/plexus-compilers/2.2/plexus-compilers-2.2.pom (1.2 kB at 95 kB/s)
[INFO] Downloading from central: https://repo.maven.apache.org/maven2/org/apache/maven/maven-plugin-api/2.0.9/maven-plugin-api-2.0.9.jar
[INFO] Downloading from central: https://repo.maven.apache.org/maven2/org/apache/maven/maven-artifact/2.0.9/maven-artifact-2.0.9.jar
[INFO] Downloading from central: https://repo.maven.apache.org/maven2/org/codehaus/plexus/plexus-utils/1.5.1/plexus-utils-1.5.1.jar
[INFO] Downloading from central: https://repo.maven.apache.org/maven2/org/apache/maven/maven-core/2.0.9/maven-core-2.0.9.jar
[INFO] Downloading from central: https://repo.maven.apache.org/maven2/org/apache/maven/maven-settings/2.0.9/maven-settings-2.0.9.jar
[INFO] Downloaded from central: https://repo.maven.apache.org/maven2/org/apache/maven/maven-plugin-api/2.0.9/maven-plugin-api-2.0.9.jar (13 kB at 537 kB/s)
[INFO] Downloading from central: https://repo.maven.apache.org/maven2/org/apache/maven/maven-plugin-parameter-documenter/2.0.9/maven-plugin-parameter-documenter-2.0.9.jar
[INFO] Downloaded from central: https://repo.maven.apache.org/maven2/org/apache/maven/maven-settings/2.0.9/maven-settings-2.0.9.jar (49 kB at 1.8 MB/s)
[INFO] Downloading from central: https://repo.maven.apache.org/maven2/org/apache/maven/maven-profile/2.0.9/maven-profile-2.0.9.jar
[INFO] Downloaded from central: https://repo.maven.apache.org/maven2/org/apache/maven/maven-artifact/2.0.9/maven-artifact-2.0.9.jar (89 kB at 2.8 MB/s)
[INFO] Downloading from central: https://repo.maven.apache.org/maven2/org/apache/maven/maven-model/2.0.9/maven-model-2.0.9.jar
[INFO] Downloaded from central: https://repo.maven.apache.org/maven2/org/codehaus/plexus/plexus-utils/1.5.1/plexus-utils-1.5.1.jar (211 kB at 5.3 MB/s)
[INFO] Downloading from central: https://repo.maven.apache.org/maven2/org/apache/maven/maven-repository-metadata/2.0.9/maven-repository-metadata-2.0.9.jar
[INFO] Downloaded from central: https://repo.maven.apache.org/maven2/org/apache/maven/maven-plugin-parameter-documenter/2.0.9/maven-plugin-parameter-documenter-2.0.9.jar (21 kB at 522 kB/s)
[INFO] Downloading from central: https://repo.maven.apache.org/maven2/org/apache/maven/maven-error-diagnostics/2.0.9/maven-error-diagnostics-2.0.9.jar
[INFO] Downloaded from central: https://repo.maven.apache.org/maven2/org/apache/maven/maven-core/2.0.9/maven-core-2.0.9.jar (160 kB at 3.6 MB/s)
[INFO] Downloading from central: https://repo.maven.apache.org/maven2/org/apache/maven/maven-project/2.0.9/maven-project-2.0.9.jar
[INFO] Downloaded from central: https://repo.maven.apache.org/maven2/org/apache/maven/maven-repository-metadata/2.0.9/maven-repository-metadata-2.0.9.jar (25 kB at 472 kB/s)
[INFO] Downloading from central: https://repo.maven.apache.org/maven2/org/apache/maven/maven-plugin-registry/2.0.9/maven-plugin-registry-2.0.9.jar
[INFO] Downloaded from central: https://repo.maven.apache.org/maven2/org/apache/maven/maven-model/2.0.9/maven-model-2.0.9.jar (87 kB at 1.6 MB/s)
[INFO] Downloading from central: https://repo.maven.apache.org/maven2/org/apache/maven/maven-plugin-descriptor/2.0.9/maven-plugin-descriptor-2.0.9.jar
[INFO] Downloaded from central: https://repo.maven.apache.org/maven2/org/apache/maven/maven-profile/2.0.9/maven-profile-2.0.9.jar (35 kB at 655 kB/s)
[INFO] Downloading from central: https://repo.maven.apache.org/maven2/org/apache/maven/maven-artifact-manager/2.0.9/maven-artifact-manager-2.0.9.jar
[INFO] Downloaded from central: https://repo.maven.apache.org/maven2/org/apache/maven/maven-error-diagnostics/2.0.9/maven-error-diagnostics-2.0.9.jar (14 kB at 251 kB/s)
[INFO] Downloading from central: https://repo.maven.apache.org/maven2/org/apache/maven/maven-monitor/2.0.9/maven-monitor-2.0.9.jar
[INFO] Downloaded from central: https://repo.maven.apache.org/maven2/org/apache/maven/maven-plugin-registry/2.0.9/maven-plugin-registry-2.0.9.jar (29 kB at 428 kB/s)
[INFO] Downloading from central: https://repo.maven.apache.org/maven2/org/apache/maven/maven-toolchain/1.0/maven-toolchain-1.0.jar
[INFO] Downloaded from central: https://repo.maven.apache.org/maven2/org/apache/maven/maven-plugin-descriptor/2.0.9/maven-plugin-descriptor-2.0.9.jar (37 kB at 529 kB/s)
[INFO] Downloading from central: https://repo.maven.apache.org/maven2/org/apache/maven/shared/maven-shared-utils/0.1/maven-shared-utils-0.1.jar
[INFO] Downloaded from central: https://repo.maven.apache.org/maven2/org/apache/maven/maven-project/2.0.9/maven-project-2.0.9.jar (122 kB at 1.7 MB/s)
[INFO] Downloading from central: https://repo.maven.apache.org/maven2/org/codehaus/plexus/plexus-compiler-api/2.2/plexus-compiler-api-2.2.jar
[INFO] Downloaded from central: https://repo.maven.apache.org/maven2/org/apache/maven/maven-monitor/2.0.9/maven-monitor-2.0.9.jar (10 kB at 143 kB/s)
[INFO] Downloaded from central: https://repo.maven.apache.org/maven2/org/apache/maven/maven-artifact-manager/2.0.9/maven-artifact-manager-2.0.9.jar (58 kB at 792 kB/s)
[INFO] Downloading from central: https://repo.maven.apache.org/maven2/org/codehaus/plexus/plexus-compiler-javac/2.2/plexus-compiler-javac-2.2.jar
[INFO] Downloading from central: https://repo.maven.apache.org/maven2/org/codehaus/plexus/plexus-compiler-manager/2.2/plexus-compiler-manager-2.2.jar
[INFO] Downloaded from central: https://repo.maven.apache.org/maven2/org/apache/maven/maven-toolchain/1.0/maven-toolchain-1.0.jar (33 kB at 366 kB/s)
[INFO] Downloading from central: https://repo.maven.apache.org/maven2/org/codehaus/plexus/plexus-container-default/1.5.5/plexus-container-default-1.5.5.jar
[INFO] Downloaded from central: https://repo.maven.apache.org/maven2/org/codehaus/plexus/plexus-compiler-api/2.2/plexus-compiler-api-2.2.jar (25 kB at 278 kB/s)
[INFO] Downloading from central: https://repo.maven.apache.org/maven2/org/codehaus/plexus/plexus-classworlds/2.2.2/plexus-classworlds-2.2.2.jar
[INFO] Downloaded from central: https://repo.maven.apache.org/maven2/org/codehaus/plexus/plexus-compiler-javac/2.2/plexus-compiler-javac-2.2.jar (19 kB at 204 kB/s)
[INFO] Downloading from central: https://repo.maven.apache.org/maven2/org/apache/xbean/xbean-reflect/3.4/xbean-reflect-3.4.jar
[INFO] Downloaded from central: https://repo.maven.apache.org/maven2/org/codehaus/plexus/plexus-compiler-manager/2.2/plexus-compiler-manager-2.2.jar (4.6 kB at 49 kB/s)
[INFO] Downloading from central: https://repo.maven.apache.org/maven2/log4j/log4j/1.2.12/log4j-1.2.12.jar
[INFO] Downloaded from central: https://repo.maven.apache.org/maven2/org/apache/maven/shared/maven-shared-utils/0.1/maven-shared-utils-0.1.jar (155 kB at 1.5 MB/s)
[INFO] Downloading from central: https://repo.maven.apache.org/maven2/commons-logging/commons-logging-api/1.1/commons-logging-api-1.1.jar
[INFO] Downloaded from central: https://repo.maven.apache.org/maven2/org/codehaus/plexus/plexus-classworlds/2.2.2/plexus-classworlds-2.2.2.jar (46 kB at 408 kB/s)
[INFO] Downloaded from central: https://repo.maven.apache.org/maven2/commons-logging/commons-logging-api/1.1/commons-logging-api-1.1.jar (45 kB at 354 kB/s)
[INFO] Downloaded from central: https://repo.maven.apache.org/maven2/org/apache/xbean/xbean-reflect/3.4/xbean-reflect-3.4.jar (134 kB at 1.1 MB/s)
[INFO] Downloaded from central: https://repo.maven.apache.org/maven2/org/codehaus/plexus/plexus-container-default/1.5.5/plexus-container-default-1.5.5.jar (217 kB at 1.7 MB/s)
[INFO] Downloaded from central: https://repo.maven.apache.org/maven2/log4j/log4j/1.2.12/log4j-1.2.12.jar (358 kB at 2.3 MB/s)
[INFO] No sources to compile
[INFO] 
[INFO] --- maven-resources-plugin:2.6:testResources (default-testResources) @ junit-path-with-umlaut ---
[WARNING] Using platform encoding (ISO-8859-1 actually) to copy filtered resources, i.e. build is platform dependent!
[INFO] skip non existing resourceDirectory /home/jenkins/jenkins-slave/workspace/box_maven-surefire_SUREFIRE-1617@2/surefire-its/target/UmlautDirIT_surefire1617/src/test/resources
[INFO] 
[INFO] --- maven-compiler-plugin:3.1:testCompile (default-testCompile) @ junit-path-with-umlaut ---
[INFO] Changes detected - recompiling the module!
[WARNING] File encoding has not been set, using platform encoding ISO-8859-1, i.e. build is platform dependent!
[INFO] Compiling 1 source file to /home/jenkins/jenkins-slave/workspace/box_maven-surefire_SUREFIRE-1617@2/surefire-its/target/UmlautDirIT_surefire1617/target/test-classes
[INFO] -------------------------------------------------------------
[ERROR] COMPILATION ERROR : 
[INFO] -------------------------------------------------------------
[ERROR] /home/jenkins/jenkins-slave/workspace/box_maven-surefire_SUREFIRE-1617@2/surefire-its/target/UmlautDirIT_surefire1617/src/test/java/umlautTest/BasicTest.java:[23,24] package junit.extensions does not exist
[ERROR] /home/jenkins/jenkins-slave/workspace/box_maven-surefire_SUREFIRE-1617@2/surefire-its/target/UmlautDirIT_surefire1617/src/test/java/umlautTest/BasicTest.java:[24,23] package junit.framework does not exist
[ERROR] /home/jenkins/jenkins-slave/workspace/box_maven-surefire_SUREFIRE-1617@2/surefire-its/target/UmlautDirIT_surefire1617/src/test/java/umlautTest/BasicTest.java:[25,23] package junit.framework does not exist
[ERROR] /home/jenkins/jenkins-slave/workspace/box_maven-surefire_SUREFIRE-1617@2/surefire-its/target/UmlautDirIT_surefire1617/src/test/java/umlautTest/BasicTest.java:[26,23] package junit.framework does not exist
[ERROR] /home/jenkins/jenkins-slave/workspace/box_maven-surefire_SUREFIRE-1617@2/surefire-its/target/UmlautDirIT_surefire1617/src/test/java/umlautTest/BasicTest.java:[29,13] cannot find symbol
  symbol: class TestCase
[ERROR] /home/jenkins/jenkins-slave/workspace/box_maven-surefire_SUREFIRE-1617@2/surefire-its/target/UmlautDirIT_surefire1617/src/test/java/umlautTest/BasicTest.java:[41,19] cannot find symbol
  symbol:   class Test
  location: class umlautTest.BasicTest
[ERROR] /home/jenkins/jenkins-slave/workspace/box_maven-surefire_SUREFIRE-1617@2/surefire-its/target/UmlautDirIT_surefire1617/src/test/java/umlautTest/BasicTest.java:[43,9] cannot find symbol
  symbol:   class TestSuite
  location: class umlautTest.BasicTest
[ERROR] /home/jenkins/jenkins-slave/workspace/box_maven-surefire_SUREFIRE-1617@2/surefire-its/target/UmlautDirIT_surefire1617/src/test/java/umlautTest/BasicTest.java:[43,31] cannot find symbol
  symbol:   class TestSuite
  location: class umlautTest.BasicTest
[ERROR] /home/jenkins/jenkins-slave/workspace/box_maven-surefire_SUREFIRE-1617@2/surefire-its/target/UmlautDirIT_surefire1617/src/test/java/umlautTest/BasicTest.java:[44,9] cannot find symbol
  symbol:   class Test
  location: class umlautTest.BasicTest
[ERROR] /home/jenkins/jenkins-slave/workspace/box_maven-surefire_SUREFIRE-1617@2/surefire-its/target/UmlautDirIT_surefire1617/src/test/java/umlautTest/BasicTest.java:[47,20] cannot find symbol
  symbol:   class TestSetup
  location: class umlautTest.BasicTest
[ERROR] /home/jenkins/jenkins-slave/workspace/box_maven-surefire_SUREFIRE-1617@2/surefire-its/target/UmlautDirIT_surefire1617/src/test/java/umlautTest/BasicTest.java:[79,9] cannot find symbol
  symbol:   method assertTrue(java.lang.String,boolean)
  location: class umlautTest.BasicTest
[ERROR] /home/jenkins/jenkins-slave/workspace/box_maven-surefire_SUREFIRE-1617@2/surefire-its/target/UmlautDirIT_surefire1617/src/test/java/umlautTest/BasicTest.java:[84,9] cannot find symbol
  symbol:   method assertTrue(java.lang.String,boolean)
  location: class umlautTest.BasicTest
[INFO] 12 errors 
[INFO] -------------------------------------------------------------
[INFO] ------------------------------------------------------------------------
[INFO] BUILD FAILURE
[INFO] ------------------------------------------------------------------------
[INFO] Total time:  3.001 s
[INFO] Finished at: 2019-05-09T01:12:32Z
[INFO] ------------------------------------------------------------------------
[ERROR] Failed to execute goal org.apache.maven.plugins:maven-compiler-plugin:3.1:testCompile (default-testCompile) on project junit-path-with-umlaut: Compilation failure: Compilation failure: 
[ERROR] /home/jenkins/jenkins-slave/workspace/box_maven-surefire_SUREFIRE-1617@2/surefire-its/target/UmlautDirIT_surefire1617/src/test/java/umlautTest/BasicTest.java:[23,24] package junit.extensions does not exist
[ERROR] /home/jenkins/jenkins-slave/workspace/box_maven-surefire_SUREFIRE-1617@2/surefire-its/target/UmlautDirIT_surefire1617/src/test/java/umlautTest/BasicTest.java:[24,23] package junit.framework does not exist
[ERROR] /home/jenkins/jenkins-slave/workspace/box_maven-surefire_SUREFIRE-1617@2/surefire-its/target/UmlautDirIT_surefire1617/src/test/java/umlautTest/BasicTest.java:[25,23] package junit.framework does not exist
[ERROR] /home/jenkins/jenkins-slave/workspace/box_maven-surefire_SUREFIRE-1617@2/surefire-its/target/UmlautDirIT_surefire1617/src/test/java/umlautTest/BasicTest.java:[26,23] package junit.framework does not exist
[ERROR] /home/jenkins/jenkins-slave/workspace/box_maven-surefire_SUREFIRE-1617@2/surefire-its/target/UmlautDirIT_surefire1617/src/test/java/umlautTest/BasicTest.java:[29,13] cannot find symbol
[ERROR]   symbol: class TestCase
[ERROR] /home/jenkins/jenkins-slave/workspace/box_maven-surefire_SUREFIRE-1617@2/surefire-its/target/UmlautDirIT_surefire1617/src/test/java/umlautTest/BasicTest.java:[41,19] cannot find symbol
[ERROR]   symbol:   class Test
[ERROR]   location: class umlautTest.BasicTest
[ERROR] /home/jenkins/jenkins-slave/workspace/box_maven-surefire_SUREFIRE-1617@2/surefire-its/target/UmlautDirIT_surefire1617/src/test/java/umlautTest/BasicTest.java:[43,9] cannot find symbol
[ERROR]   symbol:   class TestSuite
[ERROR]   location: class umlautTest.BasicTest
[ERROR] /home/jenkins/jenkins-slave/workspace/box_maven-surefire_SUREFIRE-1617@2/surefire-its/target/UmlautDirIT_surefire1617/src/test/java/umlautTest/BasicTest.java:[43,31] cannot find symbol
[ERROR]   symbol:   class TestSuite
[ERROR]   location: class umlautTest.BasicTest
[ERROR] /home/jenkins/jenkins-slave/workspace/box_maven-surefire_SUREFIRE-1617@2/surefire-its/target/UmlautDirIT_surefire1617/src/test/java/umlautTest/BasicTest.java:[44,9] cannot find symbol
[ERROR]   symbol:   class Test
[ERROR]   location: class umlautTest.BasicTest
[ERROR] /home/jenkins/jenkins-slave/workspace/box_maven-surefire_SUREFIRE-1617@2/surefire-its/target/UmlautDirIT_surefire1617/src/test/java/umlautTest/BasicTest.java:[47,20] cannot find symbol
[ERROR]   symbol:   class TestSetup
[ERROR]   location: class umlautTest.BasicTest
[ERROR] /home/jenkins/jenkins-slave/workspace/box_maven-surefire_SUREFIRE-1617@2/surefire-its/target/UmlautDirIT_surefire1617/src/test/java/umlautTest/BasicTest.java:[79,9] cannot find symbol
[ERROR]   symbol:   method assertTrue(java.lang.String,boolean)
[ERROR]   location: class umlautTest.BasicTest
[ERROR] /home/jenkins/jenkins-slave/workspace/box_maven-surefire_SUREFIRE-1617@2/surefire-its/target/UmlautDirIT_surefire1617/src/test/java/umlautTest/BasicTest.java:[84,9] cannot find symbol
[ERROR]   symbol:   method assertTrue(java.lang.String,boolean)
[ERROR]   location: class umlautTest.BasicTest
[ERROR] -> [Help 1]
org.apache.maven.lifecycle.LifecycleExecutionException: Failed to execute goal org.apache.maven.plugins:maven-compiler-plugin:3.1:testCompile (default-testCompile) on project junit-path-with-umlaut: Compilation failure
    at org.apache.maven.lifecycle.internal.MojoExecutor.execute (MojoExecutor.java:215)
    at org.apache.maven.lifecycle.internal.MojoExecutor.execute (MojoExecutor.java:156)
    at org.apache.maven.lifecycle.internal.MojoExecutor.execute (MojoExecutor.java:148)
    at org.apache.maven.lifecycle.internal.LifecycleModuleBuilder.buildProject (LifecycleModuleBuilder.java:117)
    at org.apache.maven.lifecycle.internal.LifecycleModuleBuilder.buildProject (LifecycleModuleBuilder.java:81)
    at org.apache.maven.lifecycle.internal.builder.singlethreaded.SingleThreadedBuilder.build (SingleThreadedBuilder.java:56)
    at org.apache.maven.lifecycle.internal.LifecycleStarter.execute (LifecycleStarter.java:128)
    at org.apache.maven.DefaultMaven.doExecute (DefaultMaven.java:305)
    at org.apache.maven.DefaultMaven.doExecute (DefaultMaven.java:192)
    at org.apache.maven.DefaultMaven.execute (DefaultMaven.java:105)
    at org.apache.maven.cli.MavenCli.execute (MavenCli.java:956)
    at org.apache.maven.cli.MavenCli.doMain (MavenCli.java:288)
    at org.apache.maven.cli.MavenCli.main (MavenCli.java:192)
    at jdk.internal.reflect.NativeMethodAccessorImpl.invoke0 (Native Method)
    at jdk.internal.reflect.NativeMethodAccessorImpl.invoke (NativeMethodAccessorImpl.java:62)
    at jdk.internal.reflect.DelegatingMethodAccessorImpl.invoke (DelegatingMethodAccessorImpl.java:43)
    at java.lang.reflect.Method.invoke (Method.java:567)
    at org.codehaus.plexus.classworlds.launcher.Launcher.launchEnhanced (Launcher.java:289)
    at org.codehaus.plexus.classworlds.launcher.Launcher.launch (Launcher.java:229)
    at org.codehaus.plexus.classworlds.launcher.Launcher.mainWithExitCode (Launcher.java:415)
    at org.codehaus.plexus.classworlds.launcher.Launcher.main (Launcher.java:356)
Caused by: org.apache.maven.plugin.compiler.CompilationFailureException: Compilation failure
    at org.apache.maven.plugin.compiler.AbstractCompilerMojo.execute (AbstractCompilerMojo.java:858)
    at org.apache.maven.plugin.compiler.TestCompilerMojo.execute (TestCompilerMojo.java:152)
    at org.apache.maven.plugin.DefaultBuildPluginManager.executeMojo (DefaultBuildPluginManager.java:137)
    at org.apache.maven.lifecycle.internal.MojoExecutor.execute (MojoExecutor.java:210)
    at org.apache.maven.lifecycle.internal.MojoExecutor.execute (MojoExecutor.java:156)
    at org.apache.maven.lifecycle.internal.MojoExecutor.execute (MojoExecutor.java:148)
    at org.apache.maven.lifecycle.internal.LifecycleModuleBuilder.buildProject (LifecycleModuleBuilder.java:117)
    at org.apache.maven.lifecycle.internal.LifecycleModuleBuilder.buildProject (LifecycleModuleBuilder.java:81)
    at org.apache.maven.lifecycle.internal.builder.singlethreaded.SingleThreadedBuilder.build (SingleThreadedBuilder.java:56)
    at org.apache.maven.lifecycle.internal.LifecycleStarter.execute (LifecycleStarter.java:128)
    at org.apache.maven.DefaultMaven.doExecute (DefaultMaven.java:305)
    at org.apache.maven.DefaultMaven.doExecute (DefaultMaven.java:192)
    at org.apache.maven.DefaultMaven.execute (DefaultMaven.java:105)
    at org.apache.maven.cli.MavenCli.execute (MavenCli.java:956)
    at org.apache.maven.cli.MavenCli.doMain (MavenCli.java:288)
    at org.apache.maven.cli.MavenCli.main (MavenCli.java:192)
    at jdk.internal.reflect.NativeMethodAccessorImpl.invoke0 (Native Method)
    at jdk.internal.reflect.NativeMethodAccessorImpl.invoke (NativeMethodAccessorImpl.java:62)
    at jdk.internal.reflect.DelegatingMethodAccessorImpl.invoke (DelegatingMethodAccessorImpl.java:43)
    at java.lang.reflect.Method.invoke (Method.java:567)
    at org.codehaus.plexus.classworlds.launcher.Launcher.launchEnhanced (Launcher.java:289)
    at org.codehaus.plexus.classworlds.launcher.Launcher.launch (Launcher.java:229)
    at org.codehaus.plexus.classworlds.launcher.Launcher.mainWithExitCode (Launcher.java:415)
    at org.codehaus.plexus.classworlds.launcher.Launcher.main (Launcher.java:356)
[ERROR] 
[ERROR] Re-run Maven using the -X switch to enable full debug logging.
[ERROR] 
[ERROR] For more information about the errors and possible solutions, please read the following articles:
[ERROR] [Help 1] http://cwiki.apache.org/confluence/display/MAVEN/MojoFailureException

	at org.apache.maven.surefire.its.UmlautDirIT.surefire1617(UmlautDirIT.java:72)




Build log:
[...truncated 46405 lines...]
[2019-05-09T01:17:46.106Z] [INFO] Downloading from central: https://repo.maven.apache.org/maven2/org/apache/maven/surefire/common-junit48/3.0.0-M3/common-junit48-3.0.0-M3.jar
[2019-05-09T01:17:46.106Z] [INFO] Downloaded from central: https://repo.maven.apache.org/maven2/org/apache/maven/surefire/common-junit4/3.0.0-M3/common-junit4-3.0.0-M3.jar (28 kB at 744 kB/s)
[2019-05-09T01:17:46.106Z] [INFO] Downloading from central: https://repo.maven.apache.org/maven2/org/apache/maven/surefire/surefire-grouper/3.0.0-M3/surefire-grouper-3.0.0-M3.jar
[2019-05-09T01:17:46.106Z] [INFO] Downloaded from central: https://repo.maven.apache.org/maven2/org/apache/maven/surefire/common-junit3/3.0.0-M3/common-junit3-3.0.0-M3.jar (12 kB at 298 kB/s)
[2019-05-09T01:17:46.106Z] [INFO] Downloaded from central: https://repo.maven.apache.org/maven2/org/apache/maven/surefire/common-java5/3.0.0-M3/common-java5-3.0.0-M3.jar (32 kB at 685 kB/s)
[2019-05-09T01:17:46.106Z] [INFO] Downloaded from central: https://repo.maven.apache.org/maven2/org/apache/maven/surefire/common-junit48/3.0.0-M3/common-junit48-3.0.0-M3.jar (22 kB at 121 kB/s)
[2019-05-09T01:17:46.106Z] [INFO] Downloaded from central: https://repo.maven.apache.org/maven2/org/apache/maven/surefire/surefire-junit47/3.0.0-M3/surefire-junit47-3.0.0-M3.jar (93 kB at 454 kB/s)
[2019-05-09T01:17:46.407Z] [INFO] Downloaded from central: https://repo.maven.apache.org/maven2/org/apache/maven/surefire/surefire-grouper/3.0.0-M3/surefire-grouper-3.0.0-M3.jar (40 kB at 131 kB/s)
[2019-05-09T01:17:46.715Z] [INFO] Failsafe report directory: C:\Users\jenkins\AppData\Local\Temp\2\jenkins-maven-box-maven-surefire-SUREFIRE-1617-12\surefire-its\target\failsafe-reports
[2019-05-09T01:17:46.715Z] [INFO] Using configured provider org.apache.maven.surefire.junitcore.JUnitCoreProvider
[2019-05-09T01:17:46.715Z] [INFO] parallel='none', perCoreThreadCount=false, threadCount=1, useUnlimitedThreads=false, threadCountSuites=0, threadCountClasses=0, threadCountMethods=0, parallelOptimized=true
[2019-05-09T01:17:47.364Z] [INFO] 
[2019-05-09T01:17:47.364Z] [INFO] -------------------------------------------------------
[2019-05-09T01:17:47.364Z] [INFO]  T E S T S
[2019-05-09T01:17:47.364Z] [INFO] -------------------------------------------------------
[2019-05-09T01:17:48.417Z] [INFO] Running org.apache.maven.surefire.its.UmlautDirIT
[2019-05-09T01:17:59.293Z] [WARNING] Tests run: 3, Failures: 0, Errors: 0, Skipped: 1, Time elapsed: 24.526 s - in org.apache.maven.surefire.its.UmlautDirIT
[2019-05-09T01:17:59.293Z] [INFO] 
[2019-05-09T01:17:59.293Z] [INFO] Results:
[2019-05-09T01:17:59.293Z] [INFO] 
[2019-05-09T01:17:59.293Z] [WARNING] Tests run: 3, Failures: 0, Errors: 0, Skipped: 1
[2019-05-09T01:17:59.293Z] [INFO] 
[2019-05-09T01:17:59.293Z] [INFO] 
[2019-05-09T01:17:59.293Z] [INFO] --- maven-checkstyle-plugin:3.0.0:check (checkstyle-check) @ surefire-its ---
[2019-05-09T01:17:59.293Z] [INFO] 
[2019-05-09T01:17:59.293Z] [INFO] --- maven-failsafe-plugin:3.0.0-M3:verify (default) @ surefire-its ---
[2019-05-09T01:17:59.293Z] [INFO] Failsafe report directory: C:\Users\jenkins\AppData\Local\Temp\2\jenkins-maven-box-maven-surefire-SUREFIRE-1617-12\surefire-its\target\failsafe-reports
[2019-05-09T01:17:59.293Z] [INFO] 
[2019-05-09T01:17:59.293Z] [INFO] --- maven-install-plugin:2.5.2:install (default-install) @ surefire-its ---
[2019-05-09T01:17:59.293Z] [INFO] Skipping artifact installation
[2019-05-09T01:17:59.293Z] [INFO] ------------------------------------------------------------------------
[2019-05-09T01:17:59.293Z] [INFO] Reactor Summary for Apache Maven Surefire 3.0.0-SNAPSHOT:
[2019-05-09T01:17:59.293Z] [INFO] 
[2019-05-09T01:17:59.293Z] [INFO] Apache Maven Surefire .............................. SUCCESS [01:09 min]
[2019-05-09T01:17:59.293Z] [INFO] SureFire Logger API ................................ SUCCESS [ 10.840 s]
[2019-05-09T01:17:59.293Z] [INFO] SureFire API ....................................... SUCCESS [ 25.091 s]
[2019-05-09T01:17:59.293Z] [INFO] SureFire Booter .................................... SUCCESS [ 22.621 s]
[2019-05-09T01:17:59.293Z] [INFO] Maven Surefire Test-Grouping Support ............... SUCCESS [ 14.701 s]
[2019-05-09T01:17:59.293Z] [INFO] SureFire Providers ................................. SUCCESS [  1.663 s]
[2019-05-09T01:17:59.293Z] [INFO] Shared JUnit3 Provider Code ........................ SUCCESS [  6.871 s]
[2019-05-09T01:17:59.293Z] [INFO] Shared Java 5 Provider Base ........................ SUCCESS [ 10.068 s]
[2019-05-09T01:17:59.293Z] [INFO] Shared JUnit4 Provider Code ........................ SUCCESS [  9.053 s]
[2019-05-09T01:17:59.293Z] [INFO] Shared JUnit48 Provider Code ....................... SUCCESS [  9.304 s]
[2019-05-09T01:17:59.293Z] [INFO] SureFire JUnit Runner .............................. SUCCESS [  7.491 s]
[2019-05-09T01:17:59.293Z] [INFO] SureFire JUnit4 Runner ............................. SUCCESS [  7.427 s]
[2019-05-09T01:17:59.293Z] [INFO] Maven Surefire Common .............................. SUCCESS [ 43.701 s]
[2019-05-09T01:17:59.293Z] [INFO] SureFire JUnitCore Runner .......................... SUCCESS [02:21 min]
[2019-05-09T01:17:59.293Z] [INFO] SureFire JUnit Platform Runner ..................... SUCCESS [ 15.395 s]
[2019-05-09T01:17:59.293Z] [INFO] SureFire TestNG Utils .............................. SUCCESS [  8.163 s]
[2019-05-09T01:17:59.293Z] [INFO] SureFire TestNG Runner ............................. SUCCESS [  9.237 s]
[2019-05-09T01:17:59.293Z] [INFO] ShadeFire JUnit3 Provider .......................... SUCCESS [  2.700 s]
[2019-05-09T01:17:59.293Z] [INFO] Surefire Report Parser ............................. SUCCESS [ 10.978 s]
[2019-05-09T01:17:59.293Z] [INFO] Maven Surefire Plugin .............................. SUCCESS [ 17.971 s]
[2019-05-09T01:17:59.293Z] [INFO] Maven Failsafe Plugin .............................. SUCCESS [02:13 min]
[2019-05-09T01:17:59.293Z] [INFO] Maven Surefire Report Plugin ....................... SUCCESS [ 21.477 s]
[2019-05-09T01:17:59.293Z] [INFO] Maven Surefire Integration Tests ................... SUCCESS [01:11 min]
[2019-05-09T01:17:59.293Z] [INFO] ------------------------------------------------------------------------
[2019-05-09T01:17:59.293Z] [INFO] BUILD SUCCESS
[2019-05-09T01:17:59.293Z] [INFO] ------------------------------------------------------------------------
[2019-05-09T01:17:59.293Z] [INFO] Total time:  11:13 min
[2019-05-09T01:17:59.293Z] [INFO] Finished at: 2019-05-08T18:17:58-07:00
[2019-05-09T01:17:59.293Z] [INFO] ------------------------------------------------------------------------
[2019-05-09T01:17:59.305Z] [WARNING] Tests run: 3, Failures: 0, Errors: 0, Skipped: 1, Time elapsed: 24.31 s - in org.apache.maven.surefire.its.UmlautDirIT
[2019-05-09T01:17:59.305Z] [INFO] 
[2019-05-09T01:17:59.305Z] [INFO] Results:
[2019-05-09T01:17:59.305Z] [INFO] 
[2019-05-09T01:17:59.305Z] [WARNING] Tests run: 3, Failures: 0, Errors: 0, Skipped: 1
[2019-05-09T01:17:59.305Z] [INFO] 
[2019-05-09T01:17:59.305Z] [INFO] 
[2019-05-09T01:17:59.305Z] [INFO] --- maven-checkstyle-plugin:3.0.0:check (checkstyle-check) @ surefire-its ---
[2019-05-09T01:17:59.305Z] [INFO] 
[2019-05-09T01:17:59.305Z] [INFO] --- maven-failsafe-plugin:3.0.0-M3:verify (default) @ surefire-its ---
[2019-05-09T01:17:59.305Z] [INFO] Failsafe report directory: C:\Users\jenkins\AppData\Local\Temp\2\jenkins-maven-box-maven-surefire-SUREFIRE-1617-12@2\surefire-its\target\failsafe-reports
[2019-05-09T01:17:59.305Z] [INFO] 
[2019-05-09T01:17:59.305Z] [INFO] --- maven-install-plugin:2.5.2:install (default-install) @ surefire-its ---
[2019-05-09T01:17:59.305Z] [INFO] Skipping artifact installation
[2019-05-09T01:17:59.305Z] [INFO] ------------------------------------------------------------------------
[2019-05-09T01:17:59.305Z] [INFO] Reactor Summary for Apache Maven Surefire 3.0.0-SNAPSHOT:
[2019-05-09T01:17:59.305Z] [INFO] 
[2019-05-09T01:17:59.305Z] [INFO] Apache Maven Surefire .............................. SUCCESS [01:09 min]
[2019-05-09T01:17:59.305Z] [INFO] SureFire Logger API ................................ SUCCESS [ 10.802 s]
[2019-05-09T01:17:59.305Z] [INFO] SureFire API ....................................... SUCCESS [ 25.202 s]
[2019-05-09T01:17:59.305Z] [INFO] SureFire Booter .................................... SUCCESS [ 22.961 s]
[2019-05-09T01:17:59.305Z] [INFO] Maven Surefire Test-Grouping Support ............... SUCCESS [ 14.495 s]
[2019-05-09T01:17:59.305Z] [INFO] SureFire Providers ................................. SUCCESS [  1.537 s]
[2019-05-09T01:17:59.305Z] [INFO] Shared JUnit3 Provider Code ........................ SUCCESS [  7.271 s]
[2019-05-09T01:17:59.305Z] [INFO] Shared Java 5 Provider Base ........................ SUCCESS [  9.176 s]
[2019-05-09T01:17:59.305Z] [INFO] Shared JUnit4 Provider Code ........................ SUCCESS [  9.259 s]
[2019-05-09T01:17:59.305Z] [INFO] Shared JUnit48 Provider Code ....................... SUCCESS [ 10.573 s]
[2019-05-09T01:17:59.305Z] [INFO] SureFire JUnit Runner .............................. SUCCESS [  7.317 s]
[2019-05-09T01:17:59.305Z] [INFO] SureFire JUnit4 Runner ............................. SUCCESS [  7.380 s]
[2019-05-09T01:17:59.305Z] [INFO] Maven Surefire Common .............................. SUCCESS [ 43.183 s]
[2019-05-09T01:17:59.305Z] [INFO] SureFire JUnitCore Runner .......................... SUCCESS [02:21 min]
[2019-05-09T01:17:59.305Z] [INFO] SureFire JUnit Platform Runner ..................... SUCCESS [ 15.233 s]
[2019-05-09T01:17:59.305Z] [INFO] SureFire TestNG Utils .............................. SUCCESS [  8.268 s]
[2019-05-09T01:17:59.305Z] [INFO] SureFire TestNG Runner ............................. SUCCESS [  9.125 s]
[2019-05-09T01:17:59.305Z] [INFO] ShadeFire JUnit3 Provider .......................... SUCCESS [  2.785 s]
[2019-05-09T01:17:59.305Z] [INFO] Surefire Report Parser ............................. SUCCESS [ 10.772 s]
[2019-05-09T01:17:59.305Z] [INFO] Maven Surefire Plugin .............................. SUCCESS [ 18.481 s]
[2019-05-09T01:17:59.305Z] [INFO] Maven Failsafe Plugin .............................. SUCCESS [02:14 min]
[2019-05-09T01:17:59.305Z] [INFO] Maven Surefire Report Plugin ....................... SUCCESS [ 20.831 s]
[2019-05-09T01:17:59.305Z] [INFO] Maven Surefire Integration Tests ................... SUCCESS [01:11 min]
[2019-05-09T01:17:59.305Z] [INFO] ------------------------------------------------------------------------
[2019-05-09T01:17:59.305Z] [INFO] BUILD SUCCESS
[2019-05-09T01:17:59.305Z] [INFO] ------------------------------------------------------------------------
[2019-05-09T01:17:59.305Z] [INFO] Total time:  11:12 min
[2019-05-09T01:17:59.305Z] [INFO] Finished at: 2019-05-08T18:17:58-07:00
[2019-05-09T01:17:59.305Z] [INFO] ------------------------------------------------------------------------
[Pipeline] }
[Pipeline] // withEnv
[Pipeline] }
[Pipeline] }
[Pipeline] // stage
[Pipeline] // withEnv
[Pipeline] fileExists
[Pipeline] }
[Pipeline] // stage
[Pipeline] zip
[Pipeline] fileExists
[Pipeline] zip
[2019-05-09T01:17:59.584Z] Writing zip file of C:\Users\jenkins\AppData\Local\Temp\2\jenkins-maven-box-maven-surefire-SUREFIRE-1617-12\maven-failsafe-plugin\target\it to C:\Users\jenkins\AppData\Local\Temp\2\jenkins-maven-box-maven-surefire-SUREFIRE-1617-12\maven-failsafe-plugin--windows-jdk12-maven3.6.x.zip
[2019-05-09T01:17:59.619Z] Writing zip file of C:\Users\jenkins\AppData\Local\Temp\2\jenkins-maven-box-maven-surefire-SUREFIRE-1617-12@2\maven-failsafe-plugin\target\it to C:\Users\jenkins\AppData\Local\Temp\2\jenkins-maven-box-maven-surefire-SUREFIRE-1617-12@2\maven-failsafe-plugin--windows-jdk11-maven3.6.x.zip
[2019-05-09T01:17:59.805Z] Zipped 79 entries.
[2019-05-09T01:17:59.806Z] Archiving C:\Users\jenkins\AppData\Local\Temp\2\jenkins-maven-box-maven-surefire-SUREFIRE-1617-12\maven-failsafe-plugin--windows-jdk12-maven3.6.x.zip
[2019-05-09T01:17:59.806Z] [Fast Archiver] No artifacts from Maven TLP » maven-surefire » SUREFIRE-1617 #10 to compare, so performing full copy of artifacts
[2019-05-09T01:17:59.863Z] Zipped 78 entries.
[2019-05-09T01:17:59.863Z] Archiving C:\Users\jenkins\AppData\Local\Temp\2\jenkins-maven-box-maven-surefire-SUREFIRE-1617-12@2\maven-failsafe-plugin--windows-jdk11-maven3.6.x.zip
[2019-05-09T01:17:59.864Z] [Fast Archiver] No artifacts from Maven TLP » maven-surefire » SUREFIRE-1617 #10 to compare, so performing full copy of artifacts
[Pipeline] fileExists
[Pipeline] zip
[Pipeline] fileExists
[2019-05-09T01:17:59.972Z] Writing zip file of C:\Users\jenkins\AppData\Local\Temp\2\jenkins-maven-box-maven-surefire-SUREFIRE-1617-12\surefire-its\target to C:\Users\jenkins\AppData\Local\Temp\2\jenkins-maven-box-maven-surefire-SUREFIRE-1617-12\surefire-its--windows-jdk12-maven3.6.x.zip
[Pipeline] zip
[2019-05-09T01:18:00.069Z] Writing zip file of C:\Users\jenkins\AppData\Local\Temp\2\jenkins-maven-box-maven-surefire-SUREFIRE-1617-12@2\surefire-its\target to C:\Users\jenkins\AppData\Local\Temp\2\jenkins-maven-box-maven-surefire-SUREFIRE-1617-12@2\surefire-its--windows-jdk11-maven3.6.x.zip
[2019-05-09T01:18:02.531Z] Zipped 1917 entries.
[2019-05-09T01:18:02.532Z] Archiving C:\Users\jenkins\AppData\Local\Temp\2\jenkins-maven-box-maven-surefire-SUREFIRE-1617-12@2\surefire-its--windows-jdk11-maven3.6.x.zip
[2019-05-09T01:18:02.532Z] [Fast Archiver] No artifacts from Maven TLP » maven-surefire » SUREFIRE-1617 #10 to compare, so performing full copy of artifacts
[2019-05-09T01:18:02.555Z] Zipped 1917 entries.
[2019-05-09T01:18:02.555Z] Archiving C:\Users\jenkins\AppData\Local\Temp\2\jenkins-maven-box-maven-surefire-SUREFIRE-1617-12\surefire-its--windows-jdk12-maven3.6.x.zip
[2019-05-09T01:18:02.556Z] [Fast Archiver] No artifacts from Maven TLP » maven-surefire » SUREFIRE-1617 #10 to compare, so performing full copy of artifacts
[Pipeline] archiveArtifacts
[2019-05-09T01:18:02.873Z] Archiving artifacts
[Pipeline] archiveArtifacts
[2019-05-09T01:18:02.913Z] Archiving artifacts
[2019-05-09T01:18:02.916Z] [Fast Archiver] No artifacts from Maven TLP » maven-surefire » SUREFIRE-1617 #10 to compare, so performing full copy of artifacts
[2019-05-09T01:18:02.950Z] [Fast Archiver] No artifacts from Maven TLP » maven-surefire » SUREFIRE-1617 #10 to compare, so performing full copy of artifacts
[Pipeline] cleanWs
[Pipeline] cleanWs
[2019-05-09T01:18:03.325Z] [WS-CLEANUP] Deleting project workspace...
[2019-05-09T01:18:03.325Z] [WS-CLEANUP] Deferred wipeout is used...
[2019-05-09T01:18:03.339Z] [WS-CLEANUP] Deleting project workspace...
[2019-05-09T01:18:03.339Z] [WS-CLEANUP] Deferred wipeout is used...
[2019-05-09T01:18:03.454Z] [WS-CLEANUP] done
[Pipeline] }
[2019-05-09T01:18:03.465Z] [WS-CLEANUP] done
[Pipeline] // ws
[Pipeline] }
[Pipeline] }
[Pipeline] // ws
[Pipeline] // timestamps
[Pipeline] }
[Pipeline] }
[Pipeline] // timestamps
[Pipeline] // node
[Pipeline] }
[Pipeline] }
[Pipeline] // node
[Pipeline] }
[2019-05-09T01:18:15.647Z] [WARNING] Tests run: 3, Failures: 0, Errors: 0, Skipped: 1, Time elapsed: 23.747 s - in org.apache.maven.surefire.its.UmlautDirIT
[2019-05-09T01:18:15.647Z] [INFO] 
[2019-05-09T01:18:15.647Z] [INFO] Results:
[2019-05-09T01:18:15.647Z] [INFO] 
[2019-05-09T01:18:15.647Z] [WARNING] Tests run: 3, Failures: 0, Errors: 0, Skipped: 1
[2019-05-09T01:18:15.647Z] [INFO] 
[2019-05-09T01:18:15.647Z] [INFO] 
[2019-05-09T01:18:15.647Z] [INFO] --- maven-checkstyle-plugin:3.0.0:check (checkstyle-check) @ surefire-its ---
[2019-05-09T01:18:15.647Z] [INFO] 
[2019-05-09T01:18:15.647Z] [INFO] --- maven-failsafe-plugin:3.0.0-M3:verify (default) @ surefire-its ---
[2019-05-09T01:18:15.647Z] [INFO] Failsafe report directory: C:\Users\jenkins\AppData\Local\Temp\2\jenkins-maven-box-maven-surefire-SUREFIRE-1617-12\surefire-its\target\failsafe-reports
[2019-05-09T01:18:15.647Z] [INFO] 
[2019-05-09T01:18:15.647Z] [INFO] --- maven-install-plugin:2.5.2:install (default-install) @ surefire-its ---
[2019-05-09T01:18:15.647Z] [INFO] Skipping artifact installation
[2019-05-09T01:18:15.647Z] [INFO] ------------------------------------------------------------------------
[2019-05-09T01:18:15.647Z] [INFO] Reactor Summary for Apache Maven Surefire 3.0.0-SNAPSHOT:
[2019-05-09T01:18:15.647Z] [INFO] 
[2019-05-09T01:18:15.647Z] [INFO] Apache Maven Surefire .............................. SUCCESS [01:00 min]
[2019-05-09T01:18:15.647Z] [INFO] SureFire Logger API ................................ SUCCESS [ 11.219 s]
[2019-05-09T01:18:15.647Z] [INFO] SureFire API ....................................... SUCCESS [ 21.332 s]
[2019-05-09T01:18:15.647Z] [INFO] SureFire Booter .................................... SUCCESS [ 21.434 s]
[2019-05-09T01:18:15.648Z] [INFO] Maven Surefire Test-Grouping Support ............... SUCCESS [ 13.058 s]
[2019-05-09T01:18:15.648Z] [INFO] SureFire Providers ................................. SUCCESS [  1.885 s]
[2019-05-09T01:18:15.648Z] [INFO] Shared JUnit3 Provider Code ........................ SUCCESS [  7.279 s]
[2019-05-09T01:18:15.648Z] [INFO] Shared Java 5 Provider Base ........................ SUCCESS [  9.058 s]
[2019-05-09T01:18:15.648Z] [INFO] Shared JUnit4 Provider Code ........................ SUCCESS [  8.845 s]
[2019-05-09T01:18:15.648Z] [INFO] Shared JUnit48 Provider Code ....................... SUCCESS [  9.559 s]
[2019-05-09T01:18:15.648Z] [INFO] SureFire JUnit Runner .............................. SUCCESS [  7.627 s]
[2019-05-09T01:18:15.648Z] [INFO] SureFire JUnit4 Runner ............................. SUCCESS [ 37.541 s]
[2019-05-09T01:18:15.648Z] [INFO] Maven Surefire Common .............................. SUCCESS [ 41.975 s]
[2019-05-09T01:18:15.648Z] [INFO] SureFire JUnitCore Runner .......................... SUCCESS [02:25 min]
[2019-05-09T01:18:15.648Z] [INFO] SureFire JUnit Platform Runner ..................... SUCCESS [ 14.938 s]
[2019-05-09T01:18:15.648Z] [INFO] SureFire TestNG Utils .............................. SUCCESS [  8.043 s]
[2019-05-09T01:18:15.648Z] [INFO] SureFire TestNG Runner ............................. SUCCESS [  9.122 s]
[2019-05-09T01:18:15.648Z] [INFO] ShadeFire JUnit3 Provider .......................... SUCCESS [  2.911 s]
[2019-05-09T01:18:15.648Z] [INFO] Surefire Report Parser ............................. SUCCESS [ 10.533 s]
[2019-05-09T01:18:15.648Z] [INFO] Maven Surefire Plugin .............................. SUCCESS [ 19.515 s]
[2019-05-09T01:18:15.648Z] [INFO] Maven Failsafe Plugin .............................. SUCCESS [02:10 min]
[2019-05-09T01:18:15.648Z] [INFO] Maven Surefire Report Plugin ....................... SUCCESS [ 22.711 s]
[2019-05-09T01:18:15.648Z] [INFO] Maven Surefire Integration Tests ................... SUCCESS [01:11 min]
[2019-05-09T01:18:15.648Z] [INFO] ------------------------------------------------------------------------
[2019-05-09T01:18:15.648Z] [INFO] BUILD SUCCESS
[2019-05-09T01:18:15.648Z] [INFO] ------------------------------------------------------------------------
[2019-05-09T01:18:15.648Z] [INFO] Total time:  11:28 min
[2019-05-09T01:18:15.648Z] [INFO] Finished at: 2019-05-08T18:18:14-07:00
[2019-05-09T01:18:15.648Z] [INFO] ------------------------------------------------------------------------
[Pipeline] }
[Pipeline] // withEnv
[Pipeline] }
[Pipeline] // stage
[Pipeline] fileExists
[Pipeline] zip
[2019-05-09T01:18:15.930Z] Writing zip file of C:\Users\jenkins\AppData\Local\Temp\2\jenkins-maven-box-maven-surefire-SUREFIRE-1617-12\maven-failsafe-plugin\target\it to C:\Users\jenkins\AppData\Local\Temp\2\jenkins-maven-box-maven-surefire-SUREFIRE-1617-12\maven-failsafe-plugin--windows-jdk7-maven3.6.x.zip
[2019-05-09T01:18:16.104Z] Zipped 78 entries.
[2019-05-09T01:18:16.104Z] Archiving C:\Users\jenkins\AppData\Local\Temp\2\jenkins-maven-box-maven-surefire-SUREFIRE-1617-12\maven-failsafe-plugin--windows-jdk7-maven3.6.x.zip
[2019-05-09T01:18:16.104Z] [Fast Archiver] No artifacts from Maven TLP » maven-surefire » SUREFIRE-1617 #10 to compare, so performing full copy of artifacts
[Pipeline] fileExists
[Pipeline] zip
[2019-05-09T01:18:16.240Z] Writing zip file of C:\Users\jenkins\AppData\Local\Temp\2\jenkins-maven-box-maven-surefire-SUREFIRE-1617-12\surefire-its\target to C:\Users\jenkins\AppData\Local\Temp\2\jenkins-maven-box-maven-surefire-SUREFIRE-1617-12\surefire-its--windows-jdk7-maven3.6.x.zip
[2019-05-09T01:18:18.587Z] Zipped 1917 entries.
[2019-05-09T01:18:18.587Z] Archiving C:\Users\jenkins\AppData\Local\Temp\2\jenkins-maven-box-maven-surefire-SUREFIRE-1617-12\surefire-its--windows-jdk7-maven3.6.x.zip
[2019-05-09T01:18:18.588Z] [Fast Archiver] No artifacts from Maven TLP » maven-surefire » SUREFIRE-1617 #10 to compare, so performing full copy of artifacts
[Pipeline] archiveArtifacts
[2019-05-09T01:18:18.996Z] Archiving artifacts
[2019-05-09T01:18:19.013Z] [Fast Archiver] No artifacts from Maven TLP » maven-surefire » SUREFIRE-1617 #10 to compare, so performing full copy of artifacts
[Pipeline] cleanWs
[2019-05-09T01:18:19.478Z] [WS-CLEANUP] Deleting project workspace...
[2019-05-09T01:18:19.478Z] [WS-CLEANUP] Deferred wipeout is used...
[2019-05-09T01:18:19.565Z] [WS-CLEANUP] done
[Pipeline] }
[Pipeline] // ws
[Pipeline] }
[Pipeline] // timestamps
[Pipeline] }
[Pipeline] // node
[Pipeline] }
[Pipeline] // parallel
[Pipeline] echo
Build result: FAILURE
[Pipeline] jiraIssueSelector
[Pipeline] emailext
Mime
  • Unnamed multipart/mixed (inline, None, 0 bytes)
View raw message