maven-notifications mailing list archives

Site index · List index
Message view « Date » · « Thread »
Top « Date » · « Thread »
From Apache Jenkins Server <jenk...@builds.apache.org>
Subject Build failed in Jenkins: Maven TLP » maven-deploy-plugin » MDEPLOY-256 #2
Date Sun, 02 Jun 2019 19:55:22 GMT
See https://builds.apache.org/job/maven-box/job/maven-deploy-plugin/job/MDEPLOY-256/2/

Changes:

* fixed typo
* Include more recent JDKs

No tests ran.

Build log:
[...truncated 3024 lines...]
[Pipeline] { (Checkout windows-jdk13-m3.6.x_build)
[Pipeline] dir
Running in f:\jenkins\jenkins-slave\workspace\_maven-deploy-plugin_MDEPLOY-256@2\windows-jdk13-m3.6.x_build
[Pipeline] {
[Pipeline] checkout
No credentials specified
Cloning the remote Git repository
Cloning with configured refspecs honoured and without tags
Cloning repository https://gitbox.apache.org/repos/asf/maven-deploy-plugin.git
 > git init f:\jenkins\jenkins-slave\workspace\_maven-deploy-plugin_MDEPLOY-256@2\windows-jdk13-m3.6.x_build
# timeout=10
Fetching upstream changes from https://gitbox.apache.org/repos/asf/maven-deploy-plugin.git
 > git --version # timeout=10
 > git fetch --no-tags --progress https://gitbox.apache.org/repos/asf/maven-deploy-plugin.git
+refs/heads/*:refs/remotes/origin/*
Fetching without tags
 > git config remote.origin.url https://gitbox.apache.org/repos/asf/maven-deploy-plugin.git
# timeout=10
 > git config --add remote.origin.fetch +refs/heads/*:refs/remotes/origin/* # timeout=10
 > git config remote.origin.url https://gitbox.apache.org/repos/asf/maven-deploy-plugin.git
# timeout=10
Fetching upstream changes from https://gitbox.apache.org/repos/asf/maven-deploy-plugin.git
 > git fetch --no-tags --progress https://gitbox.apache.org/repos/asf/maven-deploy-plugin.git
+refs/heads/*:refs/remotes/origin/*
Checking out Revision 2490977455721943b2daf5a33d794cf3a27b5e84 (MDEPLOY-256)
Commit message: "[MDEPLOY-256] - Upgrade plexus-utils to 3.2.1"
Cleaning workspace
[Pipeline] }
[Pipeline] // dir
[Pipeline] }
[Pipeline] // stage
 > git config core.sparsecheckout # timeout=10
 > git checkout -f 2490977455721943b2daf5a33d794cf3a27b5e84
 > git rev-parse --verify HEAD # timeout=10
Resetting working tree
 > git reset --hard # timeout=10
 > git clean -fdx # timeout=10
[Pipeline] stage
[Pipeline] { (Build windows-jdk13-m3.6.x_build)
[Pipeline] withMaven
[withMaven] Options: [org.jenkinsci.plugins.pipeline.maven.publishers.GeneratedArtifactsPublisher[disabled=false],
JunitTestsPublisher[disabled=false,healthScaleFactor=,keepLongStdio=false,ignoreAttachments=false],
org.jenkinsci.plugins.pipeline.maven.publishers.FindbugsAnalysisPublisher[disabled='false',
healthy='', unHealthy='', thresholdLimit='low'], org.jenkinsci.plugins.pipeline.maven.publishers.TasksScannerPublisher[disabled='false',
healthy='', unHealthy='', thresholdLimit='low'], org.jenkinsci.plugins.pipeline.maven.publishers.DependenciesFingerprintPublisher[disabled=false,
scopes=[compile, provided, runtime], versions={snapshot:true, release:false}], org.jenkinsci.plugins.pipeline.maven.publishers.InvokerRunsPublisher[disabled=false],
org.jenkinsci.plugins.pipeline.maven.publishers.PipelineGraphPublisher[disabled=false, scopes=[compile,
provided, runtime], versions={snapshot:true, release:false}, skipDownstreamTriggers=false,
lifecycleThreshold=deploy, ignoreUpstreamTriggers=false], org.jenkinsci.plugins.pipeline.maven.publishers.MavenLinkerPublisher2[disabled=false]]
[withMaven] Available options: 
[withMaven] using JDK installation JDK 13 (latest)
[withMaven] using Maven installation 'Maven 3.6.0 (Windows)'
[Pipeline] {
[Pipeline] dir
Running in f:\jenkins\jenkins-slave\workspace\_maven-deploy-plugin_MDEPLOY-256@2\windows-jdk13-m3.6.x_build
[Pipeline] {
[Pipeline] isUnix
[Pipeline] bat

f:\jenkins\jenkins-slave\workspace\_maven-deploy-plugin_MDEPLOY-256@2\windows-jdk13-m3.6.x_build>mvn
-P+run-its -Dmaven.test.failure.ignore=true -Dfindbugs.failOnError=false -e clean verify 
----- withMaven Wrapper script -----
Picked up JAVA_TOOL_OPTIONS: -Dmaven.ext.class.path="f:\jenkins\jenkins-slave\workspace\_maven-deploy-plugin_MDEPLOY-256@2@tmp\withMavenbb900f72\pipeline-maven-spy.jar"
-Dorg.jenkinsci.plugins.pipeline.maven.reportsFolder="f:\jenkins\jenkins-slave\workspace\_maven-deploy-plugin_MDEPLOY-256@2@tmp\withMavenbb900f72"

Apache Maven 3.6.0 (97c98ec64a1fdfee7767ce5ffb20918da4f719f3; 2018-10-24T18:41:47Z)
Maven home: F:\jenkins\tools\maven\apache-maven-3.6.0\bin\..
Java version: 13-ea, vendor: Oracle Corporation, runtime: f:\jenkins\tools\java\latest13
Default locale: en_US, platform encoding: Cp1252
OS name: "windows server 2012 r2", version: "6.3", arch: "amd64", family: "windows"
[INFO] [jenkins-event-spy] Generate F:\jenkins\jenkins-slave\workspace\_maven-deploy-plugin_MDEPLOY-256@2@tmp\withMavenbb900f72\maven-spy-20190602-195517-71017862825175214862741.log.tmp
...
[INFO] Error stacktraces are turned on.
[INFO] Scanning for projects...
[INFO] 
[INFO] ------------< org.apache.maven.plugins:maven-deploy-plugin >------------
[INFO] Building Apache Maven Deploy Plugin 3.0.0-M2-SNAPSHOT
[INFO] ----------------------------[ maven-plugin ]----------------------------
[WARNING] The POM for org.codehaus.plexus:plexus-utils:jar:3.2.1 is missing, no dependency
information available
[INFO] ------------------------------------------------------------------------
[INFO] BUILD FAILURE
[INFO] ------------------------------------------------------------------------
[INFO] Total time:  1.445 s
[INFO] Finished at: 2019-06-02T19:55:19Z
[INFO] ------------------------------------------------------------------------
[INFO] [jenkins-event-spy] Generated F:\jenkins\jenkins-slave\workspace\_maven-deploy-plugin_MDEPLOY-256@2@tmp\withMavenbb900f72\maven-spy-20190602-195517-71017862825175214862741.log
[ERROR] Failed to execute goal on project maven-deploy-plugin: Could not resolve dependencies
for project org.apache.maven.plugins:maven-deploy-plugin:maven-plugin:3.0.0-M2-SNAPSHOT: Failure
to find org.codehaus.plexus:plexus-utils:jar:3.2.1 in https://repo.maven.apache.org/maven2
was cached in the local repository, resolution will not be reattempted until the update interval
of central has elapsed or updates are forced -> [Help 1]
org.apache.maven.lifecycle.LifecycleExecutionException: Failed to execute goal on project
maven-deploy-plugin: Could not resolve dependencies for project org.apache.maven.plugins:maven-deploy-plugin:maven-plugin:3.0.0-M2-SNAPSHOT:
Failure to find org.codehaus.plexus:plexus-utils:jar:3.2.1 in https://repo.maven.apache.org/maven2
was cached in the local repository, resolution will not be reattempted until the update interval
of central has elapsed or updates are forced
    at org.apache.maven.lifecycle.internal.LifecycleDependencyResolver.getDependencies (LifecycleDependencyResolver.java:269)
    at org.apache.maven.lifecycle.internal.LifecycleDependencyResolver.resolveProjectDependencies
(LifecycleDependencyResolver.java:147)
    at org.apache.maven.lifecycle.internal.MojoExecutor.ensureDependenciesAreResolved (MojoExecutor.java:248)
    at org.apache.maven.lifecycle.internal.MojoExecutor.execute (MojoExecutor.java:202)
    at org.apache.maven.lifecycle.internal.MojoExecutor.execute (MojoExecutor.java:156)
    at org.apache.maven.lifecycle.internal.MojoExecutor.execute (MojoExecutor.java:148)
    at org.apache.maven.lifecycle.internal.LifecycleModuleBuilder.buildProject (LifecycleModuleBuilder.java:117)
    at org.apache.maven.lifecycle.internal.LifecycleModuleBuilder.buildProject (LifecycleModuleBuilder.java:81)
    at org.apache.maven.lifecycle.internal.builder.singlethreaded.SingleThreadedBuilder.build
(SingleThreadedBuilder.java:56)
    at org.apache.maven.lifecycle.internal.LifecycleStarter.execute (LifecycleStarter.java:128)
    at org.apache.maven.DefaultMaven.doExecute (DefaultMaven.java:305)
    at org.apache.maven.DefaultMaven.doExecute (DefaultMaven.java:192)
    at org.apache.maven.DefaultMaven.execute (DefaultMaven.java:105)
    at org.apache.maven.cli.MavenCli.execute (MavenCli.java:956)
    at org.apache.maven.cli.MavenCli.doMain (MavenCli.java:288)
    at org.apache.maven.cli.MavenCli.main (MavenCli.java:192)
    at jdk.internal.reflect.NativeMethodAccessorImpl.invoke0 (Native Method)
    at jdk.internal.reflect.NativeMethodAccessorImpl.invoke (NativeMethodAccessorImpl.java:62)
    at jdk.internal.reflect.DelegatingMethodAccessorImpl.invoke (DelegatingMethodAccessorImpl.java:43)
    at java.lang.reflect.Method.invoke (Method.java:567)
    at org.codehaus.plexus.classworlds.launcher.Launcher.launchEnhanced (Launcher.java:289)
    at org.codehaus.plexus.classworlds.launcher.Launcher.launch (Launcher.java:229)
    at org.codehaus.plexus.classworlds.launcher.Launcher.mainWithExitCode (Launcher.java:415)
    at org.codehaus.plexus.classworlds.launcher.Launcher.main (Launcher.java:356)
Caused by: org.apache.maven.project.DependencyResolutionException: Could not resolve dependencies
for project org.apache.maven.plugins:maven-deploy-plugin:maven-plugin:3.0.0-M2-SNAPSHOT: Failure
to find org.codehaus.plexus:plexus-utils:jar:3.2.1 in https://repo.maven.apache.org/maven2
was cached in the local repository, resolution will not be reattempted until the update interval
of central has elapsed or updates are forced
    at org.apache.maven.project.DefaultProjectDependenciesResolver.resolve (DefaultProjectDependenciesResolver.java:208)
    at org.apache.maven.lifecycle.internal.LifecycleDependencyResolver.getDependencies (LifecycleDependencyResolver.java:243)
    at org.apache.maven.lifecycle.internal.LifecycleDependencyResolver.resolveProjectDependencies
(LifecycleDependencyResolver.java:147)
    at org.apache.maven.lifecycle.internal.MojoExecutor.ensureDependenciesAreResolved (MojoExecutor.java:248)
    at org.apache.maven.lifecycle.internal.MojoExecutor.execute (MojoExecutor.java:202)
    at org.apache.maven.lifecycle.internal.MojoExecutor.execute (MojoExecutor.java:156)
    at org.apache.maven.lifecycle.internal.MojoExecutor.execute (MojoExecutor.java:148)
    at org.apache.maven.lifecycle.internal.LifecycleModuleBuilder.buildProject (LifecycleModuleBuilder.java:117)
    at org.apache.maven.lifecycle.internal.LifecycleModuleBuilder.buildProject (LifecycleModuleBuilder.java:81)
    at org.apache.maven.lifecycle.internal.builder.singlethreaded.SingleThreadedBuilder.build
(SingleThreadedBuilder.java:56)
    at org.apache.maven.lifecycle.internal.LifecycleStarter.execute (LifecycleStarter.java:128)
    at org.apache.maven.DefaultMaven.doExecute (DefaultMaven.java:305)
    at org.apache.maven.DefaultMaven.doExecute (DefaultMaven.java:192)
    at org.apache.maven.DefaultMaven.execute (DefaultMaven.java:105)
    at org.apache.maven.cli.MavenCli.execute (MavenCli.java:956)
    at org.apache.maven.cli.MavenCli.doMain (MavenCli.java:288)
    at org.apache.maven.cli.MavenCli.main (MavenCli.java:192)
    at jdk.internal.reflect.NativeMethodAccessorImpl.invoke0 (Native Method)
    at jdk.internal.reflect.NativeMethodAccessorImpl.invoke (NativeMethodAccessorImpl.java:62)
    at jdk.internal.reflect.DelegatingMethodAccessorImpl.invoke (DelegatingMethodAccessorImpl.java:43)
    at java.lang.reflect.Method.invoke (Method.java:567)
    at org.codehaus.plexus.classworlds.launcher.Launcher.launchEnhanced (Launcher.java:289)
    at org.codehaus.plexus.classworlds.launcher.Launcher.launch (Launcher.java:229)
    at org.codehaus.plexus.classworlds.launcher.Launcher.mainWithExitCode (Launcher.java:415)
    at org.codehaus.plexus.classworlds.launcher.Launcher.main (Launcher.java:356)
Caused by: org.eclipse.aether.resolution.DependencyResolutionException: Failure to find org.codehaus.plexus:plexus-utils:jar:3.2.1
in https://repo.maven.apache.org/maven2 was cached in the local repository, resolution will
not be reattempted until the update interval of central has elapsed or updates are forced
    at org.eclipse.aether.internal.impl.DefaultRepositorySystem.resolveDependencies (DefaultRepositorySystem.java:342)
    at org.apache.maven.project.DefaultProjectDependenciesResolver.resolve (DefaultProjectDependenciesResolver.java:202)
    at org.apache.maven.lifecycle.internal.LifecycleDependencyResolver.getDependencies (LifecycleDependencyResolver.java:243)
    at org.apache.maven.lifecycle.internal.LifecycleDependencyResolver.resolveProjectDependencies
(LifecycleDependencyResolver.java:147)
    at org.apache.maven.lifecycle.internal.MojoExecutor.ensureDependenciesAreResolved (MojoExecutor.java:248)
    at org.apache.maven.lifecycle.internal.MojoExecutor.execute (MojoExecutor.java:202)
    at org.apache.maven.lifecycle.internal.MojoExecutor.execute (MojoExecutor.java:156)
    at org.apache.maven.lifecycle.internal.MojoExecutor.execute (MojoExecutor.java:148)
    at org.apache.maven.lifecycle.internal.LifecycleModuleBuilder.buildProject (LifecycleModuleBuilder.java:117)
    at org.apache.maven.lifecycle.internal.LifecycleModuleBuilder.buildProject (LifecycleModuleBuilder.java:81)
    at org.apache.maven.lifecycle.internal.builder.singlethreaded.SingleThreadedBuilder.build
(SingleThreadedBuilder.java:56)
    at org.apache.maven.lifecycle.internal.LifecycleStarter.execute (LifecycleStarter.java:128)
    at org.apache.maven.DefaultMaven.doExecute (DefaultMaven.java:305)
    at org.apache.maven.DefaultMaven.doExecute (DefaultMaven.java:192)
    at org.apache.maven.DefaultMaven.execute (DefaultMaven.java:105)
    at org.apache.maven.cli.MavenCli.execute (MavenCli.java:956)
    at org.apache.maven.cli.MavenCli.doMain (MavenCli.java:288)
    at org.apache.maven.cli.MavenCli.main (MavenCli.java:192)
    at jdk.internal.reflect.NativeMethodAccessorImpl.invoke0 (Native Method)
    at jdk.internal.reflect.NativeMethodAccessorImpl.invoke (NativeMethodAccessorImpl.java:62)
    at jdk.internal.reflect.DelegatingMethodAccessorImpl.invoke (DelegatingMethodAccessorImpl.java:43)
    at java.lang.reflect.Method.invoke (Method.java:567)
    at org.codehaus.plexus.classworlds.launcher.Launcher.launchEnhanced (Launcher.java:289)
    at org.codehaus.plexus.classworlds.launcher.Launcher.launch (Launcher.java:229)
    at org.codehaus.plexus.classworlds.launcher.Launcher.mainWithExitCode (Launcher.java:415)
    at org.codehaus.plexus.classworlds.launcher.Launcher.main (Launcher.java:356)
Caused by: org.eclipse.aether.resolution.ArtifactResolutionException: Failure to find org.codehaus.plexus:plexus-utils:jar:3.2.1
in https://repo.maven.apache.org/maven2 was cached in the local repository, resolution will
not be reattempted until the update interval of central has elapsed or updates are forced
    at org.eclipse.aether.internal.impl.DefaultArtifactResolver.resolve (DefaultArtifactResolver.java:413)
    at org.eclipse.aether.internal.impl.DefaultArtifactResolver.resolveArtifacts (DefaultArtifactResolver.java:215)
    at org.eclipse.aether.internal.impl.DefaultRepositorySystem.resolveDependencies (DefaultRepositorySystem.java:325)
    at org.apache.maven.project.DefaultProjectDependenciesResolver.resolve (DefaultProjectDependenciesResolver.java:202)
    at org.apache.maven.lifecycle.internal.LifecycleDependencyResolver.getDependencies (LifecycleDependencyResolver.java:243)
    at org.apache.maven.lifecycle.internal.LifecycleDependencyResolver.resolveProjectDependencies
(LifecycleDependencyResolver.java:147)
    at org.apache.maven.lifecycle.internal.MojoExecutor.ensureDependenciesAreResolved (MojoExecutor.java:248)
    at org.apache.maven.lifecycle.internal.MojoExecutor.execute (MojoExecutor.java:202)
    at org.apache.maven.lifecycle.internal.MojoExecutor.execute (MojoExecutor.java:156)
    at org.apache.maven.lifecycle.internal.MojoExecutor.execute (MojoExecutor.java:148)
    at org.apache.maven.lifecycle.internal.LifecycleModuleBuilder.buildProject (LifecycleModuleBuilder.java:117)
    at org.apache.maven.lifecycle.internal.LifecycleModuleBuilder.buildProject (LifecycleModuleBuilder.java:81)
    at org.apache.maven.lifecycle.internal.builder.singlethreaded.SingleThreadedBuilder.build
(SingleThreadedBuilder.java:56)
    at org.apache.maven.lifecycle.internal.LifecycleStarter.execute (LifecycleStarter.java:128)
    at org.apache.maven.DefaultMaven.doExecute (DefaultMaven.java:305)
    at org.apache.maven.DefaultMaven.doExecute (DefaultMaven.java:192)
    at org.apache.maven.DefaultMaven.execute (DefaultMaven.java:105)
    at org.apache.maven.cli.MavenCli.execute (MavenCli.java:956)
    at org.apache.maven.cli.MavenCli.doMain (MavenCli.java:288)
    at org.apache.maven.cli.MavenCli.main (MavenCli.java:192)
    at jdk.internal.reflect.NativeMethodAccessorImpl.invoke0 (Native Method)
    at jdk.internal.reflect.NativeMethodAccessorImpl.invoke (NativeMethodAccessorImpl.java:62)
    at jdk.internal.reflect.DelegatingMethodAccessorImpl.invoke (DelegatingMethodAccessorImpl.java:43)
    at java.lang.reflect.Method.invoke (Method.java:567)
    at org.codehaus.plexus.classworlds.launcher.Launcher.launchEnhanced (Launcher.java:289)
    at org.codehaus.plexus.classworlds.launcher.Launcher.launch (Launcher.java:229)
    at org.codehaus.plexus.classworlds.launcher.Launcher.mainWithExitCode (Launcher.java:415)
    at org.codehaus.plexus.classworlds.launcher.Launcher.main (Launcher.java:356)
Caused by: org.eclipse.aether.transfer.ArtifactNotFoundException: Failure to find org.codehaus.plexus:plexus-utils:jar:3.2.1
in https://repo.maven.apache.org/maven2 was cached in the local repository, resolution will
not be reattempted until the update interval of central has elapsed or updates are forced
    at org.eclipse.aether.internal.impl.DefaultUpdateCheckManager.newException (DefaultUpdateCheckManager.java:217)
    at org.eclipse.aether.internal.impl.DefaultUpdateCheckManager.checkArtifact (DefaultUpdateCheckManager.java:192)
    at org.eclipse.aether.internal.impl.DefaultArtifactResolver.gatherDownloads (DefaultArtifactResolver.java:554)
    at org.eclipse.aether.internal.impl.DefaultArtifactResolver.performDownloads (DefaultArtifactResolver.java:472)
    at org.eclipse.aether.internal.impl.DefaultArtifactResolver.resolve (DefaultArtifactResolver.java:390)
    at org.eclipse.aether.internal.impl.DefaultArtifactResolver.resolveArtifacts (DefaultArtifactResolver.java:215)
    at org.eclipse.aether.internal.impl.DefaultRepositorySystem.resolveDependencies (DefaultRepositorySystem.java:325)
    at org.apache.maven.project.DefaultProjectDependenciesResolver.resolve (DefaultProjectDependenciesResolver.java:202)
    at org.apache.maven.lifecycle.internal.LifecycleDependencyResolver.getDependencies (LifecycleDependencyResolver.java:243)
    at org.apache.maven.lifecycle.internal.LifecycleDependencyResolver.resolveProjectDependencies
(LifecycleDependencyResolver.java:147)
    at org.apache.maven.lifecycle.internal.MojoExecutor.ensureDependenciesAreResolved (MojoExecutor.java:248)
    at org.apache.maven.lifecycle.internal.MojoExecutor.execute (MojoExecutor.java:202)
    at org.apache.maven.lifecycle.internal.MojoExecutor.execute (MojoExecutor.java:156)
    at org.apache.maven.lifecycle.internal.MojoExecutor.execute (MojoExecutor.java:148)
    at org.apache.maven.lifecycle.internal.LifecycleModuleBuilder.buildProject (LifecycleModuleBuilder.java:117)
    at org.apache.maven.lifecycle.internal.LifecycleModuleBuilder.buildProject (LifecycleModuleBuilder.java:81)
    at org.apache.maven.lifecycle.internal.builder.singlethreaded.SingleThreadedBuilder.build
(SingleThreadedBuilder.java:56)
    at org.apache.maven.lifecycle.internal.LifecycleStarter.execute (LifecycleStarter.java:128)
    at org.apache.maven.DefaultMaven.doExecute (DefaultMaven.java:305)
    at org.apache.maven.DefaultMaven.doExecute (DefaultMaven.java:192)
    at org.apache.maven.DefaultMaven.execute (DefaultMaven.java:105)
    at org.apache.maven.cli.MavenCli.execute (MavenCli.java:956)
    at org.apache.maven.cli.MavenCli.doMain (MavenCli.java:288)
    at org.apache.maven.cli.MavenCli.main (MavenCli.java:192)
    at jdk.internal.reflect.NativeMethodAccessorImpl.invoke0 (Native Method)
    at jdk.internal.reflect.NativeMethodAccessorImpl.invoke (NativeMethodAccessorImpl.java:62)
    at jdk.internal.reflect.DelegatingMethodAccessorImpl.invoke (DelegatingMethodAccessorImpl.java:43)
    at java.lang.reflect.Method.invoke (Method.java:567)
    at org.codehaus.plexus.classworlds.launcher.Launcher.launchEnhanced (Launcher.java:289)
    at org.codehaus.plexus.classworlds.launcher.Launcher.launch (Launcher.java:229)
    at org.codehaus.plexus.classworlds.launcher.Launcher.mainWithExitCode (Launcher.java:415)
    at org.codehaus.plexus.classworlds.launcher.Launcher.main (Launcher.java:356)
[ERROR] 
[ERROR] Re-run Maven using the -X switch to enable full debug logging.
[ERROR] 
[ERROR] For more information about the errors and possible solutions, please read the following
articles:
[ERROR] [Help 1] http://cwiki.apache.org/confluence/display/MAVEN/DependencyResolutionException
[Pipeline] }
[Pipeline] // dir
[Pipeline] }
[Fast Archiver] No prior successful build to compare, so performing full copy of artifacts
[withMaven] openTasksPublisher - Scan Tasks for Maven artifact org.apache.maven.plugins:maven-deploy-plugin:maven-plugin:3.0.0-M2-SNAPSHOT
in source directory windows-jdk13-m3.6.x_build\src\main\java
[TASKS] Scanning folder 'f:\jenkins\jenkins-slave\workspace\_maven-deploy-plugin_MDEPLOY-256@2'
for files matching the pattern 'windows-jdk13-m3.6.x_build\src\main\java\**\*' - excludes:
null
[TASKS] Found 3 files to scan for tasks
[TASKS] Found 0 open tasks.
Skipping warnings blame since pipelines do not have an SCM link.%n
[withMaven] Publishers: Generated Artifacts Publisher: 17 ms, Open Task Scanner Publisher:
52 ms
[Pipeline] // withMaven
[Pipeline] cleanWs
[WS-CLEANUP] Deleting project workspace...
[WS-CLEANUP] Deferred wipeout is used...
[WS-CLEANUP] done
[Pipeline] cleanWs
[WS-CLEANUP] Deleting project workspace...
[WS-CLEANUP] Deferred wipeout is used...
[WS-CLEANUP] done
[Pipeline] }
[Pipeline] // stage
[Pipeline] }
[Pipeline] // ws
[Pipeline] }
[Pipeline] // node
[Pipeline] }
Failed in branch windows-jdk13-m3.6.x_build
[Pipeline] // parallel
[Pipeline] stage
[Pipeline] { (Notifications)
[Pipeline] echo
Build result: FAILURE
[Pipeline] jiraIssueSelector
[Pipeline] emailext
Mime
  • Unnamed multipart/mixed (inline, None, 0 bytes)
View raw message