maven-notifications mailing list archives

Site index · List index
Message view « Date » · « Thread »
Top « Date » · « Thread »
From Apache Jenkins Server <jenk...@builds.apache.org>
Subject Build failed in Jenkins: Maven TLP » maven-surefire » parallel #6
Date Tue, 04 Jun 2019 08:46:02 GMT
See https://builds.apache.org/job/maven-box/job/maven-surefire/job/parallel/6/

Changes:

* [MNG-6573] Use Maven 3.6.0 as default
* H39 has weird issues, exclude it for now
* Fix no access to currentBuild.rawBuild
* fixed typo
* Include more recent JDKs

2 tests failed.
FAILED:  org.apache.maven.surefire.its.jiras.Surefire1295AttributeJvmCrashesToTestsIT.test[1]

Error Message:
java.io.IOException: Failed to copy full contents from /home/jenkins/jenkins-slave/workspace/aven-box_maven-surefire_parallel@2/surefire-its/target/test-classes/crash-during-test/pom.xml
to /home/jenkins/jenkins-slave/workspace/aven-box_maven-surefire_parallel@2/surefire-its/target/Surefire1295AttributeJvmCrashesToTestsIT_test_exit_2/pom.xml

Stack Trace:
java.lang.RuntimeException: java.io.IOException: Failed to copy full contents from /home/jenkins/jenkins-slave/workspace/aven-box_maven-surefire_parallel@2/surefire-its/target/test-classes/crash-during-test/pom.xml
to /home/jenkins/jenkins-slave/workspace/aven-box_maven-surefire_parallel@2/surefire-its/target/Surefire1295AttributeJvmCrashesToTestsIT_test_exit_2/pom.xml
	at org.apache.maven.surefire.its.jiras.Surefire1295AttributeJvmCrashesToTestsIT.test(Surefire1295AttributeJvmCrashesToTestsIT.java:97)
Caused by: java.io.IOException: Failed to copy full contents from /home/jenkins/jenkins-slave/workspace/aven-box_maven-surefire_parallel@2/surefire-its/target/test-classes/crash-during-test/pom.xml
to /home/jenkins/jenkins-slave/workspace/aven-box_maven-surefire_parallel@2/surefire-its/target/Surefire1295AttributeJvmCrashesToTestsIT_test_exit_2/pom.xml
	at org.apache.maven.surefire.its.jiras.Surefire1295AttributeJvmCrashesToTestsIT.test(Surefire1295AttributeJvmCrashesToTestsIT.java:97)


FAILED:  org.apache.maven.surefire.its.jiras.Surefire1295AttributeJvmCrashesToTestsIT.test[0]

Error Message:
java.io.IOException: Failed to copy full contents from /home/jenkins/jenkins-slave/workspace/aven-box_maven-surefire_parallel@2/surefire-its/target/test-classes/crash-during-test/pom.xml
to /home/jenkins/jenkins-slave/workspace/aven-box_maven-surefire_parallel@2/surefire-its/target/Surefire1295AttributeJvmCrashesToTestsIT_test_exit_2/pom.xml

Stack Trace:
java.lang.RuntimeException: java.io.IOException: Failed to copy full contents from /home/jenkins/jenkins-slave/workspace/aven-box_maven-surefire_parallel@2/surefire-its/target/test-classes/crash-during-test/pom.xml
to /home/jenkins/jenkins-slave/workspace/aven-box_maven-surefire_parallel@2/surefire-its/target/Surefire1295AttributeJvmCrashesToTestsIT_test_exit_2/pom.xml
	at org.apache.maven.surefire.its.jiras.Surefire1295AttributeJvmCrashesToTestsIT.test(Surefire1295AttributeJvmCrashesToTestsIT.java:97)
Caused by: java.io.IOException: Failed to copy full contents from /home/jenkins/jenkins-slave/workspace/aven-box_maven-surefire_parallel@2/surefire-its/target/test-classes/crash-during-test/pom.xml
to /home/jenkins/jenkins-slave/workspace/aven-box_maven-surefire_parallel@2/surefire-its/target/Surefire1295AttributeJvmCrashesToTestsIT_test_exit_2/pom.xml
	at org.apache.maven.surefire.its.jiras.Surefire1295AttributeJvmCrashesToTestsIT.test(Surefire1295AttributeJvmCrashesToTestsIT.java:97)




Build log:
[...truncated 47548 lines...]
[2019-06-04T08:40:07.718Z] [INFO] ------------------------------------------------------------------------
[2019-06-04T08:40:07.718Z] [INFO] Reactor Summary for Apache Maven Surefire 3.0.0-SNAPSHOT:
[2019-06-04T08:40:07.718Z] [INFO] 
[2019-06-04T08:40:07.718Z] [INFO] Apache Maven Surefire .............................. SUCCESS
[ 28.393 s]
[2019-06-04T08:40:07.718Z] [INFO] SureFire Logger API ................................ SUCCESS
[  6.929 s]
[2019-06-04T08:40:07.718Z] [INFO] SureFire API ....................................... SUCCESS
[ 17.269 s]
[2019-06-04T08:40:07.718Z] [INFO] SureFire Booter .................................... SUCCESS
[ 19.330 s]
[2019-06-04T08:40:07.718Z] [INFO] Maven Surefire Test-Grouping Support ............... SUCCESS
[  9.028 s]
[2019-06-04T08:40:07.718Z] [INFO] SureFire Providers ................................. SUCCESS
[  1.741 s]
[2019-06-04T08:40:07.718Z] [INFO] Shared JUnit3 Provider Code ........................ SUCCESS
[  6.776 s]
[2019-06-04T08:40:07.718Z] [INFO] Shared Java 5 Provider Base ........................ SUCCESS
[  8.165 s]
[2019-06-04T08:40:07.718Z] [INFO] Shared JUnit4 Provider Code ........................ SUCCESS
[  7.805 s]
[2019-06-04T08:40:07.718Z] [INFO] Shared JUnit48 Provider Code ....................... SUCCESS
[  9.532 s]
[2019-06-04T08:40:07.718Z] [INFO] SureFire JUnit Runner .............................. SUCCESS
[  7.241 s]
[2019-06-04T08:40:07.718Z] [INFO] SureFire JUnit4 Runner ............................. SUCCESS
[  8.011 s]
[2019-06-04T08:40:07.718Z] [INFO] Maven Surefire Common .............................. SUCCESS
[ 39.983 s]
[2019-06-04T08:40:07.718Z] [INFO] SureFire JUnitCore Runner .......................... SUCCESS
[02:23 min]
[2019-06-04T08:40:07.718Z] [INFO] SureFire JUnit Platform Runner ..................... SUCCESS
[ 13.958 s]
[2019-06-04T08:40:07.718Z] [INFO] SureFire TestNG Utils .............................. SUCCESS
[  7.261 s]
[2019-06-04T08:40:07.718Z] [INFO] SureFire TestNG Runner ............................. SUCCESS
[  8.052 s]
[2019-06-04T08:40:07.718Z] [INFO] ShadeFire JUnit3 Provider .......................... SUCCESS
[  2.318 s]
[2019-06-04T08:40:07.718Z] [INFO] Surefire Report Parser ............................. SUCCESS
[ 10.786 s]
[2019-06-04T08:40:07.718Z] [INFO] Maven Surefire Plugin .............................. SUCCESS
[ 15.713 s]
[2019-06-04T08:40:07.718Z] [INFO] Maven Failsafe Plugin .............................. SUCCESS
[01:18 min]
[2019-06-04T08:40:07.718Z] [INFO] Maven Surefire Report Plugin ....................... SUCCESS
[ 26.077 s]
[2019-06-04T08:40:07.718Z] [INFO] Maven Surefire Integration Tests ................... SUCCESS
[  01:03 h]
[2019-06-04T08:40:07.718Z] [INFO] ------------------------------------------------------------------------
[2019-06-04T08:40:07.718Z] [INFO] BUILD SUCCESS
[2019-06-04T08:40:07.718Z] [INFO] ------------------------------------------------------------------------
[2019-06-04T08:40:07.718Z] [INFO] Total time:  01:11 h
[2019-06-04T08:40:07.718Z] [INFO] Finished at: 2019-06-04T08:40:01Z
[2019-06-04T08:40:07.718Z] [INFO] ------------------------------------------------------------------------
[Pipeline] }
[Pipeline] // withEnv
[Pipeline] }
[Pipeline] // stage
[Pipeline] fileExists
[Pipeline] zip
[2019-06-04T08:40:08.029Z] Writing zip file of C:\Users\jenkins\AppData\Local\Temp\2\jenkins-maven-box-maven-surefire-parallel-6\maven-failsafe-plugin\target\it
to C:\Users\jenkins\AppData\Local\Temp\2\jenkins-maven-box-maven-surefire-parallel-6\maven-failsafe-plugin--windows-jdk8-maven3.6.x.zip
[2019-06-04T08:40:08.083Z] Zipped 30 entries.
[2019-06-04T08:40:08.083Z] Archiving C:\Users\jenkins\AppData\Local\Temp\2\jenkins-maven-box-maven-surefire-parallel-6\maven-failsafe-plugin--windows-jdk8-maven3.6.x.zip
[2019-06-04T08:40:08.084Z] [Fast Archiver] No prior successful build to compare, so performing
full copy of artifacts
[Pipeline] fileExists
[Pipeline] zip
[2019-06-04T08:40:08.286Z] Writing zip file of C:\Users\jenkins\AppData\Local\Temp\2\jenkins-maven-box-maven-surefire-parallel-6\surefire-its\target
to C:\Users\jenkins\AppData\Local\Temp\2\jenkins-maven-box-maven-surefire-parallel-6\surefire-its--windows-jdk8-maven3.6.x.zip
[2019-06-04T08:40:18.186Z] [INFO] Running org.apache.maven.surefire.its.jiras.Surefire570MultipleReportDirectoriesIT
[2019-06-04T08:40:18.187Z] [INFO] Tests run: 2, Failures: 0, Errors: 0, Skipped: 0, Time elapsed:
58.47 s - in org.apache.maven.surefire.its.jiras.Surefire570MultipleReportDirectoriesIT
[2019-06-04T08:40:20.755Z] [INFO] Running org.apache.maven.surefire.its.jiras.Surefire649EmptyStringSystemPropertiesIT
[2019-06-04T08:40:20.755Z] [INFO] Tests run: 2, Failures: 0, Errors: 0, Skipped: 0, Time elapsed:
19.123 s - in org.apache.maven.surefire.its.jiras.Surefire649EmptyStringSystemPropertiesIT
[2019-06-04T08:40:23.619Z] Zipped 16032 entries.
[2019-06-04T08:40:23.619Z] Archiving C:\Users\jenkins\AppData\Local\Temp\2\jenkins-maven-box-maven-surefire-parallel-6\surefire-its--windows-jdk8-maven3.6.x.zip
[2019-06-04T08:40:23.619Z] [Fast Archiver] No prior successful build to compare, so performing
full copy of artifacts
[Pipeline] archiveArtifacts
[2019-06-04T08:40:25.960Z] Archiving artifacts
[2019-06-04T08:40:25.999Z] [Fast Archiver] No prior successful build to compare, so performing
full copy of artifacts
[Pipeline] cleanWs
[2019-06-04T08:40:28.264Z] [WS-CLEANUP] Deleting project workspace...
[2019-06-04T08:40:28.265Z] [WS-CLEANUP] Deferred wipeout is used...
[2019-06-04T08:40:28.505Z] [WS-CLEANUP] done
[Pipeline] }
[Pipeline] // ws
[Pipeline] }
[Pipeline] // timestamps
[Pipeline] }
[Pipeline] // node
[Pipeline] }
[2019-06-04T08:40:32.367Z] [INFO] Running org.apache.maven.surefire.its.jiras.Surefire673MockitoIT
[2019-06-04T08:40:32.367Z] [INFO] Tests run: 1, Failures: 0, Errors: 0, Skipped: 0, Time elapsed:
14.679 s - in org.apache.maven.surefire.its.jiras.Surefire673MockitoIT
[2019-06-04T08:40:38.113Z] [INFO] Running org.apache.maven.surefire.its.jiras.Surefire674BuildFailingWhenErrorsIT
[2019-06-04T08:40:38.113Z] [INFO] Tests run: 1, Failures: 0, Errors: 0, Skipped: 0, Time elapsed:
16.615 s - in org.apache.maven.surefire.its.jiras.Surefire674BuildFailingWhenErrorsIT
[2019-06-04T08:40:40.512Z] [INFO] Running org.apache.maven.surefire.its.jiras.Surefire621TestCountingJunit3InParallelIT
[2019-06-04T08:40:40.512Z] [INFO] Tests run: 5, Failures: 0, Errors: 0, Skipped: 0, Time elapsed:
67.127 s - in org.apache.maven.surefire.its.jiras.Surefire621TestCountingJunit3InParallelIT
[2019-06-04T08:40:49.791Z] [INFO] Running org.apache.maven.surefire.its.jiras.Surefire685CommaSeparatedIncludesIT
[2019-06-04T08:40:49.792Z] [INFO] Tests run: 1, Failures: 0, Errors: 0, Skipped: 0, Time elapsed:
12.053 s - in org.apache.maven.surefire.its.jiras.Surefire685CommaSeparatedIncludesIT
[2019-06-04T08:40:50.155Z] [INFO] Running org.apache.maven.surefire.its.jiras.Surefire674BuildFailingWhenFailsafeErrorsIT
[2019-06-04T08:40:50.155Z] [INFO] Tests run: 1, Failures: 0, Errors: 0, Skipped: 0, Time elapsed:
19.324 s - in org.apache.maven.surefire.its.jiras.Surefire674BuildFailingWhenFailsafeErrorsIT
[2019-06-04T08:40:52.113Z] [INFO] Running org.apache.maven.surefire.its.jiras.Surefire697NiceSummaryIT
[2019-06-04T08:40:52.113Z] [INFO] Tests run: 1, Failures: 0, Errors: 0, Skipped: 0, Time elapsed:
11.64 s - in org.apache.maven.surefire.its.jiras.Surefire697NiceSummaryIT
[2019-06-04T08:41:02.246Z] [INFO] Running org.apache.maven.surefire.its.jiras.Surefire733AllOverrridesCapturedIT
[2019-06-04T08:41:02.246Z] [INFO] Tests run: 1, Failures: 0, Errors: 0, Skipped: 0, Time elapsed:
12.166 s - in org.apache.maven.surefire.its.jiras.Surefire733AllOverrridesCapturedIT
[2019-06-04T08:41:06.134Z] [INFO] Running org.apache.maven.surefire.its.jiras.Surefire705ParallelForkTimeoutIT
[2019-06-04T08:41:06.134Z] [INFO] Tests run: 1, Failures: 0, Errors: 0, Skipped: 0, Time elapsed:
16.71 s - in org.apache.maven.surefire.its.jiras.Surefire705ParallelForkTimeoutIT
[2019-06-04T08:41:14.466Z] [INFO] Running org.apache.maven.surefire.its.jiras.Surefire740TruncatedCommaIT
[2019-06-04T08:41:14.466Z] [INFO] Tests run: 1, Failures: 0, Errors: 0, Skipped: 0, Time elapsed:
12.37 s - in org.apache.maven.surefire.its.jiras.Surefire740TruncatedCommaIT
[2019-06-04T08:41:15.836Z] [INFO] Running org.apache.maven.surefire.its.jiras.Surefire735ForkFailWithRedirectConsoleOutputIT
[2019-06-04T08:41:15.836Z] [INFO] Tests run: 2, Failures: 0, Errors: 0, Skipped: 0, Time elapsed:
23.662 s - in org.apache.maven.surefire.its.jiras.Surefire735ForkFailWithRedirectConsoleOutputIT
[2019-06-04T08:41:39.836Z] [INFO] Running org.apache.maven.surefire.its.jiras.Surefire772BothReportsIT
[2019-06-04T08:41:39.836Z] [INFO] Tests run: 3, Failures: 0, Errors: 0, Skipped: 0, Time elapsed:
22.889 s - in org.apache.maven.surefire.its.jiras.Surefire772BothReportsIT
[2019-06-04T08:41:44.779Z] [INFO] Running org.apache.maven.surefire.its.jiras.Surefire747MethodParallelWithSuiteCountIT
[2019-06-04T08:41:44.779Z] [INFO] Tests run: 2, Failures: 0, Errors: 0, Skipped: 0, Time elapsed:
38.531 s - in org.apache.maven.surefire.its.jiras.Surefire747MethodParallelWithSuiteCountIT
[2019-06-04T08:41:47.948Z] [INFO] Running org.apache.maven.surefire.its.jiras.Surefire772NoFailsafeReportsIT
[2019-06-04T08:41:47.948Z] [INFO] Tests run: 4, Failures: 0, Errors: 0, Skipped: 0, Time elapsed:
32.1 s - in org.apache.maven.surefire.its.jiras.Surefire772NoFailsafeReportsIT
[2019-06-04T08:41:57.606Z] [INFO] Running org.apache.maven.surefire.its.jiras.Surefire801ForkModeNoneClassLoaderIT
[2019-06-04T08:41:57.606Z] [INFO] Tests run: 1, Failures: 0, Errors: 0, Skipped: 0, Time elapsed:
8.894 s - in org.apache.maven.surefire.its.jiras.Surefire801ForkModeNoneClassLoaderIT
[2019-06-04T08:42:09.656Z] [INFO] Running org.apache.maven.surefire.its.jiras.Surefire772SpecifiedReportsIT
[2019-06-04T08:42:09.656Z] [INFO] Tests run: 3, Failures: 0, Errors: 0, Skipped: 0, Time elapsed:
23.966 s - in org.apache.maven.surefire.its.jiras.Surefire772SpecifiedReportsIT
[2019-06-04T08:42:09.656Z] [INFO] Running org.apache.maven.surefire.its.jiras.Surefire772NoSurefireReportsIT
[2019-06-04T08:42:09.656Z] [INFO] Tests run: 4, Failures: 0, Errors: 0, Skipped: 0, Time elapsed:
32.189 s - in org.apache.maven.surefire.its.jiras.Surefire772NoSurefireReportsIT
[2019-06-04T08:42:20.696Z] [INFO] Running org.apache.maven.surefire.its.jiras.Surefire806SpecifiedTestControlsIT
[2019-06-04T08:42:20.696Z] [WARNING] Tests run: 3, Failures: 0, Errors: 0, Skipped: 2, Time
elapsed: 10.816 s - in org.apache.maven.surefire.its.jiras.Surefire806SpecifiedTestControlsIT
[2019-06-04T08:42:34.167Z] [INFO] Running org.apache.maven.surefire.its.jiras.Surefire812Log4JClassLoaderIT
[2019-06-04T08:42:34.167Z] [INFO] Tests run: 1, Failures: 0, Errors: 0, Skipped: 0, Time elapsed:
13.003 s - in org.apache.maven.surefire.its.jiras.Surefire812Log4JClassLoaderIT
[2019-06-04T08:42:38.643Z] [INFO] Running org.apache.maven.surefire.its.jiras.Surefire803MultiFailsafeExecsIT
[2019-06-04T08:42:38.643Z] [INFO] Tests run: 2, Failures: 0, Errors: 0, Skipped: 0, Time elapsed:
41.501 s - in org.apache.maven.surefire.its.jiras.Surefire803MultiFailsafeExecsIT
[2019-06-04T08:42:46.789Z] [INFO] Running org.apache.maven.surefire.its.jiras.Surefire817SystemExitIT
[2019-06-04T08:42:46.789Z] [INFO] Tests run: 1, Failures: 0, Errors: 0, Skipped: 0, Time elapsed:
13.283 s - in org.apache.maven.surefire.its.jiras.Surefire817SystemExitIT
[2019-06-04T08:42:51.812Z] [INFO] Running org.apache.maven.surefire.its.jiras.Surefire818NpeIgnoresTestsIT
[2019-06-04T08:42:51.812Z] [INFO] Tests run: 1, Failures: 0, Errors: 0, Skipped: 0, Time elapsed:
12.919 s - in org.apache.maven.surefire.its.jiras.Surefire818NpeIgnoresTestsIT
[2019-06-04T08:43:05.554Z] [INFO] Running org.apache.maven.surefire.its.jiras.Surefire832ProviderSelectionIT
[2019-06-04T08:43:05.554Z] [INFO] Tests run: 1, Failures: 0, Errors: 0, Skipped: 0, Time elapsed:
12.476 s - in org.apache.maven.surefire.its.jiras.Surefire832ProviderSelectionIT
[2019-06-04T08:43:21.740Z] [INFO] Running org.apache.maven.surefire.its.jiras.Surefire809GroupExpressionsIT
[2019-06-04T08:43:21.740Z] [INFO] Tests run: 6, Failures: 0, Errors: 0, Skipped: 0, Time elapsed:
70.482 s - in org.apache.maven.surefire.its.jiras.Surefire809GroupExpressionsIT
[2019-06-04T08:43:29.394Z] [INFO] Running org.apache.maven.surefire.its.jiras.Surefire839TestWithoutCategoriesIT
[2019-06-04T08:43:29.394Z] [INFO] Tests run: 2, Failures: 0, Errors: 0, Skipped: 0, Time elapsed:
24.983 s - in org.apache.maven.surefire.its.jiras.Surefire839TestWithoutCategoriesIT
[2019-06-04T08:43:33.406Z] [INFO] Running org.apache.maven.surefire.its.jiras.Surefire847AdditionalFailureIT
[2019-06-04T08:43:33.406Z] [INFO] Tests run: 1, Failures: 0, Errors: 0, Skipped: 0, Time elapsed:
13.233 s - in org.apache.maven.surefire.its.jiras.Surefire847AdditionalFailureIT
[2019-06-04T08:43:34.587Z] [INFO] Running org.apache.maven.surefire.its.jiras.Surefire828EmptyGroupExprIT
[2019-06-04T08:43:34.587Z] [INFO] Tests run: 4, Failures: 0, Errors: 0, Skipped: 0, Time elapsed:
48.827 s - in org.apache.maven.surefire.its.jiras.Surefire828EmptyGroupExprIT
[2019-06-04T08:43:44.408Z] [INFO] Running org.apache.maven.surefire.its.jiras.Surefire907PerThreadWithoutThreadCountIT
[2019-06-04T08:43:44.408Z] [INFO] Tests run: 1, Failures: 0, Errors: 0, Skipped: 0, Time elapsed:
8.804 s - in org.apache.maven.surefire.its.jiras.Surefire907PerThreadWithoutThreadCountIT
[2019-06-04T08:43:44.408Z] [INFO] Running org.apache.maven.surefire.its.jiras.Surefire901MIssingResultfileWhenNoTestsIT
[2019-06-04T08:43:44.408Z] [INFO] Tests run: 1, Failures: 0, Errors: 0, Skipped: 0, Time elapsed:
10.198 s - in org.apache.maven.surefire.its.jiras.Surefire901MIssingResultfileWhenNoTestsIT
[2019-06-04T08:44:04.616Z] [INFO] Running org.apache.maven.surefire.its.jiras.Surefire926FailureWith2ProvidersIT
[2019-06-04T08:44:04.616Z] [INFO] Tests run: 1, Failures: 0, Errors: 0, Skipped: 0, Time elapsed:
18.524 s - in org.apache.maven.surefire.its.jiras.Surefire926FailureWith2ProvidersIT
[2019-06-04T08:44:11.933Z] [INFO] Running org.apache.maven.surefire.its.jiras.Surefire920TestFailureIgnoreWithTimeoutIT
[2019-06-04T08:44:11.933Z] [INFO] Tests run: 2, Failures: 0, Errors: 0, Skipped: 0, Time elapsed:
27.409 s - in org.apache.maven.surefire.its.jiras.Surefire920TestFailureIgnoreWithTimeoutIT
[2019-06-04T08:44:37.635Z] [INFO] Running org.apache.maven.surefire.its.jiras.Surefire930TestNgSuiteXmlIT
[2019-06-04T08:44:37.635Z] [INFO] Tests run: 1, Failures: 0, Errors: 0, Skipped: 0, Time elapsed:
13.481 s - in org.apache.maven.surefire.its.jiras.Surefire930TestNgSuiteXmlIT
[2019-06-04T08:44:44.028Z] [INFO] Running org.apache.maven.surefire.its.jiras.Surefire943ReportContentIT
[2019-06-04T08:44:44.028Z] [INFO] Tests run: 2, Failures: 0, Errors: 0, Skipped: 0, Time elapsed:
32.181 s - in org.apache.maven.surefire.its.jiras.Surefire943ReportContentIT
[2019-06-04T08:44:53.267Z] [INFO] Running org.apache.maven.surefire.its.jiras.Surefire855AllowFailsafeUseArtifactFileIT
[2019-06-04T08:44:53.267Z] [INFO] Tests run: 4, Failures: 0, Errors: 0, Skipped: 0, Time elapsed:
84.594 s - in org.apache.maven.surefire.its.jiras.Surefire855AllowFailsafeUseArtifactFileIT
[2019-06-04T08:44:56.341Z] [INFO] Running org.apache.maven.surefire.its.jiras.Surefire972BizarreNoClassDefIT
[2019-06-04T08:44:56.341Z] [INFO] Tests run: 1, Failures: 0, Errors: 0, Skipped: 0, Time elapsed:
13.323 s - in org.apache.maven.surefire.its.jiras.Surefire972BizarreNoClassDefIT
[2019-06-04T08:45:02.457Z] [INFO] Running org.apache.maven.surefire.its.jiras.Surefire946KillMainProcessInReusableForkIT
[2019-06-04T08:45:02.457Z] [INFO] Tests run: 3, Failures: 0, Errors: 0, Skipped: 0, Time elapsed:
33.254 s - in org.apache.maven.surefire.its.jiras.Surefire946KillMainProcessInReusableForkIT
[2019-06-04T08:45:03.626Z] [INFO] Running org.apache.maven.surefire.its.jiras.Surefire975DefaultVMEncodingIT
[2019-06-04T08:45:03.626Z] [INFO] Tests run: 1, Failures: 0, Errors: 0, Skipped: 0, Time elapsed:
10.066 s - in org.apache.maven.surefire.its.jiras.Surefire975DefaultVMEncodingIT
[2019-06-04T08:45:43.334Z] [INFO] Running org.apache.maven.surefire.its.ModulePathIT
[2019-06-04T08:45:43.334Z] [WARNING] Tests run: 2, Failures: 0, Errors: 0, Skipped: 2, Time
elapsed: 0.001 s - in org.apache.maven.surefire.its.ModulePathIT
[2019-06-04T08:45:43.334Z] [INFO] Running org.apache.maven.surefire.its.jiras.Surefire979WrongClassLoaderIT
[2019-06-04T08:45:43.334Z] [INFO] Tests run: 1, Failures: 0, Errors: 0, Skipped: 0, Time elapsed:
9.349 s - in org.apache.maven.surefire.its.jiras.Surefire979WrongClassLoaderIT
[2019-06-04T08:45:43.334Z] [INFO] Running org.apache.maven.surefire.its.jiras.Surefire985ParameterizedRunnerAndCategoriesIT
[2019-06-04T08:45:43.334Z] [INFO] Tests run: 1, Failures: 0, Errors: 0, Skipped: 0, Time elapsed:
7.989 s - in org.apache.maven.surefire.its.jiras.Surefire985ParameterizedRunnerAndCategoriesIT
[2019-06-04T08:45:43.334Z] [INFO] Running org.apache.maven.surefire.its.JUnitPlatformIT
[2019-06-04T08:45:43.334Z] [WARNING] Tests run: 6, Failures: 0, Errors: 0, Skipped: 6, Time
elapsed: 0 s - in org.apache.maven.surefire.its.JUnitPlatformIT
[2019-06-04T08:45:43.334Z] [INFO] Running org.apache.maven.surefire.its.jiras.Surefire1585IT
[2019-06-04T08:45:43.334Z] [WARNING] Tests run: 2, Failures: 0, Errors: 0, Skipped: 2, Time
elapsed: 0 s - in org.apache.maven.surefire.its.jiras.Surefire1585IT
[2019-06-04T08:45:43.334Z] [INFO] Running org.apache.maven.surefire.its.jiras.Surefire1295AttributeJvmCrashesToTestsIT
[2019-06-04T08:45:43.334Z] [WARNING] Tests run: 9, Failures: 0, Errors: 0, Skipped: 9, Time
elapsed: 0.015 s - in org.apache.maven.surefire.its.jiras.Surefire1295AttributeJvmCrashesToTestsIT
[2019-06-04T08:45:43.334Z] [INFO] Running org.apache.maven.surefire.its.jiras.Surefire1265Java9IT
[2019-06-04T08:45:43.334Z] [WARNING] Tests run: 1, Failures: 0, Errors: 0, Skipped: 1, Time
elapsed: 0 s - in org.apache.maven.surefire.its.jiras.Surefire1265Java9IT
[2019-06-04T08:45:43.334Z] [INFO] Running org.apache.maven.surefire.its.JUnitPlatformEnginesIT
[2019-06-04T08:45:43.334Z] [WARNING] Tests run: 12, Failures: 0, Errors: 0, Skipped: 12, Time
elapsed: 0.018 s - in org.apache.maven.surefire.its.JUnitPlatformEnginesIT
[2019-06-04T08:45:43.334Z] [INFO] Running org.apache.maven.surefire.its.JUnitPlatformStreamCorruptionIT
[2019-06-04T08:45:43.334Z] [WARNING] Tests run: 1, Failures: 0, Errors: 0, Skipped: 1, Time
elapsed: 0 s - in org.apache.maven.surefire.its.JUnitPlatformStreamCorruptionIT
[2019-06-04T08:45:43.334Z] [INFO] Running org.apache.maven.surefire.its.TestMultipleMethodPatternsIT
[2019-06-04T08:45:43.334Z] [WARNING] Tests run: 180, Failures: 0, Errors: 0, Skipped: 87,
Time elapsed: 402.152 s - in org.apache.maven.surefire.its.TestMultipleMethodPatternsIT
[2019-06-04T08:45:43.334Z] [INFO] Running org.apache.maven.surefire.its.jiras.Surefire260TestWithIdenticalNamesIT
[2019-06-04T08:45:43.334Z] [WARNING] Tests run: 1, Failures: 0, Errors: 0, Skipped: 1, Time
elapsed: 0 s - in org.apache.maven.surefire.its.jiras.Surefire260TestWithIdenticalNamesIT
[2019-06-04T08:45:43.334Z] [INFO] Running org.apache.maven.surefire.its.jiras.Surefire995CategoryInheritanceIT
[2019-06-04T08:45:43.334Z] [INFO] Tests run: 5, Failures: 0, Errors: 0, Skipped: 0, Time elapsed:
34.951 s - in org.apache.maven.surefire.its.jiras.Surefire995CategoryInheritanceIT
[2019-06-04T08:45:43.334Z] [INFO] Running org.apache.maven.surefire.its.TestMultipleMethodPatternsTestNGIT
[2019-06-04T08:45:43.334Z] [WARNING] Tests run: 90, Failures: 0, Errors: 0, Skipped: 41, Time
elapsed: 304.921 s - in org.apache.maven.surefire.its.TestMultipleMethodPatternsTestNGIT
[2019-06-04T08:45:43.334Z] [INFO] Running org.apache.maven.surefire.its.Java9FullApiIT
[2019-06-04T08:45:43.334Z] [WARNING] Tests run: 3, Failures: 0, Errors: 0, Skipped: 3, Time
elapsed: 0 s - in org.apache.maven.surefire.its.Java9FullApiIT
[2019-06-04T08:45:43.334Z] [INFO] Running org.apache.maven.surefire.its.jiras.Surefire1534ReuseForksFalseWithJavaModuleIT
[2019-06-04T08:45:43.334Z] [WARNING] Tests run: 3, Failures: 0, Errors: 0, Skipped: 3, Time
elapsed: 0 s - in org.apache.maven.surefire.its.jiras.Surefire1534ReuseForksFalseWithJavaModuleIT
[2019-06-04T08:45:43.334Z] [INFO] 
[2019-06-04T08:45:43.334Z] [INFO] Results:
[2019-06-04T08:45:43.334Z] [INFO] 
[2019-06-04T08:45:43.334Z] [WARNING] Tests run: 792, Failures: 0, Errors: 0, Skipped: 172
[2019-06-04T08:45:43.334Z] [INFO] 
[2019-06-04T08:45:43.334Z] [INFO] 
[2019-06-04T08:45:43.334Z] [INFO] --- maven-checkstyle-plugin:3.0.0:check (checkstyle-check)
@ surefire-its ---
[2019-06-04T08:45:43.334Z] [INFO] 
[2019-06-04T08:45:43.334Z] [INFO] --- maven-failsafe-plugin:3.0.0-M3:verify (default) @ surefire-its
---
[2019-06-04T08:45:43.334Z] [INFO] Failsafe report directory: C:\Users\jenkins\AppData\Local\Temp\2\jenkins-maven-box-maven-surefire-parallel-6@2\surefire-its\target\failsafe-reports
[2019-06-04T08:45:43.334Z] [INFO] 
[2019-06-04T08:45:43.334Z] [INFO] --- maven-install-plugin:2.5.2:install (default-install)
@ surefire-its ---
[2019-06-04T08:45:43.334Z] [INFO] Skipping artifact installation
[2019-06-04T08:45:43.334Z] [INFO] ------------------------------------------------------------------------
[2019-06-04T08:45:43.334Z] [INFO] Reactor Summary for Apache Maven Surefire 3.0.0-SNAPSHOT:
[2019-06-04T08:45:43.334Z] [INFO] 
[2019-06-04T08:45:43.334Z] [INFO] Apache Maven Surefire .............................. SUCCESS
[ 30.079 s]
[2019-06-04T08:45:43.334Z] [INFO] SureFire Logger API ................................ SUCCESS
[ 10.217 s]
[2019-06-04T08:45:43.334Z] [INFO] SureFire API ....................................... SUCCESS
[ 24.021 s]
[2019-06-04T08:45:43.334Z] [INFO] SureFire Booter .................................... SUCCESS
[ 23.440 s]
[2019-06-04T08:45:43.334Z] [INFO] Maven Surefire Test-Grouping Support ............... SUCCESS
[ 11.318 s]
[2019-06-04T08:45:43.334Z] [INFO] SureFire Providers ................................. SUCCESS
[  2.423 s]
[2019-06-04T08:45:43.334Z] [INFO] Shared JUnit3 Provider Code ........................ SUCCESS
[  7.832 s]
[2019-06-04T08:45:43.334Z] [INFO] Shared Java 5 Provider Base ........................ SUCCESS
[  8.284 s]
[2019-06-04T08:45:43.334Z] [INFO] Shared JUnit4 Provider Code ........................ SUCCESS
[  9.794 s]
[2019-06-04T08:45:43.334Z] [INFO] Shared JUnit48 Provider Code ....................... SUCCESS
[ 10.420 s]
[2019-06-04T08:45:43.334Z] [INFO] SureFire JUnit Runner .............................. SUCCESS
[  7.794 s]
[2019-06-04T08:45:43.334Z] [INFO] SureFire JUnit4 Runner ............................. SUCCESS
[  7.289 s]
[2019-06-04T08:45:43.334Z] [INFO] Maven Surefire Common .............................. SUCCESS
[ 46.556 s]
[2019-06-04T08:45:43.334Z] [INFO] SureFire JUnitCore Runner .......................... SUCCESS
[02:20 min]
[2019-06-04T08:45:43.334Z] [INFO] SureFire JUnit Platform Runner ..................... SUCCESS
[ 19.561 s]
[2019-06-04T08:45:43.334Z] [INFO] SureFire TestNG Utils .............................. SUCCESS
[ 10.837 s]
[2019-06-04T08:45:43.334Z] [INFO] SureFire TestNG Runner ............................. SUCCESS
[ 11.935 s]
[2019-06-04T08:45:43.334Z] [INFO] ShadeFire JUnit3 Provider .......................... SUCCESS
[  3.026 s]
[2019-06-04T08:45:43.334Z] [INFO] Surefire Report Parser ............................. SUCCESS
[ 12.543 s]
[2019-06-04T08:45:43.334Z] [INFO] Maven Surefire Plugin .............................. SUCCESS
[ 21.005 s]
[2019-06-04T08:45:43.334Z] [INFO] Maven Failsafe Plugin .............................. SUCCESS
[01:32 min]
[2019-06-04T08:45:43.334Z] [INFO] Maven Surefire Report Plugin ....................... SUCCESS
[ 30.653 s]
[2019-06-04T08:45:43.334Z] [INFO] Maven Surefire Integration Tests ................... SUCCESS
[59:45 min]
[2019-06-04T08:45:43.334Z] [INFO] ------------------------------------------------------------------------
[2019-06-04T08:45:43.334Z] [INFO] BUILD SUCCESS
[2019-06-04T08:45:43.334Z] [INFO] ------------------------------------------------------------------------
[2019-06-04T08:45:43.334Z] [INFO] Total time:  01:08 h
[2019-06-04T08:45:43.334Z] [INFO] Finished at: 2019-06-04T08:45:39Z
[2019-06-04T08:45:43.334Z] [INFO] ------------------------------------------------------------------------
[Pipeline] }
[Pipeline] // withEnv
[Pipeline] }
[Pipeline] // stage
[Pipeline] fileExists
[Pipeline] zip
[2019-06-04T08:45:43.579Z] Writing zip file of C:\Users\jenkins\AppData\Local\Temp\2\jenkins-maven-box-maven-surefire-parallel-6@2\maven-failsafe-plugin\target\it
to C:\Users\jenkins\AppData\Local\Temp\2\jenkins-maven-box-maven-surefire-parallel-6@2\maven-failsafe-plugin--windows-jdk7-maven3.6.x.zip
[2019-06-04T08:45:43.623Z] Zipped 30 entries.
[2019-06-04T08:45:43.624Z] Archiving C:\Users\jenkins\AppData\Local\Temp\2\jenkins-maven-box-maven-surefire-parallel-6@2\maven-failsafe-plugin--windows-jdk7-maven3.6.x.zip
[2019-06-04T08:45:43.624Z] [Fast Archiver] No prior successful build to compare, so performing
full copy of artifacts
[Pipeline] fileExists
[Pipeline] zip
[2019-06-04T08:45:43.729Z] Writing zip file of C:\Users\jenkins\AppData\Local\Temp\2\jenkins-maven-box-maven-surefire-parallel-6@2\surefire-its\target
to C:\Users\jenkins\AppData\Local\Temp\2\jenkins-maven-box-maven-surefire-parallel-6@2\surefire-its--windows-jdk7-maven3.6.x.zip
[2019-06-04T08:45:55.623Z] Zipped 15892 entries.
[2019-06-04T08:45:55.623Z] Archiving C:\Users\jenkins\AppData\Local\Temp\2\jenkins-maven-box-maven-surefire-parallel-6@2\surefire-its--windows-jdk7-maven3.6.x.zip
[2019-06-04T08:45:55.623Z] [Fast Archiver] No prior successful build to compare, so performing
full copy of artifacts
[Pipeline] archiveArtifacts
[2019-06-04T08:45:57.139Z] Archiving artifacts
[2019-06-04T08:45:57.160Z] [Fast Archiver] No prior successful build to compare, so performing
full copy of artifacts
[Pipeline] cleanWs
[2019-06-04T08:45:58.767Z] [WS-CLEANUP] Deleting project workspace...
[2019-06-04T08:45:58.768Z] [WS-CLEANUP] Deferred wipeout is used...
[2019-06-04T08:45:58.956Z] [WS-CLEANUP] done
[Pipeline] }
[Pipeline] // ws
[Pipeline] }
[Pipeline] // timestamps
[Pipeline] }
[Pipeline] // node
[Pipeline] }
[Pipeline] // parallel
[Pipeline] echo
Build result: FAILURE
[Pipeline] jiraIssueSelector
[Pipeline] jiraComment
[Pipeline] emailext
Mime
  • Unnamed multipart/mixed (inline, None, 0 bytes)
View raw message