maven-notifications mailing list archives

Site index · List index
Message view « Date » · « Thread »
Top « Date » · « Thread »
From Apache Jenkins Server <jenk...@builds.apache.org>
Subject Build failed in Jenkins: Maven TLP » maven-surefire » deployment #6
Date Tue, 04 Jun 2019 11:13:19 GMT
See https://builds.apache.org/job/maven-box/job/maven-surefire/job/deployment/6/

Changes:

* [MNG-6573] Use Maven 3.6.0 as default
* H39 has weird issues, exclude it for now
* Fix no access to currentBuild.rawBuild
* fixed typo
* Include more recent JDKs

1 tests failed.
FAILED:  org.apache.maven.surefire.its.JUnitPlatformEnginesIT.platform[1.4.0-SNAPSHOT]

Error Message:

Expected: <[\[DEBUG\] test\(compact\) classpath:  test-classes  classes  junit-jupiter-engine-5\.4\.0-SNAPSHOT\.jar
 apiguardian-api-1\.0\.0\.jar  junit-platform-engine-1\.4\.0-SNAPSHOT\.jar  junit-platform-commons-1\.4\.0-SNAPSHOT\.jar
 opentest4j-1\.1\.1\.jar  junit-jupiter-api-5\.4\.0-SNAPSHOT\.jar]>
     but: was <[[DEBUG] test(compact) classpath:  test-classes  classes  junit-jupiter-engine-5.4.0-SNAPSHOT.jar
 apiguardian-api-1.0.0.jar  junit-platform-engine-1.4.0-SNAPSHOT.jar  opentest4j-1.1.1.jar
 junit-platform-commons-1.4.0-SNAPSHOT.jar  junit-jupiter-api-5.4.0-SNAPSHOT.jar]>

Stack Trace:
java.lang.AssertionError: 

Expected: <[\[DEBUG\] test\(compact\) classpath:  test-classes  classes  junit-jupiter-engine-5\.4\.0-SNAPSHOT\.jar
 apiguardian-api-1\.0\.0\.jar  junit-platform-engine-1\.4\.0-SNAPSHOT\.jar  junit-platform-commons-1\.4\.0-SNAPSHOT\.jar
 opentest4j-1\.1\.1\.jar  junit-jupiter-api-5\.4\.0-SNAPSHOT\.jar]>
     but: was <[[DEBUG] test(compact) classpath:  test-classes  classes  junit-jupiter-engine-5.4.0-SNAPSHOT.jar
 apiguardian-api-1.0.0.jar  junit-platform-engine-1.4.0-SNAPSHOT.jar  opentest4j-1.1.1.jar
 junit-platform-commons-1.4.0-SNAPSHOT.jar  junit-jupiter-api-5.4.0-SNAPSHOT.jar]>
	at org.apache.maven.surefire.its.JUnitPlatformEnginesIT.platform(JUnitPlatformEnginesIT.java:111)




Build log:
[...truncated 47118 lines...]
[2019-06-04T10:58:14.032Z] [INFO] Tests run: 1, Failures: 0, Errors: 0, Skipped: 0, Time elapsed:
10.096 s - in org.apache.maven.surefire.its.jiras.Surefire408ManualProviderSelectionIT
[2019-06-04T10:58:14.032Z] [INFO] Running org.apache.maven.surefire.its.jiras.Surefire42NotExtendingTestCaseIT
[2019-06-04T10:58:24.869Z] [INFO] Tests run: 1, Failures: 0, Errors: 0, Skipped: 0, Time elapsed:
10.183 s - in org.apache.maven.surefire.its.jiras.Surefire42NotExtendingTestCaseIT
[2019-06-04T10:58:24.869Z] [INFO] Running org.apache.maven.surefire.its.jiras.Surefire44InnerClassTestIT
[2019-06-04T10:58:34.018Z] [INFO] Tests run: 1, Failures: 0, Errors: 0, Skipped: 0, Time elapsed:
9.894 s - in org.apache.maven.surefire.its.jiras.Surefire44InnerClassTestIT
[2019-06-04T10:58:34.018Z] [INFO] Running org.apache.maven.surefire.its.jiras.Surefire500PuzzlingErrorIT
[2019-06-04T10:58:42.744Z] [INFO] Tests run: 1, Failures: 0, Errors: 0, Skipped: 0, Time elapsed:
9.038 s - in org.apache.maven.surefire.its.jiras.Surefire500PuzzlingErrorIT
[2019-06-04T10:58:42.744Z] [INFO] Running org.apache.maven.surefire.its.jiras.Surefire510TestClassPathForkModesIT
[2019-06-04T10:59:02.115Z] [INFO] Tests run: 2, Failures: 0, Errors: 0, Skipped: 0, Time elapsed:
18.344 s - in org.apache.maven.surefire.its.jiras.Surefire510TestClassPathForkModesIT
[2019-06-04T10:59:02.115Z] [INFO] Running org.apache.maven.surefire.its.jiras.Surefire569RunTestFromDependencyJarsIT
[2019-06-04T10:59:11.232Z] [INFO] Tests run: 1, Failures: 0, Errors: 0, Skipped: 0, Time elapsed:
9.957 s - in org.apache.maven.surefire.its.jiras.Surefire569RunTestFromDependencyJarsIT
[2019-06-04T10:59:11.232Z] [INFO] Running org.apache.maven.surefire.its.jiras.Surefire570MultipleReportDirectoriesIT
[2019-06-04T11:00:09.299Z] [INFO] Tests run: 2, Failures: 0, Errors: 0, Skipped: 0, Time elapsed:
51.317 s - in org.apache.maven.surefire.its.jiras.Surefire570MultipleReportDirectoriesIT
[2019-06-04T11:00:09.300Z] [INFO] Running org.apache.maven.surefire.its.jiras.Surefire613TestCountInParallelIT
[2019-06-04T11:00:12.131Z] [INFO] Tests run: 1, Failures: 0, Errors: 0, Skipped: 0, Time elapsed:
9.903 s - in org.apache.maven.surefire.its.jiras.Surefire613TestCountInParallelIT
[2019-06-04T11:00:12.131Z] [INFO] Running org.apache.maven.surefire.its.jiras.Surefire621TestCountingJunit3InParallelIT
[2019-06-04T11:01:10.088Z] [INFO] Tests run: 5, Failures: 0, Errors: 0, Skipped: 0, Time elapsed:
50.874 s - in org.apache.maven.surefire.its.jiras.Surefire621TestCountingJunit3InParallelIT
[2019-06-04T11:01:10.088Z] [INFO] Running org.apache.maven.surefire.its.jiras.Surefire628ConsoleOutputBeforeAndAfterClassIT
[2019-06-04T11:01:13.065Z] [INFO] Tests run: 1, Failures: 0, Errors: 0, Skipped: 0, Time elapsed:
9.848 s - in org.apache.maven.surefire.its.jiras.Surefire628ConsoleOutputBeforeAndAfterClassIT
[2019-06-04T11:01:13.065Z] [INFO] Running org.apache.maven.surefire.its.jiras.Surefire634UnsettableSystemPropertiesWarningIT
[2019-06-04T11:01:22.027Z] [INFO] Tests run: 1, Failures: 0, Errors: 0, Skipped: 0, Time elapsed:
8.232 s - in org.apache.maven.surefire.its.jiras.Surefire634UnsettableSystemPropertiesWarningIT
[2019-06-04T11:01:22.027Z] [INFO] Running org.apache.maven.surefire.its.jiras.Surefire649EmptyStringSystemPropertiesIT
[2019-06-04T11:01:35.539Z] [INFO] Tests run: 2, Failures: 0, Errors: 0, Skipped: 0, Time elapsed:
14.411 s - in org.apache.maven.surefire.its.jiras.Surefire649EmptyStringSystemPropertiesIT
[2019-06-04T11:01:35.539Z] [INFO] Running org.apache.maven.surefire.its.jiras.Surefire673MockitoIT
[2019-06-04T11:01:48.748Z] [INFO] Tests run: 1, Failures: 0, Errors: 0, Skipped: 0, Time elapsed:
11.067 s - in org.apache.maven.surefire.its.jiras.Surefire673MockitoIT
[2019-06-04T11:01:48.748Z] [INFO] Running org.apache.maven.surefire.its.jiras.Surefire674BuildFailingWhenErrorsIT
[2019-06-04T11:01:55.874Z] [INFO] Tests run: 1, Failures: 0, Errors: 0, Skipped: 0, Time elapsed:
8.703 s - in org.apache.maven.surefire.its.jiras.Surefire674BuildFailingWhenErrorsIT
[2019-06-04T11:01:55.874Z] [INFO] Running org.apache.maven.surefire.its.jiras.Surefire674BuildFailingWhenFailsafeErrorsIT
[2019-06-04T11:02:11.592Z] [INFO] Tests run: 1, Failures: 0, Errors: 0, Skipped: 0, Time elapsed:
15.487 s - in org.apache.maven.surefire.its.jiras.Surefire674BuildFailingWhenFailsafeErrorsIT
[2019-06-04T11:02:11.592Z] [INFO] Running org.apache.maven.surefire.its.jiras.Surefire685CommaSeparatedIncludesIT
[2019-06-04T11:02:20.536Z] [INFO] Tests run: 1, Failures: 0, Errors: 0, Skipped: 0, Time elapsed:
8.991 s - in org.apache.maven.surefire.its.jiras.Surefire685CommaSeparatedIncludesIT
[2019-06-04T11:02:20.536Z] [INFO] Running org.apache.maven.surefire.its.jiras.Surefire697NiceSummaryIT
[2019-06-04T11:02:30.025Z] [INFO] Tests run: 1, Failures: 0, Errors: 0, Skipped: 0, Time elapsed:
9.432 s - in org.apache.maven.surefire.its.jiras.Surefire697NiceSummaryIT
[2019-06-04T11:02:30.025Z] [INFO] Running org.apache.maven.surefire.its.jiras.Surefire705ParallelForkTimeoutIT
[2019-06-04T11:02:40.821Z] [INFO] Tests run: 1, Failures: 0, Errors: 0, Skipped: 0, Time elapsed:
11.173 s - in org.apache.maven.surefire.its.jiras.Surefire705ParallelForkTimeoutIT
[2019-06-04T11:02:40.821Z] [INFO] Running org.apache.maven.surefire.its.jiras.Surefire733AllOverrridesCapturedIT
[2019-06-04T11:02:49.715Z] [INFO] Tests run: 1, Failures: 0, Errors: 0, Skipped: 0, Time elapsed:
8.811 s - in org.apache.maven.surefire.its.jiras.Surefire733AllOverrridesCapturedIT
[2019-06-04T11:02:49.715Z] [INFO] Running org.apache.maven.surefire.its.jiras.Surefire735ForkFailWithRedirectConsoleOutputIT
[2019-06-04T11:03:06.026Z] [INFO] Tests run: 2, Failures: 0, Errors: 0, Skipped: 0, Time elapsed:
15.441 s - in org.apache.maven.surefire.its.jiras.Surefire735ForkFailWithRedirectConsoleOutputIT
[2019-06-04T11:03:06.026Z] [INFO] Running org.apache.maven.surefire.its.jiras.Surefire740TruncatedCommaIT
[2019-06-04T11:03:13.602Z] [INFO] Tests run: 1, Failures: 0, Errors: 0, Skipped: 0, Time elapsed:
8.17 s - in org.apache.maven.surefire.its.jiras.Surefire740TruncatedCommaIT
[2019-06-04T11:03:13.602Z] [INFO] Running org.apache.maven.surefire.its.jiras.Surefire747MethodParallelWithSuiteCountIT
[2019-06-04T11:03:47.431Z] [INFO] Tests run: 2, Failures: 0, Errors: 0, Skipped: 0, Time elapsed:
29.198 s - in org.apache.maven.surefire.its.jiras.Surefire747MethodParallelWithSuiteCountIT
[2019-06-04T11:03:47.431Z] [INFO] Running org.apache.maven.surefire.its.jiras.Surefire772BothReportsIT
[2019-06-04T11:03:57.897Z] [INFO] Tests run: 3, Failures: 0, Errors: 0, Skipped: 0, Time elapsed:
15.35 s - in org.apache.maven.surefire.its.jiras.Surefire772BothReportsIT
[2019-06-04T11:03:57.897Z] [INFO] Running org.apache.maven.surefire.its.jiras.Surefire772NoFailsafeReportsIT
[2019-06-04T11:04:20.533Z] [INFO] Tests run: 4, Failures: 0, Errors: 0, Skipped: 0, Time elapsed:
20.152 s - in org.apache.maven.surefire.its.jiras.Surefire772NoFailsafeReportsIT
[2019-06-04T11:04:20.533Z] [INFO] Running org.apache.maven.surefire.its.jiras.Surefire772NoSurefireReportsIT
[2019-06-04T11:04:45.372Z] [INFO] Tests run: 4, Failures: 0, Errors: 0, Skipped: 0, Time elapsed:
24.346 s - in org.apache.maven.surefire.its.jiras.Surefire772NoSurefireReportsIT
[2019-06-04T11:04:45.372Z] [INFO] Running org.apache.maven.surefire.its.jiras.Surefire772SpecifiedReportsIT
[2019-06-04T11:05:00.963Z] [INFO] Tests run: 3, Failures: 0, Errors: 0, Skipped: 0, Time elapsed:
16.937 s - in org.apache.maven.surefire.its.jiras.Surefire772SpecifiedReportsIT
[2019-06-04T11:05:00.963Z] [INFO] Running org.apache.maven.surefire.its.jiras.Surefire801ForkModeNoneClassLoaderIT
[2019-06-04T11:05:06.686Z] [INFO] Tests run: 1, Failures: 0, Errors: 0, Skipped: 0, Time elapsed:
7.08 s - in org.apache.maven.surefire.its.jiras.Surefire801ForkModeNoneClassLoaderIT
[2019-06-04T11:05:06.687Z] [INFO] Running org.apache.maven.surefire.its.jiras.Surefire803MultiFailsafeExecsIT
[2019-06-04T11:05:46.686Z] [INFO] Tests run: 2, Failures: 0, Errors: 0, Skipped: 0, Time elapsed:
34.576 s - in org.apache.maven.surefire.its.jiras.Surefire803MultiFailsafeExecsIT
[2019-06-04T11:05:46.686Z] [INFO] Running org.apache.maven.surefire.its.jiras.Surefire806SpecifiedTestControlsIT
[2019-06-04T11:05:49.558Z] [WARNING] Tests run: 3, Failures: 0, Errors: 0, Skipped: 2, Time
elapsed: 8.692 s - in org.apache.maven.surefire.its.jiras.Surefire806SpecifiedTestControlsIT
[2019-06-04T11:05:49.558Z] [INFO] Running org.apache.maven.surefire.its.jiras.Surefire809GroupExpressionsIT
[2019-06-04T11:06:46.932Z] [INFO] Tests run: 6, Failures: 0, Errors: 0, Skipped: 0, Time elapsed:
51.001 s - in org.apache.maven.surefire.its.jiras.Surefire809GroupExpressionsIT
[2019-06-04T11:06:46.932Z] [INFO] Running org.apache.maven.surefire.its.jiras.Surefire812Log4JClassLoaderIT
[2019-06-04T11:06:49.729Z] [INFO] Tests run: 1, Failures: 0, Errors: 0, Skipped: 0, Time elapsed:
9.053 s - in org.apache.maven.surefire.its.jiras.Surefire812Log4JClassLoaderIT
[2019-06-04T11:06:49.729Z] [INFO] Running org.apache.maven.surefire.its.jiras.Surefire817SystemExitIT
[2019-06-04T11:06:58.305Z] [INFO] Tests run: 1, Failures: 0, Errors: 0, Skipped: 0, Time elapsed:
7.94 s - in org.apache.maven.surefire.its.jiras.Surefire817SystemExitIT
[2019-06-04T11:06:58.305Z] [INFO] Running org.apache.maven.surefire.its.jiras.Surefire818NpeIgnoresTestsIT
[2019-06-04T11:07:08.792Z] [INFO] Tests run: 1, Failures: 0, Errors: 0, Skipped: 0, Time elapsed:
9.685 s - in org.apache.maven.surefire.its.jiras.Surefire818NpeIgnoresTestsIT
[2019-06-04T11:07:08.792Z] [INFO] Running org.apache.maven.surefire.its.jiras.Surefire828EmptyGroupExprIT
[2019-06-04T11:07:48.609Z] [INFO] Tests run: 4, Failures: 0, Errors: 0, Skipped: 0, Time elapsed:
35.106 s - in org.apache.maven.surefire.its.jiras.Surefire828EmptyGroupExprIT
[2019-06-04T11:07:48.609Z] [INFO] Running org.apache.maven.surefire.its.jiras.Surefire832ProviderSelectionIT
[2019-06-04T11:07:52.224Z] [INFO] Tests run: 1, Failures: 0, Errors: 0, Skipped: 0, Time elapsed:
9.363 s - in org.apache.maven.surefire.its.jiras.Surefire832ProviderSelectionIT
[2019-06-04T11:07:52.224Z] [INFO] Running org.apache.maven.surefire.its.jiras.Surefire839TestWithoutCategoriesIT
[2019-06-04T11:08:12.718Z] [INFO] Tests run: 2, Failures: 0, Errors: 0, Skipped: 0, Time elapsed:
18.036 s - in org.apache.maven.surefire.its.jiras.Surefire839TestWithoutCategoriesIT
[2019-06-04T11:08:12.718Z] [INFO] Running org.apache.maven.surefire.its.jiras.Surefire847AdditionalFailureIT
[2019-06-04T11:08:20.998Z] [INFO] Tests run: 1, Failures: 0, Errors: 0, Skipped: 0, Time elapsed:
10.957 s - in org.apache.maven.surefire.its.jiras.Surefire847AdditionalFailureIT
[2019-06-04T11:08:20.998Z] [INFO] Running org.apache.maven.surefire.its.jiras.Surefire855AllowFailsafeUseArtifactFileIT
[2019-06-04T11:09:44.768Z] [INFO] Tests run: 4, Failures: 0, Errors: 0, Skipped: 0, Time elapsed:
79.071 s - in org.apache.maven.surefire.its.jiras.Surefire855AllowFailsafeUseArtifactFileIT
[2019-06-04T11:09:44.768Z] [INFO] Running org.apache.maven.surefire.its.jiras.Surefire901MIssingResultfileWhenNoTestsIT
[2019-06-04T11:09:46.875Z] [INFO] Tests run: 1, Failures: 0, Errors: 0, Skipped: 0, Time elapsed:
6.903 s - in org.apache.maven.surefire.its.jiras.Surefire901MIssingResultfileWhenNoTestsIT
[2019-06-04T11:09:46.875Z] [INFO] Running org.apache.maven.surefire.its.jiras.Surefire907PerThreadWithoutThreadCountIT
[2019-06-04T11:09:53.850Z] [INFO] Tests run: 1, Failures: 0, Errors: 0, Skipped: 0, Time elapsed:
5.893 s - in org.apache.maven.surefire.its.jiras.Surefire907PerThreadWithoutThreadCountIT
[2019-06-04T11:09:53.850Z] [INFO] Running org.apache.maven.surefire.its.jiras.Surefire920TestFailureIgnoreWithTimeoutIT
[2019-06-04T11:10:12.542Z] [INFO] Tests run: 2, Failures: 0, Errors: 0, Skipped: 0, Time elapsed:
17.857 s - in org.apache.maven.surefire.its.jiras.Surefire920TestFailureIgnoreWithTimeoutIT
[2019-06-04T11:10:12.542Z] [INFO] Running org.apache.maven.surefire.its.jiras.Surefire926FailureWith2ProvidersIT
[2019-06-04T11:10:25.943Z] [INFO] Tests run: 1, Failures: 0, Errors: 0, Skipped: 0, Time elapsed:
13.258 s - in org.apache.maven.surefire.its.jiras.Surefire926FailureWith2ProvidersIT
[2019-06-04T11:10:25.943Z] [INFO] Running org.apache.maven.surefire.its.jiras.Surefire930TestNgSuiteXmlIT
[2019-06-04T11:10:35.293Z] [INFO] Tests run: 1, Failures: 0, Errors: 0, Skipped: 0, Time elapsed:
10.49 s - in org.apache.maven.surefire.its.jiras.Surefire930TestNgSuiteXmlIT
[2019-06-04T11:10:35.293Z] [INFO] Running org.apache.maven.surefire.its.jiras.Surefire943ReportContentIT
[2019-06-04T11:11:16.757Z] [INFO] Tests run: 2, Failures: 0, Errors: 0, Skipped: 0, Time elapsed:
38.044 s - in org.apache.maven.surefire.its.jiras.Surefire943ReportContentIT
[2019-06-04T11:11:16.757Z] [INFO] Running org.apache.maven.surefire.its.jiras.Surefire946KillMainProcessInReusableForkIT
[2019-06-04T11:11:44.853Z] [INFO] Tests run: 3, Failures: 0, Errors: 0, Skipped: 0, Time elapsed:
28.615 s - in org.apache.maven.surefire.its.jiras.Surefire946KillMainProcessInReusableForkIT
[2019-06-04T11:11:44.853Z] [INFO] Running org.apache.maven.surefire.its.jiras.Surefire972BizarreNoClassDefIT
[2019-06-04T11:11:55.273Z] [INFO] Tests run: 1, Failures: 0, Errors: 0, Skipped: 0, Time elapsed:
12.961 s - in org.apache.maven.surefire.its.jiras.Surefire972BizarreNoClassDefIT
[2019-06-04T11:11:55.273Z] [INFO] Running org.apache.maven.surefire.its.jiras.Surefire975DefaultVMEncodingIT
[2019-06-04T11:12:04.544Z] [INFO] Tests run: 1, Failures: 0, Errors: 0, Skipped: 0, Time elapsed:
8.947 s - in org.apache.maven.surefire.its.jiras.Surefire975DefaultVMEncodingIT
[2019-06-04T11:12:04.544Z] [INFO] Running org.apache.maven.surefire.its.jiras.Surefire979WrongClassLoaderIT
[2019-06-04T11:12:11.490Z] [INFO] Tests run: 1, Failures: 0, Errors: 0, Skipped: 0, Time elapsed:
8.038 s - in org.apache.maven.surefire.its.jiras.Surefire979WrongClassLoaderIT
[2019-06-04T11:12:11.490Z] [INFO] Running org.apache.maven.surefire.its.jiras.Surefire985ParameterizedRunnerAndCategoriesIT
[2019-06-04T11:12:18.747Z] [INFO] Tests run: 1, Failures: 0, Errors: 0, Skipped: 0, Time elapsed:
6.448 s - in org.apache.maven.surefire.its.jiras.Surefire985ParameterizedRunnerAndCategoriesIT
[2019-06-04T11:12:18.747Z] [INFO] Running org.apache.maven.surefire.its.jiras.Surefire995CategoryInheritanceIT
[2019-06-04T11:12:58.382Z] [INFO] Tests run: 5, Failures: 0, Errors: 0, Skipped: 0, Time elapsed:
34.38 s - in org.apache.maven.surefire.its.jiras.Surefire995CategoryInheritanceIT
[2019-06-04T11:12:58.383Z] [INFO] 
[2019-06-04T11:12:58.383Z] [INFO] Results:
[2019-06-04T11:12:58.383Z] [INFO] 
[2019-06-04T11:12:58.383Z] [ERROR] Failures: 
[2019-06-04T11:12:58.383Z] [ERROR]   JUnitPlatformEnginesIT.platform:111 
[2019-06-04T11:12:58.383Z] Expected: <[\[DEBUG\] test\(compact\) classpath:  test-classes
 classes  junit-jupiter-engine-5\.4\.0-SNAPSHOT\.jar  apiguardian-api-1\.0\.0\.jar  junit-platform-engine-1\.4\.0-SNAPSHOT\.jar
 junit-platform-commons-1\.4\.0-SNAPSHOT\.jar  opentest4j-1\.1\.1\.jar  junit-jupiter-api-5\.4\.0-SNAPSHOT\.jar]>
[2019-06-04T11:12:58.383Z]      but: was <[[DEBUG] test(compact) classpath:  test-classes
 classes  junit-jupiter-engine-5.4.0-SNAPSHOT.jar  apiguardian-api-1.0.0.jar  junit-platform-engine-1.4.0-SNAPSHOT.jar
 opentest4j-1.1.1.jar  junit-platform-commons-1.4.0-SNAPSHOT.jar  junit-jupiter-api-5.4.0-SNAPSHOT.jar]>
[2019-06-04T11:12:58.383Z] [INFO] 
[2019-06-04T11:12:58.383Z] [ERROR] Tests run: 788, Failures: 1, Errors: 0, Skipped: 150
[2019-06-04T11:12:58.383Z] [INFO] 
[2019-06-04T11:12:58.383Z] [INFO] 
[2019-06-04T11:12:58.383Z] [INFO] --- maven-checkstyle-plugin:3.0.0:check (checkstyle-check)
@ surefire-its ---
[2019-06-04T11:12:58.383Z] [INFO] 
[2019-06-04T11:12:58.383Z] [INFO] --- maven-failsafe-plugin:3.0.0-M3:verify (default) @ surefire-its
---
[2019-06-04T11:12:58.383Z] [INFO] Failsafe report directory: C:\Users\jenkins\AppData\Local\Temp\2\jenkins-maven-box-maven-surefire-deployment-6\surefire-its\target\failsafe-reports
[2019-06-04T11:12:58.383Z] [INFO] ------------------------------------------------------------------------
[2019-06-04T11:12:58.383Z] [INFO] Reactor Summary for Apache Maven Surefire 3.0.0-M4-SNAPSHOT:
[2019-06-04T11:12:58.383Z] [INFO] 
[2019-06-04T11:12:58.383Z] [INFO] Apache Maven Surefire .............................. SUCCESS
[ 53.441 s]
[2019-06-04T11:12:58.383Z] [INFO] SureFire Logger API ................................ SUCCESS
[ 11.044 s]
[2019-06-04T11:12:58.383Z] [INFO] SureFire API ....................................... SUCCESS
[ 20.206 s]
[2019-06-04T11:12:58.383Z] [INFO] SureFire Booter .................................... SUCCESS
[ 21.460 s]
[2019-06-04T11:12:58.383Z] [INFO] Maven Surefire Test-Grouping Support ............... SUCCESS
[ 12.934 s]
[2019-06-04T11:12:58.383Z] [INFO] SureFire Providers ................................. SUCCESS
[  2.059 s]
[2019-06-04T11:12:58.383Z] [INFO] Shared JUnit3 Provider Code ........................ SUCCESS
[  7.146 s]
[2019-06-04T11:12:58.383Z] [INFO] Shared Java 5 Provider Base ........................ SUCCESS
[  8.862 s]
[2019-06-04T11:12:58.383Z] [INFO] Shared JUnit4 Provider Code ........................ SUCCESS
[  8.735 s]
[2019-06-04T11:12:58.383Z] [INFO] Shared JUnit48 Provider Code ....................... SUCCESS
[ 10.323 s]
[2019-06-04T11:12:58.383Z] [INFO] SureFire JUnit Runner .............................. SUCCESS
[  8.331 s]
[2019-06-04T11:12:58.383Z] [INFO] SureFire JUnit4 Runner ............................. SUCCESS
[ 17.081 s]
[2019-06-04T11:12:58.383Z] [INFO] Maven Surefire Common .............................. SUCCESS
[ 39.723 s]
[2019-06-04T11:12:58.383Z] [INFO] SureFire JUnitCore Runner .......................... SUCCESS
[02:25 min]
[2019-06-04T11:12:58.383Z] [INFO] SureFire JUnit Platform Runner ..................... SUCCESS
[ 14.737 s]
[2019-06-04T11:12:58.383Z] [INFO] SureFire TestNG Utils .............................. SUCCESS
[  7.516 s]
[2019-06-04T11:12:58.383Z] [INFO] SureFire TestNG Runner ............................. SUCCESS
[  8.572 s]
[2019-06-04T11:12:58.383Z] [INFO] ShadeFire JUnit3 Provider .......................... SUCCESS
[  4.345 s]
[2019-06-04T11:12:58.383Z] [INFO] Surefire Report Parser ............................. SUCCESS
[ 10.551 s]
[2019-06-04T11:12:58.383Z] [INFO] Maven Surefire Plugin .............................. SUCCESS
[ 19.487 s]
[2019-06-04T11:12:58.383Z] [INFO] Maven Failsafe Plugin .............................. SUCCESS
[02:15 min]
[2019-06-04T11:12:58.383Z] [INFO] Maven Surefire Report Plugin ....................... SUCCESS
[ 22.220 s]
[2019-06-04T11:12:58.383Z] [INFO] Maven Surefire Integration Tests ................... FAILURE
[  01:42 h]
[2019-06-04T11:12:58.383Z] [INFO] ------------------------------------------------------------------------
[2019-06-04T11:12:58.383Z] [INFO] BUILD FAILURE
[2019-06-04T11:12:58.383Z] [INFO] ------------------------------------------------------------------------
[2019-06-04T11:12:58.383Z] [INFO] Total time:  01:52 h
[2019-06-04T11:12:58.383Z] [INFO] Finished at: 2019-06-04T04:12:54-07:00
[2019-06-04T11:12:58.383Z] [INFO] ------------------------------------------------------------------------
[2019-06-04T11:12:58.383Z] [ERROR] Failed to execute goal org.apache.maven.plugins:maven-failsafe-plugin:3.0.0-M3:verify
(default) on project surefire-its: There are test failures.
[2019-06-04T11:12:58.383Z] [ERROR] 
[2019-06-04T11:12:58.383Z] [ERROR] Please refer to C:\Users\jenkins\AppData\Local\Temp\2\jenkins-maven-box-maven-surefire-deployment-6\surefire-its\target\failsafe-reports
for the individual test results.
[2019-06-04T11:12:58.383Z] [ERROR] Please refer to dump files (if any exist) [date].dump,
[date]-jvmRun[N].dump and [date].dumpstream.
[2019-06-04T11:12:58.383Z] [ERROR] -> [Help 1]
[2019-06-04T11:12:58.383Z] org.apache.maven.lifecycle.LifecycleExecutionException: Failed
to execute goal org.apache.maven.plugins:maven-failsafe-plugin:3.0.0-M3:verify (default) on
project surefire-its: There are test failures.
[2019-06-04T11:12:58.383Z] 
[2019-06-04T11:12:58.383Z] Please refer to C:\Users\jenkins\AppData\Local\Temp\2\jenkins-maven-box-maven-surefire-deployment-6\surefire-its\target\failsafe-reports
for the individual test results.
[2019-06-04T11:12:58.383Z] Please refer to dump files (if any exist) [date].dump, [date]-jvmRun[N].dump
and [date].dumpstream.
[2019-06-04T11:12:58.383Z]     at org.apache.maven.lifecycle.internal.MojoExecutor.execute
(MojoExecutor.java:215)
[2019-06-04T11:12:58.383Z]     at org.apache.maven.lifecycle.internal.MojoExecutor.execute
(MojoExecutor.java:156)
[2019-06-04T11:12:58.383Z]     at org.apache.maven.lifecycle.internal.MojoExecutor.execute
(MojoExecutor.java:148)
[2019-06-04T11:12:58.383Z]     at org.apache.maven.lifecycle.internal.LifecycleModuleBuilder.buildProject
(LifecycleModuleBuilder.java:117)
[2019-06-04T11:12:58.383Z]     at org.apache.maven.lifecycle.internal.LifecycleModuleBuilder.buildProject
(LifecycleModuleBuilder.java:81)
[2019-06-04T11:12:58.383Z]     at org.apache.maven.lifecycle.internal.builder.singlethreaded.SingleThreadedBuilder.build
(SingleThreadedBuilder.java:56)
[2019-06-04T11:12:58.383Z]     at org.apache.maven.lifecycle.internal.LifecycleStarter.execute
(LifecycleStarter.java:128)
[2019-06-04T11:12:58.383Z]     at org.apache.maven.DefaultMaven.doExecute (DefaultMaven.java:305)
[2019-06-04T11:12:58.383Z]     at org.apache.maven.DefaultMaven.doExecute (DefaultMaven.java:192)
[2019-06-04T11:12:58.383Z]     at org.apache.maven.DefaultMaven.execute (DefaultMaven.java:105)
[2019-06-04T11:12:58.383Z]     at org.apache.maven.cli.MavenCli.execute (MavenCli.java:956)
[2019-06-04T11:12:58.383Z]     at org.apache.maven.cli.MavenCli.doMain (MavenCli.java:288)
[2019-06-04T11:12:58.383Z]     at org.apache.maven.cli.MavenCli.main (MavenCli.java:192)
[2019-06-04T11:12:58.383Z]     at sun.reflect.NativeMethodAccessorImpl.invoke0 (Native Method)
[2019-06-04T11:12:58.383Z]     at sun.reflect.NativeMethodAccessorImpl.invoke (NativeMethodAccessorImpl.java:62)
[2019-06-04T11:12:58.383Z]     at sun.reflect.DelegatingMethodAccessorImpl.invoke (DelegatingMethodAccessorImpl.java:43)
[2019-06-04T11:12:58.383Z]     at java.lang.reflect.Method.invoke (Method.java:498)
[2019-06-04T11:12:58.383Z]     at org.codehaus.plexus.classworlds.launcher.Launcher.launchEnhanced
(Launcher.java:289)
[2019-06-04T11:12:58.383Z]     at org.codehaus.plexus.classworlds.launcher.Launcher.launch
(Launcher.java:229)
[2019-06-04T11:12:58.383Z]     at org.codehaus.plexus.classworlds.launcher.Launcher.mainWithExitCode
(Launcher.java:415)
[2019-06-04T11:12:58.383Z]     at org.codehaus.plexus.classworlds.launcher.Launcher.main (Launcher.java:356)
[2019-06-04T11:12:58.383Z] Caused by: org.apache.maven.plugin.MojoFailureException: There
are test failures.
[2019-06-04T11:12:58.383Z] 
[2019-06-04T11:12:58.383Z] Please refer to C:\Users\jenkins\AppData\Local\Temp\2\jenkins-maven-box-maven-surefire-deployment-6\surefire-its\target\failsafe-reports
for the individual test results.
[2019-06-04T11:12:58.383Z] Please refer to dump files (if any exist) [date].dump, [date]-jvmRun[N].dump
and [date].dumpstream.
[2019-06-04T11:12:58.383Z]     at org.apache.maven.plugin.surefire.SurefireHelper.throwException
(SurefireHelper.java:271)
[2019-06-04T11:12:58.383Z]     at org.apache.maven.plugin.surefire.SurefireHelper.reportExecution
(SurefireHelper.java:159)
[2019-06-04T11:12:58.384Z]     at org.apache.maven.plugin.failsafe.VerifyMojo.execute (VerifyMojo.java:192)
[2019-06-04T11:12:58.384Z]     at org.apache.maven.plugin.DefaultBuildPluginManager.executeMojo
(DefaultBuildPluginManager.java:137)
[2019-06-04T11:12:58.384Z]     at org.apache.maven.lifecycle.internal.MojoExecutor.execute
(MojoExecutor.java:210)
[2019-06-04T11:12:58.384Z]     at org.apache.maven.lifecycle.internal.MojoExecutor.execute
(MojoExecutor.java:156)
[2019-06-04T11:12:58.384Z]     at org.apache.maven.lifecycle.internal.MojoExecutor.execute
(MojoExecutor.java:148)
[2019-06-04T11:12:58.384Z]     at org.apache.maven.lifecycle.internal.LifecycleModuleBuilder.buildProject
(LifecycleModuleBuilder.java:117)
[2019-06-04T11:12:58.384Z]     at org.apache.maven.lifecycle.internal.LifecycleModuleBuilder.buildProject
(LifecycleModuleBuilder.java:81)
[2019-06-04T11:12:58.384Z]     at org.apache.maven.lifecycle.internal.builder.singlethreaded.SingleThreadedBuilder.build
(SingleThreadedBuilder.java:56)
[2019-06-04T11:12:58.384Z]     at org.apache.maven.lifecycle.internal.LifecycleStarter.execute
(LifecycleStarter.java:128)
[2019-06-04T11:12:58.384Z]     at org.apache.maven.DefaultMaven.doExecute (DefaultMaven.java:305)
[2019-06-04T11:12:58.384Z]     at org.apache.maven.DefaultMaven.doExecute (DefaultMaven.java:192)
[2019-06-04T11:12:58.384Z]     at org.apache.maven.DefaultMaven.execute (DefaultMaven.java:105)
[2019-06-04T11:12:58.384Z]     at org.apache.maven.cli.MavenCli.execute (MavenCli.java:956)
[2019-06-04T11:12:58.384Z]     at org.apache.maven.cli.MavenCli.doMain (MavenCli.java:288)
[2019-06-04T11:12:58.384Z]     at org.apache.maven.cli.MavenCli.main (MavenCli.java:192)
[2019-06-04T11:12:58.384Z]     at sun.reflect.NativeMethodAccessorImpl.invoke0 (Native Method)
[2019-06-04T11:12:58.384Z]     at sun.reflect.NativeMethodAccessorImpl.invoke (NativeMethodAccessorImpl.java:62)
[2019-06-04T11:12:58.384Z]     at sun.reflect.DelegatingMethodAccessorImpl.invoke (DelegatingMethodAccessorImpl.java:43)
[2019-06-04T11:12:58.384Z]     at java.lang.reflect.Method.invoke (Method.java:498)
[2019-06-04T11:12:58.384Z]     at org.codehaus.plexus.classworlds.launcher.Launcher.launchEnhanced
(Launcher.java:289)
[2019-06-04T11:12:58.384Z]     at org.codehaus.plexus.classworlds.launcher.Launcher.launch
(Launcher.java:229)
[2019-06-04T11:12:58.384Z]     at org.codehaus.plexus.classworlds.launcher.Launcher.mainWithExitCode
(Launcher.java:415)
[2019-06-04T11:12:58.384Z]     at org.codehaus.plexus.classworlds.launcher.Launcher.main (Launcher.java:356)
[2019-06-04T11:12:58.384Z] [ERROR] 
[2019-06-04T11:12:58.384Z] [ERROR] Re-run Maven using the -X switch to enable full debug logging.
[2019-06-04T11:12:58.384Z] [ERROR] 
[2019-06-04T11:12:58.384Z] [ERROR] For more information about the errors and possible solutions,
please read the following articles:
[2019-06-04T11:12:58.384Z] [ERROR] [Help 1] http://cwiki.apache.org/confluence/display/MAVEN/MojoFailureException
[2019-06-04T11:12:58.384Z] [ERROR] 
[2019-06-04T11:12:58.384Z] [ERROR] After correcting the problems, you can resume the build
with the command
[2019-06-04T11:12:58.384Z] [ERROR]   mvn <goals> -rf :surefire-its
[Pipeline] }
[Pipeline] // withEnv
[Pipeline] }
[Pipeline] // stage
[Pipeline] fileExists
[Pipeline] zip
[2019-06-04T11:12:58.664Z] Writing zip file of C:\Users\jenkins\AppData\Local\Temp\2\jenkins-maven-box-maven-surefire-deployment-6\maven-failsafe-plugin\target\it
to C:\Users\jenkins\AppData\Local\Temp\2\jenkins-maven-box-maven-surefire-deployment-6\maven-failsafe-plugin--windows-jdk8-maven3.6.x.zip
[2019-06-04T11:12:58.800Z] Zipped 78 entries.
[2019-06-04T11:12:58.800Z] Archiving C:\Users\jenkins\AppData\Local\Temp\2\jenkins-maven-box-maven-surefire-deployment-6\maven-failsafe-plugin--windows-jdk8-maven3.6.x.zip
[2019-06-04T11:12:58.801Z] [Fast Archiver] No prior successful build to compare, so performing
full copy of artifacts
[Pipeline] fileExists
[Pipeline] zip
[2019-06-04T11:12:58.981Z] Writing zip file of C:\Users\jenkins\AppData\Local\Temp\2\jenkins-maven-box-maven-surefire-deployment-6\surefire-its\target
to C:\Users\jenkins\AppData\Local\Temp\2\jenkins-maven-box-maven-surefire-deployment-6\surefire-its--windows-jdk8-maven3.6.x.zip
[2019-06-04T11:13:13.679Z] Zipped 15951 entries.
[2019-06-04T11:13:13.679Z] Archiving C:\Users\jenkins\AppData\Local\Temp\2\jenkins-maven-box-maven-surefire-deployment-6\surefire-its--windows-jdk8-maven3.6.x.zip
[2019-06-04T11:13:13.680Z] [Fast Archiver] No prior successful build to compare, so performing
full copy of artifacts
[Pipeline] archiveArtifacts
[2019-06-04T11:13:15.317Z] Archiving artifacts
[2019-06-04T11:13:15.360Z] [Fast Archiver] No prior successful build to compare, so performing
full copy of artifacts
[Pipeline] cleanWs
[2019-06-04T11:13:16.929Z] [WS-CLEANUP] Deleting project workspace...
[2019-06-04T11:13:16.929Z] [WS-CLEANUP] Deferred wipeout is used...
[2019-06-04T11:13:17.063Z] [WS-CLEANUP] done
[Pipeline] }
[Pipeline] // ws
[Pipeline] }
[Pipeline] // timestamps
[Pipeline] }
[Pipeline] // node
[Pipeline] }
[Pipeline] // parallel
[Pipeline] echo
Build result: FAILURE
[Pipeline] jiraIssueSelector
[Pipeline] jiraComment
[Pipeline] emailext
Mime
  • Unnamed multipart/mixed (inline, None, 0 bytes)
View raw message