maven-notifications mailing list archives

Site index · List index
Message view « Date » · « Thread »
Top « Date » · « Thread »
From Apache Jenkins Server <jenk...@builds.apache.org>
Subject Build failed in Jenkins: Maven TLP » maven-surefire » SUREFIRE-1603 #6
Date Tue, 04 Jun 2019 09:41:25 GMT
See https://builds.apache.org/job/maven-box/job/maven-surefire/job/SUREFIRE-1603/6/

Changes:

* [MNG-6573] Use Maven 3.6.0 as default
* H39 has weird issues, exclude it for now
* Fix no access to currentBuild.rawBuild
* fixed typo
* Include more recent JDKs

All tests passed

Build log:
[...truncated 24268 lines...]
[2019-06-04T09:41:10.757Z] [INFO] Downloading from central: https://repo.maven.apache.org/maven2/org/junit/platform/junit-platform-commons/1.3.1/junit-platform-commons-1.3.1.jar
[2019-06-04T09:41:10.757Z] [INFO] Downloading from central: https://repo.maven.apache.org/maven2/org/opentest4j/opentest4j/1.1.1/opentest4j-1.1.1.jar
[2019-06-04T09:41:10.757Z] [INFO] Downloading from central: https://repo.maven.apache.org/maven2/org/apiguardian/apiguardian-api/1.0.0/apiguardian-api-1.0.0.jar
[2019-06-04T09:41:10.757Z] [INFO] Downloading from central: https://repo.maven.apache.org/maven2/org/junit/platform/junit-platform-engine/1.3.1/junit-platform-engine-1.3.1.jar
[2019-06-04T09:41:10.757Z] [INFO] Downloaded from central: https://repo.maven.apache.org/maven2/org/opentest4j/opentest4j/1.1.1/opentest4j-1.1.1.jar
(7.1 kB at 297 kB/s)
[2019-06-04T09:41:10.757Z] [INFO] Downloading from central: https://repo.maven.apache.org/maven2/org/junit/jupiter/junit-jupiter-engine/5.3.1/junit-jupiter-engine-5.3.1.jar
[2019-06-04T09:41:10.757Z] [INFO] Downloaded from central: https://repo.maven.apache.org/maven2/org/apiguardian/apiguardian-api/1.0.0/apiguardian-api-1.0.0.jar
(2.2 kB at 12 kB/s)
[2019-06-04T09:41:10.757Z] [INFO] Downloading from central: https://repo.maven.apache.org/maven2/org/junit/jupiter/junit-jupiter-api/5.3.1/junit-jupiter-api-5.3.1.jar
[2019-06-04T09:41:10.757Z] [INFO] Downloaded from central: https://repo.maven.apache.org/maven2/org/junit/platform/junit-platform-commons/1.3.1/junit-platform-commons-1.3.1.jar
(78 kB at 425 kB/s)
[2019-06-04T09:41:10.757Z] [INFO] Downloading from central: https://repo.maven.apache.org/maven2/org/assertj/assertj-core/3.9.1/assertj-core-3.9.1.jar
[2019-06-04T09:41:10.757Z] [INFO] Downloaded from central: https://repo.maven.apache.org/maven2/org/junit/platform/junit-platform-launcher/1.3.1/junit-platform-launcher-1.3.1.jar
(95 kB at 385 kB/s)
[2019-06-04T09:41:10.757Z] [INFO] Downloaded from central: https://repo.maven.apache.org/maven2/org/junit/jupiter/junit-jupiter-engine/5.3.1/junit-jupiter-engine-5.3.1.jar
(150 kB at 590 kB/s)
[2019-06-04T09:41:10.757Z] [INFO] Downloaded from central: https://repo.maven.apache.org/maven2/org/junit/platform/junit-platform-engine/1.3.1/junit-platform-engine-1.3.1.jar
(135 kB at 390 kB/s)
[2019-06-04T09:41:10.757Z] [INFO] Downloaded from central: https://repo.maven.apache.org/maven2/org/junit/jupiter/junit-jupiter-api/5.3.1/junit-jupiter-api-5.3.1.jar
(115 kB at 270 kB/s)
[2019-06-04T09:41:10.757Z] [INFO] Downloaded from central: https://repo.maven.apache.org/maven2/org/assertj/assertj-core/3.9.1/assertj-core-3.9.1.jar
(3.9 MB at 7.2 MB/s)
[2019-06-04T09:41:10.757Z] [INFO] 
[2019-06-04T09:41:10.757Z] [INFO] --- maven-clean-plugin:3.1.0:clean (default-clean) @ surefire-junit-platform
---
[2019-06-04T09:41:10.757Z] [INFO] 
[2019-06-04T09:41:10.757Z] [INFO] --- maven-enforcer-plugin:3.0.0-M2:enforce (enforce-maven-version)
@ surefire-junit-platform ---
[2019-06-04T09:41:10.757Z] [INFO] 
[2019-06-04T09:41:10.757Z] [INFO] --- maven-enforcer-plugin:3.0.0-M2:enforce (enforce-bytecode-version)
@ surefire-junit-platform ---
[2019-06-04T09:41:10.757Z] [INFO] 
[2019-06-04T09:41:10.757Z] [INFO] --- maven-enforcer-plugin:3.0.0-M2:enforce (ban-known-bad-maven-versions)
@ surefire-junit-platform ---
[2019-06-04T09:41:10.757Z] [INFO] 
[2019-06-04T09:41:10.757Z] [INFO] --- maven-enforcer-plugin:3.0.0-M2:enforce (enforce-java)
@ surefire-junit-platform ---
[2019-06-04T09:41:10.757Z] [INFO] 
[2019-06-04T09:41:10.757Z] [INFO] --- maven-enforcer-plugin:3.0.0-M2:enforce (enforce-maven)
@ surefire-junit-platform ---
[2019-06-04T09:41:10.757Z] [INFO] 
[2019-06-04T09:41:10.757Z] [INFO] --- apache-rat-plugin:0.12:check (rat-check) @ surefire-junit-platform
---
[2019-06-04T09:41:10.757Z] [INFO] Enabled default license matchers.
[2019-06-04T09:41:10.757Z] [INFO] Will parse SCM ignores for exclusions...
[2019-06-04T09:41:10.757Z] [INFO] Finished adding exclusions from SCM ignore files.
[2019-06-04T09:41:10.757Z] [INFO] 61 implicit excludes (use -debug for more details).
[2019-06-04T09:41:10.757Z] [INFO] Exclude: .repository/**
[2019-06-04T09:41:10.757Z] [INFO] Exclude: .maven/spy.log
[2019-06-04T09:41:10.757Z] [INFO] Exclude: dependency-reduced-pom.xml
[2019-06-04T09:41:10.757Z] [INFO] Exclude: .java-version
[2019-06-04T09:41:10.757Z] [INFO] Exclude: Jenkinsfile
[2019-06-04T09:41:10.757Z] [INFO] Exclude: README.md
[2019-06-04T09:41:10.757Z] [INFO] Exclude: .gitignore
[2019-06-04T09:41:10.757Z] [INFO] Exclude: .git/**/*
[2019-06-04T09:41:10.757Z] [INFO] Exclude: **/.idea
[2019-06-04T09:41:10.757Z] [INFO] Exclude: **/.svn/**/*
[2019-06-04T09:41:10.757Z] [INFO] Exclude: **/*.iml
[2019-06-04T09:41:10.757Z] [INFO] Exclude: **/*.ipr
[2019-06-04T09:41:10.757Z] [INFO] Exclude: **/*.iws
[2019-06-04T09:41:10.757Z] [INFO] Exclude: **/*.versionsBackup
[2019-06-04T09:41:10.757Z] [INFO] Exclude: **/dependency-reduced-pom.xml
[2019-06-04T09:41:10.757Z] [INFO] Exclude: .repository/**
[2019-06-04T09:41:10.757Z] [INFO] Exclude: src/test/resources/**/*
[2019-06-04T09:41:10.757Z] [INFO] Exclude: src/test/resources/**/*.css
[2019-06-04T09:41:10.757Z] [INFO] Exclude: **/*.jj
[2019-06-04T09:41:10.757Z] [INFO] Exclude: src/main/resources/META-INF/services/org.apache.maven.surefire.providerapi.SurefireProvider
[2019-06-04T09:41:10.757Z] [INFO] Exclude: DEPENDENCIES
[2019-06-04T09:41:10.757Z] [INFO] Exclude: .m2/**
[2019-06-04T09:41:10.757Z] [INFO] Exclude: .m2
[2019-06-04T09:41:10.757Z] [INFO] Exclude: .travis.yml
[2019-06-04T09:41:10.757Z] [INFO] 9 resources included (use -debug for more details)
[2019-06-04T09:41:10.757Z] [INFO] Rat check: Summary over all files. Unapproved: 0, unknown:
0, generated: 0, approved: 9 licenses.
[2019-06-04T09:41:10.758Z] [INFO] 
[2019-06-04T09:41:10.758Z] [INFO] --- jacoco-maven-plugin:0.8.2:prepare-agent (jacoco-agent)
@ surefire-junit-platform ---
[2019-06-04T09:41:10.758Z] [INFO] Skipping JaCoCo execution because property jacoco.skip is
set.
[2019-06-04T09:41:10.758Z] [INFO] jacoco.agent set to empty
[2019-06-04T09:41:10.758Z] [INFO] 
[2019-06-04T09:41:10.758Z] [INFO] --- maven-compiler-plugin:3.7.0:compile (compile-generated)
@ surefire-junit-platform ---
[2019-06-04T09:41:10.758Z] [INFO] Nothing to compile - all classes are up to date
[2019-06-04T09:41:10.758Z] [INFO] 
[2019-06-04T09:41:10.758Z] [INFO] --- maven-remote-resources-plugin:1.5:process (process-resource-bundles)
@ surefire-junit-platform ---
[2019-06-04T09:41:10.758Z] [INFO] 
[2019-06-04T09:41:10.758Z] [INFO] --- maven-resources-plugin:3.1.0:resources (default-resources)
@ surefire-junit-platform ---
[2019-06-04T09:41:10.758Z] [INFO] Using 'UTF-8' encoding to copy filtered resources.
[2019-06-04T09:41:10.758Z] [INFO] Copying 1 resource
[2019-06-04T09:41:10.758Z] [INFO] Copying 3 resources
[2019-06-04T09:41:10.758Z] [INFO] 
[2019-06-04T09:41:10.758Z] [INFO] --- maven-compiler-plugin:3.7.0:compile (default-compile)
@ surefire-junit-platform ---
[2019-06-04T09:41:10.758Z] [INFO] Changes detected - recompiling the module!
[2019-06-04T09:41:10.758Z] [INFO] Compiling 4 source files to F:\jenkins\jenkins-slave\workspace\box_maven-surefire_SUREFIRE-1603\surefire-providers\surefire-junit-platform\target\classes
[2019-06-04T09:41:13.756Z] [INFO] 
[2019-06-04T09:41:13.756Z] [INFO] --- animal-sniffer-maven-plugin:1.17:check (signature-check)
@ surefire-junit-platform ---
[2019-06-04T09:41:13.756Z] [INFO] Checking unresolved references to org.codehaus.mojo.signature:java18:1.0
[2019-06-04T09:41:13.756Z] [INFO] Downloading from central: https://repo.maven.apache.org/maven2/org/codehaus/mojo/signature/java18/1.0/java18-1.0.signature
[2019-06-04T09:41:13.756Z] [INFO] Downloaded from central: https://repo.maven.apache.org/maven2/org/codehaus/mojo/signature/java18/1.0/java18-1.0.signature
(2.0 MB at 9.6 MB/s)
[2019-06-04T09:41:14.478Z] [INFO] 
[2019-06-04T09:41:14.478Z] [INFO] --- maven-resources-plugin:3.1.0:testResources (default-testResources)
@ surefire-junit-platform ---
[2019-06-04T09:41:14.478Z] [INFO] Using 'UTF-8' encoding to copy filtered resources.
[2019-06-04T09:41:14.478Z] [INFO] skip non existing resourceDirectory F:\jenkins\jenkins-slave\workspace\box_maven-surefire_SUREFIRE-1603\surefire-providers\surefire-junit-platform\src\test\resources
[2019-06-04T09:41:14.478Z] [INFO] Copying 3 resources
[2019-06-04T09:41:14.478Z] [INFO] 
[2019-06-04T09:41:14.478Z] [INFO] --- maven-compiler-plugin:3.7.0:testCompile (default-testCompile)
@ surefire-junit-platform ---
[2019-06-04T09:41:14.478Z] [INFO] Changes detected - recompiling the module!
[2019-06-04T09:41:14.478Z] [INFO] Compiling 4 source files to F:\jenkins\jenkins-slave\workspace\box_maven-surefire_SUREFIRE-1603\surefire-providers\surefire-junit-platform\target\test-classes
[2019-06-04T09:41:18.197Z] [INFO] 
[2019-06-04T09:41:18.197Z] [INFO] --- maven-surefire-plugin:2.12.4:test (default-test) @ surefire-junit-platform
---
[2019-06-04T09:41:18.197Z] [INFO] Surefire report directory: F:\jenkins\jenkins-slave\workspace\box_maven-surefire_SUREFIRE-1603\surefire-providers\surefire-junit-platform\target\surefire-reports
[2019-06-04T09:41:18.197Z] [INFO] Using configured provider org.apache.maven.surefire.shadefire.junit.JUnit3Provider
[2019-06-04T09:41:18.197Z] 
[2019-06-04T09:41:18.197Z] -------------------------------------------------------
[2019-06-04T09:41:18.197Z]  T E S T S
[2019-06-04T09:41:18.197Z] -------------------------------------------------------
[2019-06-04T09:41:18.197Z] Running org.apache.maven.surefire.junitplatform.JUnitPlatformProviderTest
[2019-06-04T09:41:18.197Z] Tests run: 0, Failures: 0, Errors: 0, Skipped: 0, Time elapsed:
0.001 sec
[2019-06-04T09:41:19.269Z] Running org.apache.maven.surefire.junitplatform.RunListenerAdapterTest
[2019-06-04T09:41:19.269Z] Tests run: 0, Failures: 0, Errors: 0, Skipped: 0, Time elapsed:
0 sec
[2019-06-04T09:41:19.585Z] Running org.apache.maven.surefire.junitplatform.TestMethodFilterTest
[2019-06-04T09:41:19.585Z] Tests run: 0, Failures: 0, Errors: 0, Skipped: 0, Time elapsed:
0 sec
[2019-06-04T09:41:19.585Z] Running org.apache.maven.surefire.junitplatform.TestPlanScannerFilterTest
[2019-06-04T09:41:19.585Z] Tests run: 0, Failures: 0, Errors: 0, Skipped: 0, Time elapsed:
0 sec
[2019-06-04T09:41:19.585Z] 
[2019-06-04T09:41:19.585Z] Results :
[2019-06-04T09:41:19.585Z] 
[2019-06-04T09:41:19.585Z] Tests run: 0, Failures: 0, Errors: 0, Skipped: 0
[2019-06-04T09:41:19.585Z] 
[2019-06-04T09:41:19.585Z] [INFO] 
[2019-06-04T09:41:19.585Z] [INFO] --- maven-jar-plugin:3.1.0:jar (default-jar) @ surefire-junit-platform
---
[2019-06-04T09:41:19.585Z] [INFO] Building jar: F:\jenkins\jenkins-slave\workspace\box_maven-surefire_SUREFIRE-1603\surefire-providers\surefire-junit-platform\target\surefire-junit-platform-3.0.0-M2-SNAPSHOT.jar
[2019-06-04T09:41:19.585Z] [INFO] 
[2019-06-04T09:41:19.585Z] [INFO] --- maven-site-plugin:3.7.1:attach-descriptor (attach-descriptor)
@ surefire-junit-platform ---
[2019-06-04T09:41:19.585Z] [INFO] Skipping because packaging 'jar' is not pom.
[2019-06-04T09:41:19.585Z] [INFO] 
[2019-06-04T09:41:19.585Z] [INFO] --- maven-checkstyle-plugin:3.0.0:check (checkstyle-check)
@ surefire-junit-platform ---
[2019-06-04T09:41:20.645Z] [INFO] There are 2 errors reported by Checkstyle 6.18 with config/maven_checks.xml
ruleset.
[2019-06-04T09:41:20.645Z] [ERROR] src\main\java\org\apache\maven\surefire\junitplatform\RunListenerAdapter.java:[206,13]
(whitespace) ParenPad: '(' is not followed by whitespace.
[2019-06-04T09:41:20.645Z] [ERROR] src\main\java\org\apache\maven\surefire\junitplatform\RunListenerAdapter.java:[206,28]
(whitespace) ParenPad: ')' is not preceded with whitespace.
[2019-06-04T09:41:20.645Z] [INFO] ------------------------------------------------------------------------
[2019-06-04T09:41:20.645Z] [INFO] Reactor Summary:
[2019-06-04T09:41:20.645Z] [INFO] 
[2019-06-04T09:41:20.645Z] [INFO] Apache Maven Surefire .............................. SUCCESS
[ 42.338 s]
[2019-06-04T09:41:20.645Z] [INFO] SureFire Logger API ................................ SUCCESS
[  9.297 s]
[2019-06-04T09:41:20.645Z] [INFO] SureFire API ....................................... SUCCESS
[ 17.881 s]
[2019-06-04T09:41:20.645Z] [INFO] SureFire Booter .................................... SUCCESS
[ 19.084 s]
[2019-06-04T09:41:20.645Z] [INFO] Maven Surefire Test-Grouping Support ............... SUCCESS
[ 11.707 s]
[2019-06-04T09:41:20.645Z] [INFO] SureFire Providers ................................. SUCCESS
[  1.607 s]
[2019-06-04T09:41:20.645Z] [INFO] Shared JUnit3 Provider Code ........................ SUCCESS
[  5.794 s]
[2019-06-04T09:41:20.645Z] [INFO] Shared Java 5 Provider Base ........................ SUCCESS
[  7.237 s]
[2019-06-04T09:41:20.646Z] [INFO] Shared JUnit4 Provider Code ........................ SUCCESS
[  7.602 s]
[2019-06-04T09:41:20.646Z] [INFO] Shared JUnit48 Provider Code ....................... SUCCESS
[  8.517 s]
[2019-06-04T09:41:20.646Z] [INFO] SureFire JUnit Runner .............................. SUCCESS
[  6.146 s]
[2019-06-04T09:41:20.646Z] [INFO] SureFire JUnit4 Runner ............................. SUCCESS
[  6.922 s]
[2019-06-04T09:41:20.646Z] [INFO] Maven Surefire Common .............................. SUCCESS
[ 41.310 s]
[2019-06-04T09:41:20.646Z] [INFO] SureFire JUnitCore Runner .......................... SUCCESS
[02:20 min]
[2019-06-04T09:41:20.646Z] [INFO] SureFire JUnit Platform Runner ..................... FAILURE
[ 11.557 s]
[2019-06-04T09:41:20.646Z] [INFO] SureFire TestNG Utils .............................. SKIPPED
[2019-06-04T09:41:20.646Z] [INFO] SureFire TestNG Runner ............................. SKIPPED
[2019-06-04T09:41:20.646Z] [INFO] ShadeFire JUnit3 Provider .......................... SKIPPED
[2019-06-04T09:41:20.646Z] [INFO] Surefire Report Parser ............................. SKIPPED
[2019-06-04T09:41:20.646Z] [INFO] Maven Surefire Plugin .............................. SKIPPED
[2019-06-04T09:41:20.646Z] [INFO] Maven Failsafe Plugin .............................. SKIPPED
[2019-06-04T09:41:20.646Z] [INFO] Maven Surefire Report Plugin ....................... SKIPPED
[2019-06-04T09:41:20.646Z] [INFO] Maven Surefire Integration Tests ................... SKIPPED
[2019-06-04T09:41:20.646Z] [INFO] ------------------------------------------------------------------------
[2019-06-04T09:41:20.646Z] [INFO] BUILD FAILURE
[2019-06-04T09:41:20.646Z] [INFO] ------------------------------------------------------------------------
[2019-06-04T09:41:20.646Z] [INFO] Total time: 05:40 min
[2019-06-04T09:41:20.646Z] [INFO] Finished at: 2019-06-04T02:41:20-07:00
[2019-06-04T09:41:20.980Z] [INFO] Final Memory: 39M/130M
[2019-06-04T09:41:20.980Z] [INFO] ------------------------------------------------------------------------
[2019-06-04T09:41:20.980Z] [ERROR] Failed to execute goal org.apache.maven.plugins:maven-checkstyle-plugin:3.0.0:check
(checkstyle-check) on project surefire-junit-platform: You have 2 Checkstyle violations. ->
[Help 1]
[2019-06-04T09:41:20.980Z] org.apache.maven.lifecycle.LifecycleExecutionException: Failed
to execute goal org.apache.maven.plugins:maven-checkstyle-plugin:3.0.0:check (checkstyle-check)
on project surefire-junit-platform: You have 2 Checkstyle violations.
[2019-06-04T09:41:20.980Z]     at org.apache.maven.lifecycle.internal.MojoExecutor.execute
(MojoExecutor.java:213)
[2019-06-04T09:41:20.980Z]     at org.apache.maven.lifecycle.internal.MojoExecutor.execute
(MojoExecutor.java:154)
[2019-06-04T09:41:20.980Z]     at org.apache.maven.lifecycle.internal.MojoExecutor.execute
(MojoExecutor.java:146)
[2019-06-04T09:41:20.980Z]     at org.apache.maven.lifecycle.internal.LifecycleModuleBuilder.buildProject
(LifecycleModuleBuilder.java:117)
[2019-06-04T09:41:20.980Z]     at org.apache.maven.lifecycle.internal.LifecycleModuleBuilder.buildProject
(LifecycleModuleBuilder.java:81)
[2019-06-04T09:41:20.980Z]     at org.apache.maven.lifecycle.internal.builder.singlethreaded.SingleThreadedBuilder.build
(SingleThreadedBuilder.java:51)
[2019-06-04T09:41:20.980Z]     at org.apache.maven.lifecycle.internal.LifecycleStarter.execute
(LifecycleStarter.java:128)
[2019-06-04T09:41:20.980Z]     at org.apache.maven.DefaultMaven.doExecute (DefaultMaven.java:309)
[2019-06-04T09:41:20.980Z]     at org.apache.maven.DefaultMaven.doExecute (DefaultMaven.java:194)
[2019-06-04T09:41:20.980Z]     at org.apache.maven.DefaultMaven.execute (DefaultMaven.java:107)
[2019-06-04T09:41:20.980Z]     at org.apache.maven.cli.MavenCli.execute (MavenCli.java:955)
[2019-06-04T09:41:20.980Z]     at org.apache.maven.cli.MavenCli.doMain (MavenCli.java:290)
[2019-06-04T09:41:20.980Z]     at org.apache.maven.cli.MavenCli.main (MavenCli.java:194)
[2019-06-04T09:41:20.980Z]     at sun.reflect.NativeMethodAccessorImpl.invoke0 (Native Method)
[2019-06-04T09:41:20.980Z]     at sun.reflect.NativeMethodAccessorImpl.invoke (NativeMethodAccessorImpl.java:62)
[2019-06-04T09:41:20.980Z]     at sun.reflect.DelegatingMethodAccessorImpl.invoke (DelegatingMethodAccessorImpl.java:43)
[2019-06-04T09:41:20.980Z]     at java.lang.reflect.Method.invoke (Method.java:498)
[2019-06-04T09:41:20.980Z]     at org.codehaus.plexus.classworlds.launcher.Launcher.launchEnhanced
(Launcher.java:289)
[2019-06-04T09:41:20.980Z]     at org.codehaus.plexus.classworlds.launcher.Launcher.launch
(Launcher.java:229)
[2019-06-04T09:41:20.980Z]     at org.codehaus.plexus.classworlds.launcher.Launcher.mainWithExitCode
(Launcher.java:415)
[2019-06-04T09:41:20.980Z]     at org.codehaus.plexus.classworlds.launcher.Launcher.main (Launcher.java:356)
[2019-06-04T09:41:20.980Z] Caused by: org.apache.maven.plugin.MojoFailureException: You have
2 Checkstyle violations.
[2019-06-04T09:41:20.980Z]     at org.apache.maven.plugins.checkstyle.CheckstyleViolationCheckMojo.execute
(CheckstyleViolationCheckMojo.java:576)
[2019-06-04T09:41:20.980Z]     at org.apache.maven.plugin.DefaultBuildPluginManager.executeMojo
(DefaultBuildPluginManager.java:134)
[2019-06-04T09:41:20.980Z]     at org.apache.maven.lifecycle.internal.MojoExecutor.execute
(MojoExecutor.java:208)
[2019-06-04T09:41:20.980Z]     at org.apache.maven.lifecycle.internal.MojoExecutor.execute
(MojoExecutor.java:154)
[2019-06-04T09:41:20.980Z]     at org.apache.maven.lifecycle.internal.MojoExecutor.execute
(MojoExecutor.java:146)
[2019-06-04T09:41:20.980Z]     at org.apache.maven.lifecycle.internal.LifecycleModuleBuilder.buildProject
(LifecycleModuleBuilder.java:117)
[2019-06-04T09:41:20.980Z]     at org.apache.maven.lifecycle.internal.LifecycleModuleBuilder.buildProject
(LifecycleModuleBuilder.java:81)
[2019-06-04T09:41:20.980Z]     at org.apache.maven.lifecycle.internal.builder.singlethreaded.SingleThreadedBuilder.build
(SingleThreadedBuilder.java:51)
[2019-06-04T09:41:20.980Z]     at org.apache.maven.lifecycle.internal.LifecycleStarter.execute
(LifecycleStarter.java:128)
[2019-06-04T09:41:20.980Z]     at org.apache.maven.DefaultMaven.doExecute (DefaultMaven.java:309)
[2019-06-04T09:41:20.980Z]     at org.apache.maven.DefaultMaven.doExecute (DefaultMaven.java:194)
[2019-06-04T09:41:20.980Z]     at org.apache.maven.DefaultMaven.execute (DefaultMaven.java:107)
[2019-06-04T09:41:20.980Z]     at org.apache.maven.cli.MavenCli.execute (MavenCli.java:955)
[2019-06-04T09:41:20.980Z]     at org.apache.maven.cli.MavenCli.doMain (MavenCli.java:290)
[2019-06-04T09:41:20.980Z]     at org.apache.maven.cli.MavenCli.main (MavenCli.java:194)
[2019-06-04T09:41:20.980Z]     at sun.reflect.NativeMethodAccessorImpl.invoke0 (Native Method)
[2019-06-04T09:41:20.980Z]     at sun.reflect.NativeMethodAccessorImpl.invoke (NativeMethodAccessorImpl.java:62)
[2019-06-04T09:41:20.980Z]     at sun.reflect.DelegatingMethodAccessorImpl.invoke (DelegatingMethodAccessorImpl.java:43)
[2019-06-04T09:41:20.980Z]     at java.lang.reflect.Method.invoke (Method.java:498)
[2019-06-04T09:41:20.980Z]     at org.codehaus.plexus.classworlds.launcher.Launcher.launchEnhanced
(Launcher.java:289)
[2019-06-04T09:41:20.980Z]     at org.codehaus.plexus.classworlds.launcher.Launcher.launch
(Launcher.java:229)
[2019-06-04T09:41:20.980Z]     at org.codehaus.plexus.classworlds.launcher.Launcher.mainWithExitCode
(Launcher.java:415)
[2019-06-04T09:41:20.980Z]     at org.codehaus.plexus.classworlds.launcher.Launcher.main (Launcher.java:356)
[2019-06-04T09:41:20.980Z] [ERROR] 
[2019-06-04T09:41:20.980Z] [ERROR] Re-run Maven using the -X switch to enable full debug logging.
[2019-06-04T09:41:20.980Z] [ERROR] 
[2019-06-04T09:41:20.980Z] [ERROR] For more information about the errors and possible solutions,
please read the following articles:
[2019-06-04T09:41:20.980Z] [ERROR] [Help 1] http://cwiki.apache.org/confluence/display/MAVEN/MojoFailureException
[2019-06-04T09:41:20.980Z] [ERROR] 
[2019-06-04T09:41:20.980Z] [ERROR] After correcting the problems, you can resume the build
with the command
[2019-06-04T09:41:20.980Z] [ERROR]   mvn <goals> -rf :surefire-junit-platform
[Pipeline] }
[Pipeline] // withEnv
[Pipeline] }
[Pipeline] // stage
[Pipeline] stage
[Pipeline] { (reporting windows-jdk7-maven3.5.x)
[Pipeline] fileExists
[Pipeline] fileExists
[Pipeline] archiveArtifacts
[2019-06-04T09:41:21.526Z] Archiving artifacts
[2019-06-04T09:41:22.080Z] ‘*--windows-jdk7-maven3.5.x.zip’ doesn’t match anything
[2019-06-04T09:41:22.080Z] No artifacts found that match the file pattern "*--windows-jdk7-maven3.5.x.zip".
Configuration error?
[Pipeline] }
[Pipeline] // stage
[Pipeline] stage
[Pipeline] { (cleanup windows-jdk7-maven3.5.x)
[Pipeline] cleanWs
[2019-06-04T09:41:22.182Z] [WS-CLEANUP] Deleting project workspace...
[2019-06-04T09:41:22.182Z] [WS-CLEANUP] Deferred wipeout is used...
[2019-06-04T09:41:22.252Z] [WS-CLEANUP] done
[Pipeline] }
[Pipeline] // stage
[Pipeline] }
[Pipeline] // timestamps
[Pipeline] }
[Pipeline] // node
[Pipeline] }
Failed in branch windows-jdk7-maven3.5.x
[Pipeline] // parallel
[Pipeline] echo
hudson.AbortException: hudson.AbortException: script returned exit code 1
[Pipeline] stage
[Pipeline] { (notifications)
[Pipeline] echo
Build result: FAILURE
[Pipeline] jiraIssueSelector
[Pipeline] jiraComment
[Pipeline] emailext
Mime
  • Unnamed multipart/mixed (inline, None, 0 bytes)
View raw message