maven-notifications mailing list archives

Site index · List index
Message view « Date » · « Thread »
Top « Date » · « Thread »
From Apache Jenkins Server <jenk...@builds.apache.org>
Subject Build failed in Jenkins: Maven TLP » maven-javadoc-plugin » additionalOptions-doc-improvement #8
Date Tue, 04 Jun 2019 12:43:45 GMT
See https://builds.apache.org/job/maven-box/job/maven-javadoc-plugin/job/additionalOptions-doc-improvement/8/

Changes:

* [MNG-6573] Use Maven 3.6.0 as default
* H39 has weird issues, exclude it for now
* Fix no access to currentBuild.rawBuild
* fixed typo
* Include more recent JDKs

25 tests failed.
FAILED:  org.apache.maven.plugins.javadoc.JavadocReportTest.windows-jdk13-m3.6.x_build / Build
windows-jdk13-m3.6.x_build / testDoclets

Error Message:
An error has occurred in Javadoc report generation: 
Exit code: 1 - javadoc: error - Class UmlGraph is not a valid doclet.
Note: As of JDK 13, the com.sun.javadoc API is no longer supported.

Command line was: f:\jenkins\tools\java\latest13\bin\javadoc.exe @options @argfile

Refer to the generated Javadoc files in 'f:\jenkins\jenkins-slave\workspace\dditionalOptions-doc-improvement@2\windows-jdk13-m3.6.x_build\target\test\unit\doclet-test\target\site\apidocs'
dir.


Stack Trace:
org.apache.maven.plugin.MojoExecutionException: 
An error has occurred in Javadoc report generation: 
Exit code: 1 - javadoc: error - Class UmlGraph is not a valid doclet.
Note: As of JDK 13, the com.sun.javadoc API is no longer supported.

Command line was: f:\jenkins\tools\java\latest13\bin\javadoc.exe @options @argfile

Refer to the generated Javadoc files in 'f:\jenkins\jenkins-slave\workspace\dditionalOptions-doc-improvement@2\windows-jdk13-m3.6.x_build\target\test\unit\doclet-test\target\site\apidocs'
dir.

	at org.apache.maven.plugins.javadoc.JavadocReportTest.testDoclets(JavadocReportTest.java:451)
Caused by: org.apache.maven.reporting.MavenReportException: 

Exit code: 1 - javadoc: error - Class UmlGraph is not a valid doclet.
Note: As of JDK 13, the com.sun.javadoc API is no longer supported.

Command line was: f:\jenkins\tools\java\latest13\bin\javadoc.exe @options @argfile

Refer to the generated Javadoc files in 'f:\jenkins\jenkins-slave\workspace\dditionalOptions-doc-improvement@2\windows-jdk13-m3.6.x_build\target\test\unit\doclet-test\target\site\apidocs'
dir.

	at org.apache.maven.plugins.javadoc.JavadocReportTest.testDoclets(JavadocReportTest.java:451)


FAILED:  org.apache.maven.plugins.javadoc.FixJavadocMojoTest.linux-jdk12-m3.6.x_build / Build
linux-jdk12-m3.6.x_build / testFix

Error Message:
Error when invoking Maven, consult the invoker log file: /home/jenkins/jenkins-slave/workspace/dditionalOptions-doc-improvement@2/linux-jdk12-m3.6.x_build/target/invoker/FixJavadocMojoTest526359069.txt

Stack Trace:
org.apache.maven.shared.invoker.MavenInvocationException: Error when invoking Maven, consult
the invoker log file: /home/jenkins/jenkins-slave/workspace/dditionalOptions-doc-improvement@2/linux-jdk12-m3.6.x_build/target/invoker/FixJavadocMojoTest526359069.txt
	at org.apache.maven.plugins.javadoc.FixJavadocMojoTest.invokeCompileGoal(FixJavadocMojoTest.java:664)
	at org.apache.maven.plugins.javadoc.FixJavadocMojoTest.executeMojoAndTest(FixJavadocMojoTest.java:616)
	at org.apache.maven.plugins.javadoc.FixJavadocMojoTest.testFix(FixJavadocMojoTest.java:141)


FAILED:  org.apache.maven.plugins.javadoc.FixJavadocMojoTest.linux-jdk12-m3.6.x_build / Build
linux-jdk12-m3.6.x_build / testFixJdk6

Error Message:
Error when invoking Maven, consult the invoker log file: /home/jenkins/jenkins-slave/workspace/dditionalOptions-doc-improvement@2/linux-jdk12-m3.6.x_build/target/invoker/FixJavadocMojoTest591627732.txt

Stack Trace:
org.apache.maven.shared.invoker.MavenInvocationException: Error when invoking Maven, consult
the invoker log file: /home/jenkins/jenkins-slave/workspace/dditionalOptions-doc-improvement@2/linux-jdk12-m3.6.x_build/target/invoker/FixJavadocMojoTest591627732.txt
	at org.apache.maven.plugins.javadoc.FixJavadocMojoTest.invokeCompileGoal(FixJavadocMojoTest.java:664)
	at org.apache.maven.plugins.javadoc.FixJavadocMojoTest.executeMojoAndTest(FixJavadocMojoTest.java:616)
	at org.apache.maven.plugins.javadoc.FixJavadocMojoTest.testFixJdk6(FixJavadocMojoTest.java:170)


FAILED:  org.apache.maven.plugins.javadoc.JavadocReportTest.linux-jdk12-m3.6.x_build / Build
linux-jdk12-m3.6.x_build / testJavadocResources

Error Message:
null

Stack Trace:
junit.framework.AssertionFailedError
	at org.apache.maven.plugins.javadoc.JavadocReportTest.testJavadocResources(JavadocReportTest.java:745)


FAILED:  org.apache.maven.plugins.javadoc.JavadocReportTest.linux-jdk12-m3.6.x_build / Build
linux-jdk12-m3.6.x_build / testJdk6

Error Message:
An error has occurred in Javadoc report generation: 
Exit code: 2 - error: Source option 6 is no longer supported. Use 7 or later.
error: Target option 6 is no longer supported. Use 7 or later.

Command line was: /home/jenkins/tools/java/latest12/bin/javadoc @options @packages

Refer to the generated Javadoc files in '/home/jenkins/jenkins-slave/workspace/dditionalOptions-doc-improvement@2/linux-jdk12-m3.6.x_build/target/test/unit/jdk6-test/target/site/apidocs'
dir.


Stack Trace:
org.apache.maven.plugin.MojoExecutionException: 
An error has occurred in Javadoc report generation: 
Exit code: 2 - error: Source option 6 is no longer supported. Use 7 or later.
error: Target option 6 is no longer supported. Use 7 or later.

Command line was: /home/jenkins/tools/java/latest12/bin/javadoc @options @packages

Refer to the generated Javadoc files in '/home/jenkins/jenkins-slave/workspace/dditionalOptions-doc-improvement@2/linux-jdk12-m3.6.x_build/target/test/unit/jdk6-test/target/site/apidocs'
dir.

	at org.apache.maven.plugins.javadoc.JavadocReportTest.testJdk6(JavadocReportTest.java:853)
Caused by: org.apache.maven.reporting.MavenReportException: 

Exit code: 2 - error: Source option 6 is no longer supported. Use 7 or later.
error: Target option 6 is no longer supported. Use 7 or later.

Command line was: /home/jenkins/tools/java/latest12/bin/javadoc @options @packages

Refer to the generated Javadoc files in '/home/jenkins/jenkins-slave/workspace/dditionalOptions-doc-improvement@2/linux-jdk12-m3.6.x_build/target/test/unit/jdk6-test/target/site/apidocs'
dir.

	at org.apache.maven.plugins.javadoc.JavadocReportTest.testJdk6(JavadocReportTest.java:853)


FAILED:  org.apache.maven.plugins.javadoc.JavadocReportTest.linux-jdk12-m3.6.x_build / Build
linux-jdk12-m3.6.x_build / testDefaultConfiguration

Error Message:
null

Stack Trace:
junit.framework.AssertionFailedError
	at org.apache.maven.plugins.javadoc.JavadocReportTest.testDefaultConfiguration(JavadocReportTest.java:245)


FAILED:  org.apache.maven.plugins.javadoc.JavadocReportTest.linux-jdk12-m3.6.x_build / Build
linux-jdk12-m3.6.x_build / testCustomConfiguration

Error Message:
An error has occurred in Javadoc report generation: 
Exit code: 1 - javadoc: error - The code being documented uses modules but the packages defined
in http://java.sun.com/j2se/1.4.2/docs/api/ are in the unnamed module.
/home/jenkins/jenkins-slave/workspace/dditionalOptions-doc-improvement@2/linux-jdk12-m3.6.x_build/src/test/resources/unit/custom-configuration/custom/configuration/exclude1/Exclude1App.java:40:
warning: no description for @param
     * @param str
       ^

Command line was: /home/jenkins/tools/java/latest12/bin/javadoc -J-Xmx512m -J-Xms128m @options
@packages

Refer to the generated Javadoc files in '/home/jenkins/jenkins-slave/workspace/dditionalOptions-doc-improvement@2/linux-jdk12-m3.6.x_build/target/test/unit/custom-configuration/target/site/apidocs'
dir.


Stack Trace:
org.apache.maven.plugin.MojoExecutionException: 
An error has occurred in Javadoc report generation: 
Exit code: 1 - javadoc: error - The code being documented uses modules but the packages defined
in http://java.sun.com/j2se/1.4.2/docs/api/ are in the unnamed module.
/home/jenkins/jenkins-slave/workspace/dditionalOptions-doc-improvement@2/linux-jdk12-m3.6.x_build/src/test/resources/unit/custom-configuration/custom/configuration/exclude1/Exclude1App.java:40:
warning: no description for @param
     * @param str
       ^

Command line was: /home/jenkins/tools/java/latest12/bin/javadoc -J-Xmx512m -J-Xms128m @options
@packages

Refer to the generated Javadoc files in '/home/jenkins/jenkins-slave/workspace/dditionalOptions-doc-improvement@2/linux-jdk12-m3.6.x_build/target/test/unit/custom-configuration/target/site/apidocs'
dir.

	at org.apache.maven.plugins.javadoc.JavadocReportTest.testCustomConfiguration(JavadocReportTest.java:370)
Caused by: org.apache.maven.reporting.MavenReportException: 

Exit code: 1 - javadoc: error - The code being documented uses modules but the packages defined
in http://java.sun.com/j2se/1.4.2/docs/api/ are in the unnamed module.
/home/jenkins/jenkins-slave/workspace/dditionalOptions-doc-improvement@2/linux-jdk12-m3.6.x_build/src/test/resources/unit/custom-configuration/custom/configuration/exclude1/Exclude1App.java:40:
warning: no description for @param
     * @param str
       ^

Command line was: /home/jenkins/tools/java/latest12/bin/javadoc -J-Xmx512m -J-Xms128m @options
@packages

Refer to the generated Javadoc files in '/home/jenkins/jenkins-slave/workspace/dditionalOptions-doc-improvement@2/linux-jdk12-m3.6.x_build/target/test/unit/custom-configuration/target/site/apidocs'
dir.

	at org.apache.maven.plugins.javadoc.JavadocReportTest.testCustomConfiguration(JavadocReportTest.java:370)


FAILED:  org.apache.maven.plugins.javadoc.FixJavadocMojoTest.linux-jdk13-m3.6.x_build / Build
linux-jdk13-m3.6.x_build / testFix

Error Message:
Error when invoking Maven, consult the invoker log file: /home/jenkins/jenkins-slave/workspace/dditionalOptions-doc-improvement@2/linux-jdk13-m3.6.x_build/target/invoker/FixJavadocMojoTest1568632086.txt

Stack Trace:
org.apache.maven.shared.invoker.MavenInvocationException: Error when invoking Maven, consult
the invoker log file: /home/jenkins/jenkins-slave/workspace/dditionalOptions-doc-improvement@2/linux-jdk13-m3.6.x_build/target/invoker/FixJavadocMojoTest1568632086.txt
	at org.apache.maven.plugins.javadoc.FixJavadocMojoTest.invokeCompileGoal(FixJavadocMojoTest.java:664)
	at org.apache.maven.plugins.javadoc.FixJavadocMojoTest.executeMojoAndTest(FixJavadocMojoTest.java:616)
	at org.apache.maven.plugins.javadoc.FixJavadocMojoTest.testFix(FixJavadocMojoTest.java:141)


FAILED:  org.apache.maven.plugins.javadoc.FixJavadocMojoTest.linux-jdk13-m3.6.x_build / Build
linux-jdk13-m3.6.x_build / testFixJdk6

Error Message:
Error when invoking Maven, consult the invoker log file: /home/jenkins/jenkins-slave/workspace/dditionalOptions-doc-improvement@2/linux-jdk13-m3.6.x_build/target/invoker/FixJavadocMojoTest869227560.txt

Stack Trace:
org.apache.maven.shared.invoker.MavenInvocationException: Error when invoking Maven, consult
the invoker log file: /home/jenkins/jenkins-slave/workspace/dditionalOptions-doc-improvement@2/linux-jdk13-m3.6.x_build/target/invoker/FixJavadocMojoTest869227560.txt
	at org.apache.maven.plugins.javadoc.FixJavadocMojoTest.invokeCompileGoal(FixJavadocMojoTest.java:664)
	at org.apache.maven.plugins.javadoc.FixJavadocMojoTest.executeMojoAndTest(FixJavadocMojoTest.java:616)
	at org.apache.maven.plugins.javadoc.FixJavadocMojoTest.testFixJdk6(FixJavadocMojoTest.java:170)


FAILED:  org.apache.maven.plugins.javadoc.JavadocReportTest.linux-jdk13-m3.6.x_build / Build
linux-jdk13-m3.6.x_build / testJavadocResources

Error Message:
null

Stack Trace:
junit.framework.AssertionFailedError
	at org.apache.maven.plugins.javadoc.JavadocReportTest.testJavadocResources(JavadocReportTest.java:745)


FAILED:  org.apache.maven.plugins.javadoc.JavadocReportTest.linux-jdk13-m3.6.x_build / Build
linux-jdk13-m3.6.x_build / testJdk6

Error Message:
An error has occurred in Javadoc report generation: 
Exit code: 2 - error: Source option 6 is no longer supported. Use 7 or later.
error: Target option 6 is no longer supported. Use 7 or later.

Command line was: /home/jenkins/tools/java/latest13/bin/javadoc @options @packages

Refer to the generated Javadoc files in '/home/jenkins/jenkins-slave/workspace/dditionalOptions-doc-improvement@2/linux-jdk13-m3.6.x_build/target/test/unit/jdk6-test/target/site/apidocs'
dir.


Stack Trace:
org.apache.maven.plugin.MojoExecutionException: 
An error has occurred in Javadoc report generation: 
Exit code: 2 - error: Source option 6 is no longer supported. Use 7 or later.
error: Target option 6 is no longer supported. Use 7 or later.

Command line was: /home/jenkins/tools/java/latest13/bin/javadoc @options @packages

Refer to the generated Javadoc files in '/home/jenkins/jenkins-slave/workspace/dditionalOptions-doc-improvement@2/linux-jdk13-m3.6.x_build/target/test/unit/jdk6-test/target/site/apidocs'
dir.

	at org.apache.maven.plugins.javadoc.JavadocReportTest.testJdk6(JavadocReportTest.java:853)
Caused by: org.apache.maven.reporting.MavenReportException: 

Exit code: 2 - error: Source option 6 is no longer supported. Use 7 or later.
error: Target option 6 is no longer supported. Use 7 or later.

Command line was: /home/jenkins/tools/java/latest13/bin/javadoc @options @packages

Refer to the generated Javadoc files in '/home/jenkins/jenkins-slave/workspace/dditionalOptions-doc-improvement@2/linux-jdk13-m3.6.x_build/target/test/unit/jdk6-test/target/site/apidocs'
dir.

	at org.apache.maven.plugins.javadoc.JavadocReportTest.testJdk6(JavadocReportTest.java:853)


FAILED:  org.apache.maven.plugins.javadoc.JavadocReportTest.linux-jdk13-m3.6.x_build / Build
linux-jdk13-m3.6.x_build / testDefaultConfiguration

Error Message:
null

Stack Trace:
junit.framework.AssertionFailedError
	at org.apache.maven.plugins.javadoc.JavadocReportTest.testDefaultConfiguration(JavadocReportTest.java:245)


FAILED:  org.apache.maven.plugins.javadoc.JavadocReportTest.linux-jdk13-m3.6.x_build / Build
linux-jdk13-m3.6.x_build / testCustomConfiguration

Error Message:
An error has occurred in Javadoc report generation: 
Exit code: 1 - javadoc: error - The code being documented uses modules but the packages defined
in http://java.sun.com/j2se/1.4.2/docs/api/ are in the unnamed module.
/home/jenkins/jenkins-slave/workspace/dditionalOptions-doc-improvement@2/linux-jdk13-m3.6.x_build/src/test/resources/unit/custom-configuration/custom/configuration/exclude1/Exclude1App.java:40:
warning: no description for @param
     * @param str
       ^

Command line was: /home/jenkins/tools/java/latest13/bin/javadoc -J-Xmx512m -J-Xms128m @options
@packages

Refer to the generated Javadoc files in '/home/jenkins/jenkins-slave/workspace/dditionalOptions-doc-improvement@2/linux-jdk13-m3.6.x_build/target/test/unit/custom-configuration/target/site/apidocs'
dir.


Stack Trace:
org.apache.maven.plugin.MojoExecutionException: 
An error has occurred in Javadoc report generation: 
Exit code: 1 - javadoc: error - The code being documented uses modules but the packages defined
in http://java.sun.com/j2se/1.4.2/docs/api/ are in the unnamed module.
/home/jenkins/jenkins-slave/workspace/dditionalOptions-doc-improvement@2/linux-jdk13-m3.6.x_build/src/test/resources/unit/custom-configuration/custom/configuration/exclude1/Exclude1App.java:40:
warning: no description for @param
     * @param str
       ^

Command line was: /home/jenkins/tools/java/latest13/bin/javadoc -J-Xmx512m -J-Xms128m @options
@packages

Refer to the generated Javadoc files in '/home/jenkins/jenkins-slave/workspace/dditionalOptions-doc-improvement@2/linux-jdk13-m3.6.x_build/target/test/unit/custom-configuration/target/site/apidocs'
dir.

	at org.apache.maven.plugins.javadoc.JavadocReportTest.testCustomConfiguration(JavadocReportTest.java:370)
Caused by: org.apache.maven.reporting.MavenReportException: 

Exit code: 1 - javadoc: error - The code being documented uses modules but the packages defined
in http://java.sun.com/j2se/1.4.2/docs/api/ are in the unnamed module.
/home/jenkins/jenkins-slave/workspace/dditionalOptions-doc-improvement@2/linux-jdk13-m3.6.x_build/src/test/resources/unit/custom-configuration/custom/configuration/exclude1/Exclude1App.java:40:
warning: no description for @param
     * @param str
       ^

Command line was: /home/jenkins/tools/java/latest13/bin/javadoc -J-Xmx512m -J-Xms128m @options
@packages

Refer to the generated Javadoc files in '/home/jenkins/jenkins-slave/workspace/dditionalOptions-doc-improvement@2/linux-jdk13-m3.6.x_build/target/test/unit/custom-configuration/target/site/apidocs'
dir.

	at org.apache.maven.plugins.javadoc.JavadocReportTest.testCustomConfiguration(JavadocReportTest.java:370)


FAILED:  org.apache.maven.plugins.javadoc.FixJavadocMojoTest.windows-jdk12-m3.6.x_build /
Build windows-jdk12-m3.6.x_build / testFix

Error Message:
Error when invoking Maven, consult the invoker log file: f:\jenkins\jenkins-slave\workspace\dditionalOptions-doc-improvement@2\windows-jdk12-m3.6.x_build\target\invoker\FixJavadocMojoTest1994913171.txt

Stack Trace:
org.apache.maven.shared.invoker.MavenInvocationException: Error when invoking Maven, consult
the invoker log file: f:\jenkins\jenkins-slave\workspace\dditionalOptions-doc-improvement@2\windows-jdk12-m3.6.x_build\target\invoker\FixJavadocMojoTest1994913171.txt
	at org.apache.maven.plugins.javadoc.FixJavadocMojoTest.invokeCompileGoal(FixJavadocMojoTest.java:664)
	at org.apache.maven.plugins.javadoc.FixJavadocMojoTest.executeMojoAndTest(FixJavadocMojoTest.java:616)
	at org.apache.maven.plugins.javadoc.FixJavadocMojoTest.testFix(FixJavadocMojoTest.java:141)


FAILED:  org.apache.maven.plugins.javadoc.FixJavadocMojoTest.windows-jdk12-m3.6.x_build /
Build windows-jdk12-m3.6.x_build / testFixJdk6

Error Message:
Error when invoking Maven, consult the invoker log file: f:\jenkins\jenkins-slave\workspace\dditionalOptions-doc-improvement@2\windows-jdk12-m3.6.x_build\target\invoker\FixJavadocMojoTest440735708.txt

Stack Trace:
org.apache.maven.shared.invoker.MavenInvocationException: Error when invoking Maven, consult
the invoker log file: f:\jenkins\jenkins-slave\workspace\dditionalOptions-doc-improvement@2\windows-jdk12-m3.6.x_build\target\invoker\FixJavadocMojoTest440735708.txt
	at org.apache.maven.plugins.javadoc.FixJavadocMojoTest.invokeCompileGoal(FixJavadocMojoTest.java:664)
	at org.apache.maven.plugins.javadoc.FixJavadocMojoTest.executeMojoAndTest(FixJavadocMojoTest.java:616)
	at org.apache.maven.plugins.javadoc.FixJavadocMojoTest.testFixJdk6(FixJavadocMojoTest.java:170)


FAILED:  org.apache.maven.plugins.javadoc.JavadocReportTest.windows-jdk12-m3.6.x_build / Build
windows-jdk12-m3.6.x_build / testJavadocResources

Error Message:
null

Stack Trace:
junit.framework.AssertionFailedError
	at org.apache.maven.plugins.javadoc.JavadocReportTest.testJavadocResources(JavadocReportTest.java:745)


FAILED:  org.apache.maven.plugins.javadoc.JavadocReportTest.windows-jdk12-m3.6.x_build / Build
windows-jdk12-m3.6.x_build / testJdk6

Error Message:
An error has occurred in Javadoc report generation: 
Exit code: 2 - error: Source option 6 is no longer supported. Use 7 or later.
error: Target option 6 is no longer supported. Use 7 or later.

Command line was: f:\jenkins\tools\java\latest12\bin\javadoc.exe @options @packages

Refer to the generated Javadoc files in 'f:\jenkins\jenkins-slave\workspace\dditionalOptions-doc-improvement@2\windows-jdk12-m3.6.x_build\target\test\unit\jdk6-test\target\site\apidocs'
dir.


Stack Trace:
org.apache.maven.plugin.MojoExecutionException: 
An error has occurred in Javadoc report generation: 
Exit code: 2 - error: Source option 6 is no longer supported. Use 7 or later.
error: Target option 6 is no longer supported. Use 7 or later.

Command line was: f:\jenkins\tools\java\latest12\bin\javadoc.exe @options @packages

Refer to the generated Javadoc files in 'f:\jenkins\jenkins-slave\workspace\dditionalOptions-doc-improvement@2\windows-jdk12-m3.6.x_build\target\test\unit\jdk6-test\target\site\apidocs'
dir.

	at org.apache.maven.plugins.javadoc.JavadocReportTest.testJdk6(JavadocReportTest.java:853)
Caused by: org.apache.maven.reporting.MavenReportException: 

Exit code: 2 - error: Source option 6 is no longer supported. Use 7 or later.
error: Target option 6 is no longer supported. Use 7 or later.

Command line was: f:\jenkins\tools\java\latest12\bin\javadoc.exe @options @packages

Refer to the generated Javadoc files in 'f:\jenkins\jenkins-slave\workspace\dditionalOptions-doc-improvement@2\windows-jdk12-m3.6.x_build\target\test\unit\jdk6-test\target\site\apidocs'
dir.

	at org.apache.maven.plugins.javadoc.JavadocReportTest.testJdk6(JavadocReportTest.java:853)


FAILED:  org.apache.maven.plugins.javadoc.JavadocReportTest.windows-jdk12-m3.6.x_build / Build
windows-jdk12-m3.6.x_build / testDefaultConfiguration

Error Message:
null

Stack Trace:
junit.framework.AssertionFailedError
	at org.apache.maven.plugins.javadoc.JavadocReportTest.testDefaultConfiguration(JavadocReportTest.java:245)


FAILED:  org.apache.maven.plugins.javadoc.JavadocReportTest.windows-jdk12-m3.6.x_build / Build
windows-jdk12-m3.6.x_build / testCustomConfiguration

Error Message:
An error has occurred in Javadoc report generation: 
Exit code: 1 - javadoc: error - The code being documented uses modules but the packages defined
in http://java.sun.com/j2se/1.4.2/docs/api/ are in the unnamed module.
f:\jenkins\jenkins-slave\workspace\dditionalOptions-doc-improvement@2\windows-jdk12-m3.6.x_build\src\test\resources\unit\custom-configuration\custom\configuration\exclude1\Exclude1App.java:40:
warning: no description for @param
     * @param str
       ^

Command line was: f:\jenkins\tools\java\latest12\bin\javadoc.exe -J-Xmx512m -J-Xms128m @options
@packages

Refer to the generated Javadoc files in 'f:\jenkins\jenkins-slave\workspace\dditionalOptions-doc-improvement@2\windows-jdk12-m3.6.x_build\target\test\unit\custom-configuration\target\site\apidocs'
dir.


Stack Trace:
org.apache.maven.plugin.MojoExecutionException: 
An error has occurred in Javadoc report generation: 
Exit code: 1 - javadoc: error - The code being documented uses modules but the packages defined
in http://java.sun.com/j2se/1.4.2/docs/api/ are in the unnamed module.
f:\jenkins\jenkins-slave\workspace\dditionalOptions-doc-improvement@2\windows-jdk12-m3.6.x_build\src\test\resources\unit\custom-configuration\custom\configuration\exclude1\Exclude1App.java:40:
warning: no description for @param
     * @param str
       ^

Command line was: f:\jenkins\tools\java\latest12\bin\javadoc.exe -J-Xmx512m -J-Xms128m @options
@packages

Refer to the generated Javadoc files in 'f:\jenkins\jenkins-slave\workspace\dditionalOptions-doc-improvement@2\windows-jdk12-m3.6.x_build\target\test\unit\custom-configuration\target\site\apidocs'
dir.

	at org.apache.maven.plugins.javadoc.JavadocReportTest.testCustomConfiguration(JavadocReportTest.java:370)
Caused by: org.apache.maven.reporting.MavenReportException: 

Exit code: 1 - javadoc: error - The code being documented uses modules but the packages defined
in http://java.sun.com/j2se/1.4.2/docs/api/ are in the unnamed module.
f:\jenkins\jenkins-slave\workspace\dditionalOptions-doc-improvement@2\windows-jdk12-m3.6.x_build\src\test\resources\unit\custom-configuration\custom\configuration\exclude1\Exclude1App.java:40:
warning: no description for @param
     * @param str
       ^

Command line was: f:\jenkins\tools\java\latest12\bin\javadoc.exe -J-Xmx512m -J-Xms128m @options
@packages

Refer to the generated Javadoc files in 'f:\jenkins\jenkins-slave\workspace\dditionalOptions-doc-improvement@2\windows-jdk12-m3.6.x_build\target\test\unit\custom-configuration\target\site\apidocs'
dir.

	at org.apache.maven.plugins.javadoc.JavadocReportTest.testCustomConfiguration(JavadocReportTest.java:370)


FAILED:  org.apache.maven.plugins.javadoc.FixJavadocMojoTest.windows-jdk13-m3.6.x_build /
Build windows-jdk13-m3.6.x_build / testFix

Error Message:
Error when invoking Maven, consult the invoker log file: f:\jenkins\jenkins-slave\workspace\dditionalOptions-doc-improvement@2\windows-jdk13-m3.6.x_build\target\invoker\FixJavadocMojoTest1499341389.txt

Stack Trace:
org.apache.maven.shared.invoker.MavenInvocationException: Error when invoking Maven, consult
the invoker log file: f:\jenkins\jenkins-slave\workspace\dditionalOptions-doc-improvement@2\windows-jdk13-m3.6.x_build\target\invoker\FixJavadocMojoTest1499341389.txt
	at org.apache.maven.plugins.javadoc.FixJavadocMojoTest.invokeCompileGoal(FixJavadocMojoTest.java:664)
	at org.apache.maven.plugins.javadoc.FixJavadocMojoTest.executeMojoAndTest(FixJavadocMojoTest.java:616)
	at org.apache.maven.plugins.javadoc.FixJavadocMojoTest.testFix(FixJavadocMojoTest.java:141)


FAILED:  org.apache.maven.plugins.javadoc.FixJavadocMojoTest.windows-jdk13-m3.6.x_build /
Build windows-jdk13-m3.6.x_build / testFixJdk6

Error Message:
Error when invoking Maven, consult the invoker log file: f:\jenkins\jenkins-slave\workspace\dditionalOptions-doc-improvement@2\windows-jdk13-m3.6.x_build\target\invoker\FixJavadocMojoTest1813001348.txt

Stack Trace:
org.apache.maven.shared.invoker.MavenInvocationException: Error when invoking Maven, consult
the invoker log file: f:\jenkins\jenkins-slave\workspace\dditionalOptions-doc-improvement@2\windows-jdk13-m3.6.x_build\target\invoker\FixJavadocMojoTest1813001348.txt
	at org.apache.maven.plugins.javadoc.FixJavadocMojoTest.invokeCompileGoal(FixJavadocMojoTest.java:664)
	at org.apache.maven.plugins.javadoc.FixJavadocMojoTest.executeMojoAndTest(FixJavadocMojoTest.java:616)
	at org.apache.maven.plugins.javadoc.FixJavadocMojoTest.testFixJdk6(FixJavadocMojoTest.java:170)


FAILED:  org.apache.maven.plugins.javadoc.JavadocReportTest.windows-jdk13-m3.6.x_build / Build
windows-jdk13-m3.6.x_build / testJavadocResources

Error Message:
null

Stack Trace:
junit.framework.AssertionFailedError
	at org.apache.maven.plugins.javadoc.JavadocReportTest.testJavadocResources(JavadocReportTest.java:745)


FAILED:  org.apache.maven.plugins.javadoc.JavadocReportTest.windows-jdk13-m3.6.x_build / Build
windows-jdk13-m3.6.x_build / testJdk6

Error Message:
An error has occurred in Javadoc report generation: 
Exit code: 2 - error: Source option 6 is no longer supported. Use 7 or later.
error: Target option 6 is no longer supported. Use 7 or later.

Command line was: f:\jenkins\tools\java\latest13\bin\javadoc.exe @options @packages

Refer to the generated Javadoc files in 'f:\jenkins\jenkins-slave\workspace\dditionalOptions-doc-improvement@2\windows-jdk13-m3.6.x_build\target\test\unit\jdk6-test\target\site\apidocs'
dir.


Stack Trace:
org.apache.maven.plugin.MojoExecutionException: 
An error has occurred in Javadoc report generation: 
Exit code: 2 - error: Source option 6 is no longer supported. Use 7 or later.
error: Target option 6 is no longer supported. Use 7 or later.

Command line was: f:\jenkins\tools\java\latest13\bin\javadoc.exe @options @packages

Refer to the generated Javadoc files in 'f:\jenkins\jenkins-slave\workspace\dditionalOptions-doc-improvement@2\windows-jdk13-m3.6.x_build\target\test\unit\jdk6-test\target\site\apidocs'
dir.

	at org.apache.maven.plugins.javadoc.JavadocReportTest.testJdk6(JavadocReportTest.java:853)
Caused by: org.apache.maven.reporting.MavenReportException: 

Exit code: 2 - error: Source option 6 is no longer supported. Use 7 or later.
error: Target option 6 is no longer supported. Use 7 or later.

Command line was: f:\jenkins\tools\java\latest13\bin\javadoc.exe @options @packages

Refer to the generated Javadoc files in 'f:\jenkins\jenkins-slave\workspace\dditionalOptions-doc-improvement@2\windows-jdk13-m3.6.x_build\target\test\unit\jdk6-test\target\site\apidocs'
dir.

	at org.apache.maven.plugins.javadoc.JavadocReportTest.testJdk6(JavadocReportTest.java:853)


FAILED:  org.apache.maven.plugins.javadoc.JavadocReportTest.windows-jdk13-m3.6.x_build / Build
windows-jdk13-m3.6.x_build / testDefaultConfiguration

Error Message:
null

Stack Trace:
junit.framework.AssertionFailedError
	at org.apache.maven.plugins.javadoc.JavadocReportTest.testDefaultConfiguration(JavadocReportTest.java:245)


FAILED:  org.apache.maven.plugins.javadoc.JavadocReportTest.windows-jdk13-m3.6.x_build / Build
windows-jdk13-m3.6.x_build / testCustomConfiguration

Error Message:
An error has occurred in Javadoc report generation: 
Exit code: 1 - javadoc: error - The code being documented uses modules but the packages defined
in http://java.sun.com/j2se/1.4.2/docs/api/ are in the unnamed module.
f:\jenkins\jenkins-slave\workspace\dditionalOptions-doc-improvement@2\windows-jdk13-m3.6.x_build\src\test\resources\unit\custom-configuration\custom\configuration\exclude1\Exclude1App.java:40:
warning: no description for @param
     * @param str
       ^

Command line was: f:\jenkins\tools\java\latest13\bin\javadoc.exe -J-Xmx512m -J-Xms128m @options
@packages

Refer to the generated Javadoc files in 'f:\jenkins\jenkins-slave\workspace\dditionalOptions-doc-improvement@2\windows-jdk13-m3.6.x_build\target\test\unit\custom-configuration\target\site\apidocs'
dir.


Stack Trace:
org.apache.maven.plugin.MojoExecutionException: 
An error has occurred in Javadoc report generation: 
Exit code: 1 - javadoc: error - The code being documented uses modules but the packages defined
in http://java.sun.com/j2se/1.4.2/docs/api/ are in the unnamed module.
f:\jenkins\jenkins-slave\workspace\dditionalOptions-doc-improvement@2\windows-jdk13-m3.6.x_build\src\test\resources\unit\custom-configuration\custom\configuration\exclude1\Exclude1App.java:40:
warning: no description for @param
     * @param str
       ^

Command line was: f:\jenkins\tools\java\latest13\bin\javadoc.exe -J-Xmx512m -J-Xms128m @options
@packages

Refer to the generated Javadoc files in 'f:\jenkins\jenkins-slave\workspace\dditionalOptions-doc-improvement@2\windows-jdk13-m3.6.x_build\target\test\unit\custom-configuration\target\site\apidocs'
dir.

	at org.apache.maven.plugins.javadoc.JavadocReportTest.testCustomConfiguration(JavadocReportTest.java:370)
Caused by: org.apache.maven.reporting.MavenReportException: 

Exit code: 1 - javadoc: error - The code being documented uses modules but the packages defined
in http://java.sun.com/j2se/1.4.2/docs/api/ are in the unnamed module.
f:\jenkins\jenkins-slave\workspace\dditionalOptions-doc-improvement@2\windows-jdk13-m3.6.x_build\src\test\resources\unit\custom-configuration\custom\configuration\exclude1\Exclude1App.java:40:
warning: no description for @param
     * @param str
       ^

Command line was: f:\jenkins\tools\java\latest13\bin\javadoc.exe -J-Xmx512m -J-Xms128m @options
@packages

Refer to the generated Javadoc files in 'f:\jenkins\jenkins-slave\workspace\dditionalOptions-doc-improvement@2\windows-jdk13-m3.6.x_build\target\test\unit\custom-configuration\target\site\apidocs'
dir.

	at org.apache.maven.plugins.javadoc.JavadocReportTest.testCustomConfiguration(JavadocReportTest.java:370)




Build log:
[...truncated 7680 lines...]
[INFO] Stopped SocketConnector@0.0.0.0:62282
[INFO] Mock Repository Manager http://localhost:62282 is stopped.
[INFO] 
[INFO] --- mrm-maven-plugin:1.1.0:stop (3rdparty) @ maven-javadoc-plugin ---
[INFO] Stopping Mock Repository Manager on http://localhost:62283
[INFO] Stopped SocketConnector@0.0.0.0:62283
[INFO] Mock Repository Manager http://localhost:62283 is stopped.
[INFO] 
[INFO] --- maven-checkstyle-plugin:3.0.0:check (checkstyle-check) @ maven-javadoc-plugin ---
[INFO] There are 4 errors reported by Checkstyle 6.18 with config/maven_checks.xml ruleset.
[INFO] Ignored 4 errors, 0 violation remaining.
[INFO] 
[INFO] --- maven-invoker-plugin:3.1.0:verify (integration-test) @ maven-javadoc-plugin ---
[INFO] -------------------------------------------------
[INFO] Build Summary:
[INFO]   Passed: 47, Failed: 0, Errors: 0, Skipped: 1
[INFO] -------------------------------------------------
[INFO] ------------------------------------------------------------------------
[INFO] BUILD SUCCESS
[INFO] ------------------------------------------------------------------------
[INFO] Total time:  17:20 min
[INFO] Finished at: 2019-06-04T05:42:16-07:00
[INFO] ------------------------------------------------------------------------
[INFO] [jenkins-event-spy] Generated F:\jenkins\jenkins-slave\workspace\dditionalOptions-doc-improvement@3@2@tmp\withMaven37774665\maven-spy-20190604-052455-7325871137728666828718.log
[Pipeline] }
[Pipeline] // dir
[Pipeline] }
[withMaven] artifactsPublisher - Archive artifact windows-jdk11-m3.6.x_build\pom.xml under
org\apache\maven\plugins\maven-javadoc-plugin\3.0.2-SNAPSHOT\maven-javadoc-plugin-3.0.2-SNAPSHOT.pom
[withMaven] artifactsPublisher - Archive artifact windows-jdk11-m3.6.x_build\target\maven-javadoc-plugin-3.0.2-SNAPSHOT.jar
under org\apache\maven\plugins\maven-javadoc-plugin\3.0.2-SNAPSHOT\maven-javadoc-plugin-3.0.2-SNAPSHOT.jar
[Fast Archiver] No prior successful build to compare, so performing full copy of artifacts
[withMaven] junitPublisher - Archive test results for Maven artifact org.apache.maven.plugins:maven-javadoc-plugin:maven-plugin:3.0.2-SNAPSHOT
generated by maven-surefire-plugin:test (default-test): windows-jdk11-m3.6.x_build\target\surefire-reports\*.xml
Recording test results
[withMaven] openTasksPublisher - Scan Tasks for Maven artifact org.apache.maven.plugins:maven-javadoc-plugin:maven-plugin:3.0.2-SNAPSHOT
in source directory windows-jdk11-m3.6.x_build\src\main\java
[TASKS] Scanning folder 'f:\jenkins\jenkins-slave\workspace\dditionalOptions-doc-improvement@3@2'
for files matching the pattern 'windows-jdk11-m3.6.x_build\src\main\java\**\*' - excludes:
null
[TASKS] Found 24 files to scan for tasks
[TASKS] Found 7 open tasks.
Skipping warnings blame since pipelines do not have an SCM link.%n
[withMaven] invokerPublisher - Archive invoker results for Maven artifact MavenArtifact{org.apache.maven.plugins:maven-javadoc-plugin:maven-plugin:3.0.2-SNAPSHOT(version:
3.0.2-SNAPSHOT, snapshot:false) } generated by PluginInvocation{org.apache.maven.plugins:maven-invoker-plugin:3.1.0@integration-test
 integration-test}: windows-jdk11-m3.6.x_build\target\invoker-reports\*.xml
[INFO]           MJAVADOC-538\pom.xml ............................. SUCCESS (9.5 s)
[INFO] Building: MJAVADOC-551 spaces\pom.xml
[INFO] run post-build script verify.groovy
[INFO]           MJAVADOC-528\pom.xml ............................. SUCCESS (14.0 s)
[INFO] Building: MJAVADOC-538\pom.xml
[INFO]           MJAVADOC-551 spaces\pom.xml ...................... SUCCESS (8.4 s)
[INFO] Building: MJAVADOC-556_hide-non-exported-packages\pom.xml
[INFO]           MJAVADOC-538\pom.xml ............................. SUCCESS (10.3 s)
[INFO] Building: MJAVADOC-551 spaces\pom.xml
[INFO]           MJAVADOC-556_hide-non-exported-packages\pom.xml .. SUCCESS (11.4 s)
[INFO] Building: site-failOnError\pom.xml
[INFO]           MJAVADOC-551 spaces\pom.xml ...................... SUCCESS (9.9 s)
[INFO] Building: MJAVADOC-556_hide-non-exported-packages\pom.xml
[INFO]           MJAVADOC-556_hide-non-exported-packages\pom.xml .. SKIPPED due to JRE version
[INFO] Building: site-failOnError\pom.xml
[withMaven] Publishers: Generated Artifacts Publisher: 137 ms, Junit Publisher: 574 ms, Open
Task Scanner Publisher: 388 ms, Dependencies Fingerprint Publisher: 1 ms, Invoker Publisher:
34541 ms, Pipeline Graph Publisher: 18 ms
[Pipeline] // withMaven
[Pipeline] cleanWs
[WS-CLEANUP] Deleting project workspace...
[WS-CLEANUP] Deferred wipeout is used...
[WS-CLEANUP] done
[Pipeline] }
[Pipeline] // stage
[Pipeline] }
[Pipeline] // ws
[Pipeline] }
[Pipeline] // node
[Pipeline] }
[INFO]           site-failOnError\pom.xml ......................... SUCCESS (11.8 s)
[INFO] 
[INFO] --- mrm-maven-plugin:1.1.0:stop (repository) @ maven-javadoc-plugin ---
[INFO] Stopping Mock Repository Manager on http://localhost:60908
[INFO] Stopped SocketConnector@0.0.0.0:60908
[INFO] Mock Repository Manager http://localhost:60908 is stopped.
[INFO] 
[INFO] --- mrm-maven-plugin:1.1.0:stop (3rdparty) @ maven-javadoc-plugin ---
[INFO] Stopping Mock Repository Manager on http://localhost:60909
[INFO] Stopped SocketConnector@0.0.0.0:60909
[INFO] Mock Repository Manager http://localhost:60909 is stopped.
[INFO] 
[INFO] --- maven-checkstyle-plugin:3.0.0:check (checkstyle-check) @ maven-javadoc-plugin ---
[INFO] There are 4 errors reported by Checkstyle 6.18 with config/maven_checks.xml ruleset.
[INFO] Ignored 4 errors, 0 violation remaining.
[INFO] 
[INFO] --- maven-invoker-plugin:3.1.0:verify (integration-test) @ maven-javadoc-plugin ---
[INFO] -------------------------------------------------
[INFO] Build Summary:
[INFO]   Passed: 41, Failed: 6, Errors: 0, Skipped: 1
[INFO] -------------------------------------------------
[ERROR] The following builds failed:
[ERROR] *  additional-dependencies-non-aggregate\pom.xml
[ERROR] *  additional-dependencies\pom.xml
[ERROR] *  MJAVADOC-325\pom.xml
[ERROR] *  MJAVADOC-384\pom.xml
[ERROR] *  MJAVADOC-407\pom.xml
[ERROR] *  MJAVADOC-514_3rdparty-doclettags\pom.xml
[INFO] -------------------------------------------------
[INFO] ------------------------------------------------------------------------
[INFO] BUILD FAILURE
[INFO] ------------------------------------------------------------------------
[INFO] Total time:  17:12 min
[INFO] Finished at: 2019-06-04T05:42:57-07:00
[INFO] ------------------------------------------------------------------------
[INFO] [jenkins-event-spy] Generated F:\jenkins\jenkins-slave\workspace\dditionalOptions-doc-improvement@2@tmp\withMaven0c35ce59\maven-spy-20190604-052544-6974065718932788803993.log
[ERROR] Failed to execute goal org.apache.maven.plugins:maven-invoker-plugin:3.1.0:verify
(integration-test) on project maven-javadoc-plugin: 6 builds failed. See console output above
for details. -> [Help 1]
org.apache.maven.lifecycle.LifecycleExecutionException: Failed to execute goal org.apache.maven.plugins:maven-invoker-plugin:3.1.0:verify
(integration-test) on project maven-javadoc-plugin: 6 builds failed. See console output above
for details.
    at org.apache.maven.lifecycle.internal.MojoExecutor.execute (MojoExecutor.java:215)
    at org.apache.maven.lifecycle.internal.MojoExecutor.execute (MojoExecutor.java:156)
    at org.apache.maven.lifecycle.internal.MojoExecutor.execute (MojoExecutor.java:148)
    at org.apache.maven.lifecycle.internal.LifecycleModuleBuilder.buildProject (LifecycleModuleBuilder.java:117)
    at org.apache.maven.lifecycle.internal.LifecycleModuleBuilder.buildProject (LifecycleModuleBuilder.java:81)
    at org.apache.maven.lifecycle.internal.builder.singlethreaded.SingleThreadedBuilder.build
(SingleThreadedBuilder.java:56)
    at org.apache.maven.lifecycle.internal.LifecycleStarter.execute (LifecycleStarter.java:128)
    at org.apache.maven.DefaultMaven.doExecute (DefaultMaven.java:305)
    at org.apache.maven.DefaultMaven.doExecute (DefaultMaven.java:192)
    at org.apache.maven.DefaultMaven.execute (DefaultMaven.java:105)
    at org.apache.maven.cli.MavenCli.execute (MavenCli.java:956)
    at org.apache.maven.cli.MavenCli.doMain (MavenCli.java:288)
    at org.apache.maven.cli.MavenCli.main (MavenCli.java:192)
    at jdk.internal.reflect.NativeMethodAccessorImpl.invoke0 (Native Method)
    at jdk.internal.reflect.NativeMethodAccessorImpl.invoke (NativeMethodAccessorImpl.java:62)
    at jdk.internal.reflect.DelegatingMethodAccessorImpl.invoke (DelegatingMethodAccessorImpl.java:43)
    at java.lang.reflect.Method.invoke (Method.java:567)
    at org.codehaus.plexus.classworlds.launcher.Launcher.launchEnhanced (Launcher.java:289)
    at org.codehaus.plexus.classworlds.launcher.Launcher.launch (Launcher.java:229)
    at org.codehaus.plexus.classworlds.launcher.Launcher.mainWithExitCode (Launcher.java:415)
    at org.codehaus.plexus.classworlds.launcher.Launcher.main (Launcher.java:356)
Caused by: org.apache.maven.plugin.MojoFailureException: 6 builds failed. See console output
above for details.
    at org.apache.maven.plugins.invoker.InvokerSession.handleFailures (InvokerSession.java:260)
    at org.apache.maven.plugins.invoker.VerifyMojo.execute (VerifyMojo.java:137)
    at org.apache.maven.plugin.DefaultBuildPluginManager.executeMojo (DefaultBuildPluginManager.java:137)
    at org.apache.maven.lifecycle.internal.MojoExecutor.execute (MojoExecutor.java:210)
    at org.apache.maven.lifecycle.internal.MojoExecutor.execute (MojoExecutor.java:156)
    at org.apache.maven.lifecycle.internal.MojoExecutor.execute (MojoExecutor.java:148)
    at org.apache.maven.lifecycle.internal.LifecycleModuleBuilder.buildProject (LifecycleModuleBuilder.java:117)
    at org.apache.maven.lifecycle.internal.LifecycleModuleBuilder.buildProject (LifecycleModuleBuilder.java:81)
    at org.apache.maven.lifecycle.internal.builder.singlethreaded.SingleThreadedBuilder.build
(SingleThreadedBuilder.java:56)
    at org.apache.maven.lifecycle.internal.LifecycleStarter.execute (LifecycleStarter.java:128)
    at org.apache.maven.DefaultMaven.doExecute (DefaultMaven.java:305)
    at org.apache.maven.DefaultMaven.doExecute (DefaultMaven.java:192)
    at org.apache.maven.DefaultMaven.execute (DefaultMaven.java:105)
    at org.apache.maven.cli.MavenCli.execute (MavenCli.java:956)
    at org.apache.maven.cli.MavenCli.doMain (MavenCli.java:288)
    at org.apache.maven.cli.MavenCli.main (MavenCli.java:192)
    at jdk.internal.reflect.NativeMethodAccessorImpl.invoke0 (Native Method)
    at jdk.internal.reflect.NativeMethodAccessorImpl.invoke (NativeMethodAccessorImpl.java:62)
    at jdk.internal.reflect.DelegatingMethodAccessorImpl.invoke (DelegatingMethodAccessorImpl.java:43)
    at java.lang.reflect.Method.invoke (Method.java:567)
    at org.codehaus.plexus.classworlds.launcher.Launcher.launchEnhanced (Launcher.java:289)
    at org.codehaus.plexus.classworlds.launcher.Launcher.launch (Launcher.java:229)
    at org.codehaus.plexus.classworlds.launcher.Launcher.mainWithExitCode (Launcher.java:415)
    at org.codehaus.plexus.classworlds.launcher.Launcher.main (Launcher.java:356)
[ERROR] 
[ERROR] Re-run Maven using the -X switch to enable full debug logging.
[ERROR] 
[ERROR] For more information about the errors and possible solutions, please read the following
articles:
[ERROR] [Help 1] http://cwiki.apache.org/confluence/display/MAVEN/MojoFailureException
[Pipeline] }
[Pipeline] // dir
[Pipeline] }
[Fast Archiver] No prior successful build to compare, so performing full copy of artifacts
[withMaven] junitPublisher - Archive test results for Maven artifact org.apache.maven.plugins:maven-javadoc-plugin:maven-plugin:3.0.2-SNAPSHOT
generated by maven-surefire-plugin:test (default-test): windows-jdk13-m3.6.x_build\target\surefire-reports\*.xml
Recording test results
[withMaven] openTasksPublisher - Scan Tasks for Maven artifact org.apache.maven.plugins:maven-javadoc-plugin:maven-plugin:3.0.2-SNAPSHOT
in source directory windows-jdk13-m3.6.x_build\src\main\java
[TASKS] Scanning folder 'f:\jenkins\jenkins-slave\workspace\dditionalOptions-doc-improvement@2'
for files matching the pattern 'windows-jdk13-m3.6.x_build\src\main\java\**\*' - excludes:
null
[TASKS] Found 24 files to scan for tasks
[TASKS] Found 7 open tasks.
Skipping warnings blame since pipelines do not have an SCM link.%n
[withMaven] invokerPublisher - Archive invoker results for Maven artifact MavenArtifact{org.apache.maven.plugins:maven-javadoc-plugin:maven-plugin:3.0.2-SNAPSHOT(version:
3.0.2-SNAPSHOT, snapshot:false) } generated by PluginInvocation{org.apache.maven.plugins:maven-invoker-plugin:3.1.0@integration-test
 integration-test}: windows-jdk13-m3.6.x_build\target\invoker-reports\*.xml
[INFO]           site-failOnError\pom.xml ......................... SUCCESS (17.1 s)
[INFO] 
[INFO] --- mrm-maven-plugin:1.1.0:stop (repository) @ maven-javadoc-plugin ---
[INFO] Stopping Mock Repository Manager on http://localhost:59084
[INFO] Stopped SocketConnector@0.0.0.0:59084
[INFO] Mock Repository Manager http://localhost:59084 is stopped.
[INFO] 
[INFO] --- mrm-maven-plugin:1.1.0:stop (3rdparty) @ maven-javadoc-plugin ---
[INFO] Stopping Mock Repository Manager on http://localhost:59085
[INFO] Stopped SocketConnector@0.0.0.0:59085
[INFO] Mock Repository Manager http://localhost:59085 is stopped.
[INFO] 
[INFO] --- maven-checkstyle-plugin:3.0.0:check (checkstyle-check) @ maven-javadoc-plugin ---
[INFO] There are 4 errors reported by Checkstyle 6.18 with config/maven_checks.xml ruleset.
[INFO] Ignored 4 errors, 0 violation remaining.
[INFO] 
[INFO] --- maven-invoker-plugin:3.1.0:verify (integration-test) @ maven-javadoc-plugin ---
[INFO] -------------------------------------------------
[INFO] Build Summary:
[INFO]   Passed: 43, Failed: 0, Errors: 0, Skipped: 5
[INFO] -------------------------------------------------
[INFO] ------------------------------------------------------------------------
[INFO] BUILD SUCCESS
[INFO] ------------------------------------------------------------------------
[INFO] Total time:  18:41 min
[INFO] Finished at: 2019-06-04T12:43:07Z
[INFO] ------------------------------------------------------------------------
[INFO] [jenkins-event-spy] Generated F:\jenkins\jenkins-slave\workspace\dditionalOptions-doc-improvement@2@tmp\withMavenc7e0e7a7\maven-spy-20190604-122425-2683059543838089351063.log
Picked up JAVA_TOOL_OPTIONS: -Dmaven.ext.class.path="f:\jenkins\jenkins-slave\workspace\dditionalOptions-doc-improvement@2@tmp\withMavenc7e0e7a7\pipeline-maven-spy.jar"
-Dorg.jenkinsci.plugins.pipeline.maven.reportsFolder="f:\jenkins\jenkins-slave\workspace\dditionalOptions-doc-improvement@2@tmp\withMavenc7e0e7a7"

[Pipeline] }
[Pipeline] // dir
[Pipeline] }
[withMaven] artifactsPublisher - Archive artifact windows-jdk8-m3.6.x_build\pom.xml under
org\apache\maven\plugins\maven-javadoc-plugin\3.0.2-SNAPSHOT\maven-javadoc-plugin-3.0.2-SNAPSHOT.pom
[withMaven] artifactsPublisher - Archive artifact windows-jdk8-m3.6.x_build\target\maven-javadoc-plugin-3.0.2-SNAPSHOT.jar
under org\apache\maven\plugins\maven-javadoc-plugin\3.0.2-SNAPSHOT\maven-javadoc-plugin-3.0.2-SNAPSHOT.jar
[Fast Archiver] No prior successful build to compare, so performing full copy of artifacts
[withMaven] junitPublisher - Archive test results for Maven artifact org.apache.maven.plugins:maven-javadoc-plugin:maven-plugin:3.0.2-SNAPSHOT
generated by maven-surefire-plugin:test (default-test): windows-jdk8-m3.6.x_build\target\surefire-reports\*.xml
Recording test results
[withMaven] openTasksPublisher - Scan Tasks for Maven artifact org.apache.maven.plugins:maven-javadoc-plugin:maven-plugin:3.0.2-SNAPSHOT
in source directory windows-jdk8-m3.6.x_build\src\main\java
[TASKS] Scanning folder 'f:\jenkins\jenkins-slave\workspace\dditionalOptions-doc-improvement@2'
for files matching the pattern 'windows-jdk8-m3.6.x_build\src\main\java\**\*' - excludes:
null
[TASKS] Found 24 files to scan for tasks
[TASKS] Found 7 open tasks.
Skipping warnings blame since pipelines do not have an SCM link.%n
[withMaven] invokerPublisher - Archive invoker results for Maven artifact MavenArtifact{org.apache.maven.plugins:maven-javadoc-plugin:maven-plugin:3.0.2-SNAPSHOT(version:
3.0.2-SNAPSHOT, snapshot:false) } generated by PluginInvocation{org.apache.maven.plugins:maven-invoker-plugin:3.1.0@integration-test
 integration-test}: windows-jdk8-m3.6.x_build\target\invoker-reports\*.xml
[withMaven] Publishers: Generated Artifacts Publisher: 17 ms, Junit Publisher: 541 ms, Open
Task Scanner Publisher: 219 ms, Dependencies Fingerprint Publisher: 1 ms, Invoker Publisher:
38831 ms
[Pipeline] // withMaven
[Pipeline] cleanWs
[WS-CLEANUP] Deleting project workspace...
[WS-CLEANUP] Deferred wipeout is used...
[WS-CLEANUP] done
[Pipeline] cleanWs
[WS-CLEANUP] Deleting project workspace...
[WS-CLEANUP] Deferred wipeout is used...
[WS-CLEANUP] done
[Pipeline] }
[Pipeline] // stage
[Pipeline] }
[Pipeline] // ws
[Pipeline] }
[Pipeline] // node
[Pipeline] }
Failed in branch windows-jdk13-m3.6.x_build
[withMaven] Publishers: Generated Artifacts Publisher: 203 ms, Junit Publisher: 771 ms, Open
Task Scanner Publisher: 278 ms, Invoker Publisher: 32322 ms, Pipeline Graph Publisher: 2 ms
[Pipeline] // withMaven
[Pipeline] cleanWs
[WS-CLEANUP] Deleting project workspace...
[WS-CLEANUP] Deferred wipeout is used...
[WS-CLEANUP] done
[Pipeline] }
[Pipeline] // stage
[Pipeline] }
[Pipeline] // ws
[Pipeline] }
[Pipeline] // node
[Pipeline] }
[Pipeline] // parallel
[Pipeline] stage
[Pipeline] { (Notifications)
[Pipeline] echo
Build result: FAILURE
[Pipeline] jiraIssueSelector
[Pipeline] jiraComment
[Pipeline] emailext
Mime
  • Unnamed multipart/mixed (inline, None, 0 bytes)
View raw message