maven-notifications mailing list archives

Site index · List index
Message view « Date » · « Thread »
Top « Date » · « Thread »
From Apache Jenkins Server <jenk...@builds.apache.org>
Subject Build failed in Jenkins: Maven TLP » maven-scm » SCM-917 #5
Date Sun, 02 Jun 2019 19:21:28 GMT
See https://builds.apache.org/job/maven-box/job/maven-scm/job/SCM-917/5/

Changes:

* [MNG-6573] Use Maven 3.6.0 as default
* H39 has weird issues, exclude it for now
* Fix no access to currentBuild.rawBuild
* fixed typo
* Include more recent JDKs

All tests passed

Build log:
[...truncated 69606 lines...]
[INFO] Executing: cmd.exe /X /C "git clone --branch mytag file:///F:/jenkins/jenkins-slave/workspace/maven-box_maven-scm_SCM-917/m/maven-scm-plugin/target/repository
mytag"
[INFO] Executing: cmd.exe /X /C "git clone --branch mytag file:///F:/jenkins/jenkins-slave/workspace/maven-box_maven-scm_SCM-917/m/maven-scm-plugin/target/repository
mytag"
[INFO] Working directory: F:\jenkins\jenkins-slave\workspace\maven-box_maven-scm_SCM-917\m\maven-scm-plugin\target\tags
[INFO] Working directory: F:\jenkins\jenkins-slave\workspace\maven-box_maven-scm_SCM-917\m\maven-scm-plugin\target\tags
[INFO] Working directory: F:\jenkins\jenkins-slave\workspace\maven-box_maven-scm_SCM-917\m\maven-scm-plugin\target\tags
[INFO] Working directory: F:\jenkins\jenkins-slave\workspace\maven-box_maven-scm_SCM-917\m\maven-scm-plugin\target\tags
[ERROR] Provider message:
[ERROR] The git-clone command failed.
[ERROR] Command output:
[ERROR] Cloning into 'mytag'...
fatal: Remote branch mytag not found in upstream origin
fatal: The remote end hung up unexpectedly

[INFO] Tests run: 1, Failures: 0, Errors: 0, Skipped: 0, Time elapsed: 2.615 s - in org.apache.maven.scm.plugin.UntagMojoTest
[INFO] Running org.apache.maven.scm.plugin.UpdateMojoTest
Test command line: cmd.exe /X /C "svnadmin create repository"
[INFO] Removing target\checkout
[INFO] Executing: cmd.exe /X /C "svn --non-interactive checkout file:///F:/jenkins/jenkins-slave/workspace/maven-box_maven-scm_SCM-917/m/maven-scm-plugin/target/repository/trunk@
F:\jenkins\jenkins-slave\workspace\maven-box_maven-scm_SCM-917\m\maven-scm-plugin\target\checkout"
[INFO] Working directory: F:\jenkins\jenkins-slave\workspace\maven-box_maven-scm_SCM-917\m\maven-scm-plugin\target
[INFO] Executing: cmd.exe /X /C "svn --non-interactive update F:\jenkins\jenkins-slave\workspace\maven-box_maven-scm_SCM-917\m\maven-scm-plugin\target\checkout@"
[INFO] Executing: cmd.exe /X /C "svn --non-interactive update F:\jenkins\jenkins-slave\workspace\maven-box_maven-scm_SCM-917\m\maven-scm-plugin\target\checkout@"
[INFO] Working directory: F:\jenkins\jenkins-slave\workspace\maven-box_maven-scm_SCM-917\m\maven-scm-plugin\target\checkout
[INFO] Working directory: F:\jenkins\jenkins-slave\workspace\maven-box_maven-scm_SCM-917\m\maven-scm-plugin\target\checkout
[INFO] Storing revision in 'scm.revision' project property.
[INFO] Project at revision 8
[INFO] Tests run: 1, Failures: 0, Errors: 0, Skipped: 0, Time elapsed: 0.728 s - in org.apache.maven.scm.plugin.UpdateMojoTest
[INFO] Running org.apache.maven.scm.plugin.ValidateMojoTest
[ERROR] Validation of scm url connection (project.scm.connection) failed :
[ERROR] No such provider installed 'unknwonProvider'.
[ERROR] The invalid scm url connection: 'scm:unknwonProvider:http://svn.apache.org/repos/asf/maven/scm/trunk'.
[INFO] project.scm.connection scm connection string is valid.
[INFO] project.scm.developerConnection scm connection string is valid.
[INFO] Tests run: 3, Failures: 0, Errors: 0, Skipped: 0, Time elapsed: 0.077 s - in org.apache.maven.scm.plugin.ValidateMojoTest
[INFO] 
[INFO] Results:
[INFO] 
[INFO] Tests run: 23, Failures: 0, Errors: 0, Skipped: 0
[INFO] 
[INFO] 
[INFO] --- maven-jar-plugin:3.1.0:jar (default-jar) @ maven-scm-plugin ---
[INFO] Building jar: F:\jenkins\jenkins-slave\workspace\maven-box_maven-scm_SCM-917\m\maven-scm-plugin\target\maven-scm-plugin-1.11.2-SNAPSHOT.jar
[INFO] 
[INFO] --- maven-plugin-plugin:3.2:addPluginArtifactMetadata (default-addPluginArtifactMetadata)
@ maven-scm-plugin ---
[INFO] 
[INFO] --- maven-site-plugin:3.7.1:attach-descriptor (attach-descriptor) @ maven-scm-plugin
---
[INFO] Skipping because packaging 'maven-plugin' is not pom.
[INFO] 
[INFO] --- maven-invoker-plugin:3.1.0:install (integration-test) @ maven-scm-plugin ---
[INFO] Downloading from central: https://repo.maven.apache.org/maven2/org/apache/maven/shared/maven-invoker/3.0.1/maven-invoker-3.0.1.pom
[INFO] Downloaded from central: https://repo.maven.apache.org/maven2/org/apache/maven/shared/maven-invoker/3.0.1/maven-invoker-3.0.1.pom
(4.9 kB at 46 kB/s)
[INFO] Downloading from central: https://repo.maven.apache.org/maven2/org/apache/maven/shared/maven-shared-components/31/maven-shared-components-31.pom
[INFO] Downloaded from central: https://repo.maven.apache.org/maven2/org/apache/maven/shared/maven-shared-components/31/maven-shared-components-31.pom
(5.1 kB at 393 kB/s)
[INFO] Downloading from central: https://repo.maven.apache.org/maven2/org/apache/maven/reporting/maven-reporting-impl/2.4/maven-reporting-impl-2.4.pom
[INFO] Downloaded from central: https://repo.maven.apache.org/maven2/org/apache/maven/reporting/maven-reporting-impl/2.4/maven-reporting-impl-2.4.pom
(6.1 kB at 550 kB/s)
[INFO] Downloading from central: https://repo.maven.apache.org/maven2/commons-validator/commons-validator/1.4.1/commons-validator-1.4.1.pom
[INFO] Downloaded from central: https://repo.maven.apache.org/maven2/commons-validator/commons-validator/1.4.1/commons-validator-1.4.1.pom
(13 kB at 975 kB/s)
[INFO] Downloading from central: https://repo.maven.apache.org/maven2/org/apache/commons/commons-parent/36/commons-parent-36.pom
[INFO] Downloaded from central: https://repo.maven.apache.org/maven2/org/apache/commons/commons-parent/36/commons-parent-36.pom
(58 kB at 2.9 MB/s)
[INFO] Downloading from central: https://repo.maven.apache.org/maven2/commons-beanutils/commons-beanutils/1.8.3/commons-beanutils-1.8.3.pom
[INFO] Downloaded from central: https://repo.maven.apache.org/maven2/commons-beanutils/commons-beanutils/1.8.3/commons-beanutils-1.8.3.pom
(11 kB at 1.4 MB/s)
[INFO] Downloading from central: https://repo.maven.apache.org/maven2/org/apache/commons/commons-parent/14/commons-parent-14.pom
[INFO] Downloaded from central: https://repo.maven.apache.org/maven2/org/apache/commons/commons-parent/14/commons-parent-14.pom
(31 kB at 2.9 MB/s)
[INFO] Downloading from central: https://repo.maven.apache.org/maven2/commons-digester/commons-digester/1.8.1/commons-digester-1.8.1.pom
[INFO] Downloaded from central: https://repo.maven.apache.org/maven2/commons-digester/commons-digester/1.8.1/commons-digester-1.8.1.pom
(10 kB at 1.4 MB/s)
[INFO] Downloading from central: https://repo.maven.apache.org/maven2/org/apache/maven/shared/maven-script-interpreter/1.2/maven-script-interpreter-1.2.pom
[INFO] Downloaded from central: https://repo.maven.apache.org/maven2/org/apache/maven/shared/maven-script-interpreter/1.2/maven-script-interpreter-1.2.pom
(4.0 kB at 571 kB/s)
[INFO] Downloading from central: https://repo.maven.apache.org/maven2/org/apache/ant/ant/1.8.1/ant-1.8.1.pom
[INFO] Downloaded from central: https://repo.maven.apache.org/maven2/org/apache/ant/ant/1.8.1/ant-1.8.1.pom
(8.8 kB at 1.5 MB/s)
[INFO] Downloading from central: https://repo.maven.apache.org/maven2/org/apache/ant/ant-parent/1.8.1/ant-parent-1.8.1.pom
[INFO] Downloaded from central: https://repo.maven.apache.org/maven2/org/apache/ant/ant-parent/1.8.1/ant-parent-1.8.1.pom
(4.3 kB at 612 kB/s)
[INFO] Downloading from central: https://repo.maven.apache.org/maven2/org/apache/maven/shared/maven-artifact-transfer/0.9.1/maven-artifact-transfer-0.9.1.pom
[INFO] Downloaded from central: https://repo.maven.apache.org/maven2/org/apache/maven/shared/maven-artifact-transfer/0.9.1/maven-artifact-transfer-0.9.1.pom
(7.6 kB at 1.3 MB/s)
[INFO] Downloading from central: https://repo.maven.apache.org/maven2/org/apache/maven/doxia/doxia-sink-api/1.7/doxia-sink-api-1.7.pom
[INFO] Downloaded from central: https://repo.maven.apache.org/maven2/org/apache/maven/doxia/doxia-sink-api/1.7/doxia-sink-api-1.7.pom
(1.5 kB at 255 kB/s)
[INFO] Downloading from central: https://repo.maven.apache.org/maven2/org/apache/maven/doxia/doxia/1.7/doxia-1.7.pom
[INFO] Downloaded from central: https://repo.maven.apache.org/maven2/org/apache/maven/doxia/doxia/1.7/doxia-1.7.pom
(15 kB at 2.2 MB/s)
[INFO] Downloading from central: https://repo.maven.apache.org/maven2/org/apache/maven/doxia/doxia-logging-api/1.7/doxia-logging-api-1.7.pom
[INFO] Downloaded from central: https://repo.maven.apache.org/maven2/org/apache/maven/doxia/doxia-logging-api/1.7/doxia-logging-api-1.7.pom
(1.5 kB at 192 kB/s)
[INFO] Downloading from central: https://repo.maven.apache.org/maven2/org/apache/maven/doxia/doxia-site-renderer/1.7.4/doxia-site-renderer-1.7.4.pom
[INFO] Downloaded from central: https://repo.maven.apache.org/maven2/org/apache/maven/doxia/doxia-site-renderer/1.7.4/doxia-site-renderer-1.7.4.pom
(6.7 kB at 955 kB/s)
[INFO] Downloading from central: https://repo.maven.apache.org/maven2/org/apache/maven/doxia/doxia-sitetools/1.7.4/doxia-sitetools-1.7.4.pom
[INFO] Downloaded from central: https://repo.maven.apache.org/maven2/org/apache/maven/doxia/doxia-sitetools/1.7.4/doxia-sitetools-1.7.4.pom
(14 kB at 2.1 MB/s)
[INFO] Downloading from central: https://repo.maven.apache.org/maven2/org/apache/maven/doxia/doxia-core/1.7/doxia-core-1.7.pom
[INFO] Downloaded from central: https://repo.maven.apache.org/maven2/org/apache/maven/doxia/doxia-core/1.7/doxia-core-1.7.pom
(4.1 kB at 580 kB/s)
[INFO] Downloading from central: https://repo.maven.apache.org/maven2/org/apache/maven/doxia/doxia-decoration-model/1.7.4/doxia-decoration-model-1.7.4.pom
[INFO] Downloaded from central: https://repo.maven.apache.org/maven2/org/apache/maven/doxia/doxia-decoration-model/1.7.4/doxia-decoration-model-1.7.4.pom
(3.4 kB at 485 kB/s)
[INFO] Downloading from central: https://repo.maven.apache.org/maven2/org/apache/maven/doxia/doxia-skin-model/1.7.4/doxia-skin-model-1.7.4.pom
[INFO] Downloaded from central: https://repo.maven.apache.org/maven2/org/apache/maven/doxia/doxia-skin-model/1.7.4/doxia-skin-model-1.7.4.pom
(3.0 kB at 336 kB/s)
[INFO] Downloading from central: https://repo.maven.apache.org/maven2/org/apache/maven/doxia/doxia-module-xhtml/1.7/doxia-module-xhtml-1.7.pom
[INFO] Downloaded from central: https://repo.maven.apache.org/maven2/org/apache/maven/doxia/doxia-module-xhtml/1.7/doxia-module-xhtml-1.7.pom
(1.6 kB at 272 kB/s)
[INFO] Downloading from central: https://repo.maven.apache.org/maven2/org/apache/maven/doxia/doxia-modules/1.7/doxia-modules-1.7.pom
[INFO] Downloaded from central: https://repo.maven.apache.org/maven2/org/apache/maven/doxia/doxia-modules/1.7/doxia-modules-1.7.pom
(2.6 kB at 437 kB/s)
[INFO] Downloading from central: https://repo.maven.apache.org/maven2/org/codehaus/groovy/groovy-all/2.4.8/groovy-all-2.4.8.pom
[INFO] Downloaded from central: https://repo.maven.apache.org/maven2/org/codehaus/groovy/groovy-all/2.4.8/groovy-all-2.4.8.pom
(21 kB at 1.9 MB/s)
[INFO] Downloading from central: https://repo.maven.apache.org/maven2/org/apache/maven/reporting/maven-reporting-impl/2.4/maven-reporting-impl-2.4.jar
[INFO] Downloading from central: https://repo.maven.apache.org/maven2/commons-validator/commons-validator/1.4.1/commons-validator-1.4.1.jar
[INFO] Downloading from central: https://repo.maven.apache.org/maven2/commons-beanutils/commons-beanutils/1.8.3/commons-beanutils-1.8.3.jar
[INFO] Downloading from central: https://repo.maven.apache.org/maven2/org/apache/maven/shared/maven-invoker/3.0.1/maven-invoker-3.0.1.jar
[INFO] Downloading from central: https://repo.maven.apache.org/maven2/commons-digester/commons-digester/1.8.1/commons-digester-1.8.1.jar
[INFO] Downloaded from central: https://repo.maven.apache.org/maven2/org/apache/maven/reporting/maven-reporting-impl/2.4/maven-reporting-impl-2.4.jar
(20 kB at 1.2 MB/s)
[INFO] Downloading from central: https://repo.maven.apache.org/maven2/commons-logging/commons-logging/1.2/commons-logging-1.2.jar
[INFO] Downloaded from central: https://repo.maven.apache.org/maven2/commons-validator/commons-validator/1.4.1/commons-validator-1.4.1.jar
(190 kB at 9.1 MB/s)
[INFO] Downloading from central: https://repo.maven.apache.org/maven2/org/apache/maven/shared/maven-script-interpreter/1.2/maven-script-interpreter-1.2.jar
[INFO] Downloaded from central: https://repo.maven.apache.org/maven2/commons-beanutils/commons-beanutils/1.8.3/commons-beanutils-1.8.3.jar
(232 kB at 10 MB/s)
[INFO] Downloading from central: https://repo.maven.apache.org/maven2/org/apache/ant/ant/1.8.1/ant-1.8.1.jar
[INFO] Downloaded from central: https://repo.maven.apache.org/maven2/commons-logging/commons-logging/1.2/commons-logging-1.2.jar
(62 kB at 2.6 MB/s)
[INFO] Downloading from central: https://repo.maven.apache.org/maven2/org/apache/maven/shared/maven-artifact-transfer/0.9.1/maven-artifact-transfer-0.9.1.jar
[INFO] Downloaded from central: https://repo.maven.apache.org/maven2/org/apache/maven/shared/maven-invoker/3.0.1/maven-invoker-3.0.1.jar
(33 kB at 1.2 MB/s)
[INFO] Downloading from central: https://repo.maven.apache.org/maven2/org/apache/maven/doxia/doxia-sink-api/1.7/doxia-sink-api-1.7.jar
[INFO] Downloaded from central: https://repo.maven.apache.org/maven2/org/apache/maven/shared/maven-script-interpreter/1.2/maven-script-interpreter-1.2.jar
(22 kB at 735 kB/s)
[INFO] Downloading from central: https://repo.maven.apache.org/maven2/org/apache/maven/doxia/doxia-logging-api/1.7/doxia-logging-api-1.7.jar
[INFO] Downloaded from central: https://repo.maven.apache.org/maven2/org/apache/maven/shared/maven-artifact-transfer/0.9.1/maven-artifact-transfer-0.9.1.jar
(123 kB at 3.5 MB/s)
[INFO] Downloading from central: https://repo.maven.apache.org/maven2/org/apache/maven/doxia/doxia-site-renderer/1.7.4/doxia-site-renderer-1.7.4.jar
[INFO] Downloaded from central: https://repo.maven.apache.org/maven2/commons-digester/commons-digester/1.8.1/commons-digester-1.8.1.jar
(146 kB at 3.4 MB/s)
[INFO] Downloading from central: https://repo.maven.apache.org/maven2/org/apache/maven/doxia/doxia-decoration-model/1.7.4/doxia-decoration-model-1.7.4.jar
[INFO] Downloaded from central: https://repo.maven.apache.org/maven2/org/apache/maven/doxia/doxia-logging-api/1.7/doxia-logging-api-1.7.jar
(12 kB at 263 kB/s)
[INFO] Downloading from central: https://repo.maven.apache.org/maven2/org/apache/maven/doxia/doxia-skin-model/1.7.4/doxia-skin-model-1.7.4.jar
[INFO] Downloaded from central: https://repo.maven.apache.org/maven2/org/apache/maven/doxia/doxia-sink-api/1.7/doxia-sink-api-1.7.jar
(11 kB at 248 kB/s)
[INFO] Downloading from central: https://repo.maven.apache.org/maven2/org/apache/maven/doxia/doxia-module-xhtml/1.7/doxia-module-xhtml-1.7.jar
[INFO] Downloaded from central: https://repo.maven.apache.org/maven2/org/apache/maven/doxia/doxia-site-renderer/1.7.4/doxia-site-renderer-1.7.4.jar
(64 kB at 1.4 MB/s)
[INFO] Downloading from central: https://repo.maven.apache.org/maven2/org/codehaus/groovy/groovy-all/2.4.8/groovy-all-2.4.8.jar
[INFO] Downloaded from central: https://repo.maven.apache.org/maven2/org/apache/maven/doxia/doxia-skin-model/1.7.4/doxia-skin-model-1.7.4.jar
(16 kB at 308 kB/s)
[INFO] Downloaded from central: https://repo.maven.apache.org/maven2/org/apache/maven/doxia/doxia-decoration-model/1.7.4/doxia-decoration-model-1.7.4.jar
(61 kB at 1.1 MB/s)
[INFO] Downloaded from central: https://repo.maven.apache.org/maven2/org/apache/maven/doxia/doxia-module-xhtml/1.7/doxia-module-xhtml-1.7.jar
(17 kB at 286 kB/s)
[INFO] Downloaded from central: https://repo.maven.apache.org/maven2/org/apache/ant/ant/1.8.1/ant-1.8.1.jar
(1.5 MB at 16 MB/s)
[INFO] Downloaded from central: https://repo.maven.apache.org/maven2/org/codehaus/groovy/groovy-all/2.4.8/groovy-all-2.4.8.jar
(7.0 MB at 33 MB/s)
[INFO] Installing F:\jenkins\jenkins-slave\workspace\maven-box_maven-scm_SCM-917\m\maven-scm-managers\maven-scm-manager-plexus\pom.xml
to F:\jenkins\jenkins-slave\workspace\maven-box_maven-scm_SCM-917\m\maven-scm-plugin\target\local-repo\org\apache\maven\scm\maven-scm-manager-plexus\1.11.2-SNAPSHOT\maven-scm-manager-plexus-1.11.2-SNAPSHOT.pom
[INFO] Installing F:\jenkins\jenkins-slave\workspace\maven-box_maven-scm_SCM-917\m\maven-scm-managers\maven-scm-manager-plexus\target\maven-scm-manager-plexus-1.11.2-SNAPSHOT.jar
to F:\jenkins\jenkins-slave\workspace\maven-box_maven-scm_SCM-917\m\maven-scm-plugin\target\local-repo\org\apache\maven\scm\maven-scm-manager-plexus\1.11.2-SNAPSHOT\maven-scm-manager-plexus-1.11.2-SNAPSHOT.jar
[INFO] Installing F:\jenkins\jenkins-slave\workspace\maven-box_maven-scm_SCM-917\m\maven-scm-managers\pom.xml
to F:\jenkins\jenkins-slave\workspace\maven-box_maven-scm_SCM-917\m\maven-scm-plugin\target\local-repo\org\apache\maven\scm\maven-scm-managers\1.11.2-SNAPSHOT\maven-scm-managers-1.11.2-SNAPSHOT.pom
[INFO] Installing f:\jenkins\jenkins-slave\workspace\maven-box_maven-scm_SCM-917\m\pom.xml
to F:\jenkins\jenkins-slave\workspace\maven-box_maven-scm_SCM-917\m\maven-scm-plugin\target\local-repo\org\apache\maven\scm\maven-scm\1.11.2-SNAPSHOT\maven-scm-1.11.2-SNAPSHOT.pom
[INFO] Installing F:\jenkins\jenkins-slave\workspace\maven-box_maven-scm_SCM-917\m\maven-scm-providers\maven-scm-providers-git\maven-scm-provider-gittest\pom.xml
to F:\jenkins\jenkins-slave\workspace\maven-box_maven-scm_SCM-917\m\maven-scm-plugin\target\local-repo\org\apache\maven\scm\maven-scm-provider-gittest\1.11.2-SNAPSHOT\maven-scm-provider-gittest-1.11.2-SNAPSHOT.pom
[INFO] Installing F:\jenkins\jenkins-slave\workspace\maven-box_maven-scm_SCM-917\m\maven-scm-providers\maven-scm-providers-git\maven-scm-provider-gittest\target\maven-scm-provider-gittest-1.11.2-SNAPSHOT.jar
to F:\jenkins\jenkins-slave\workspace\maven-box_maven-scm_SCM-917\m\maven-scm-plugin\target\local-repo\org\apache\maven\scm\maven-scm-provider-gittest\1.11.2-SNAPSHOT\maven-scm-provider-gittest-1.11.2-SNAPSHOT.jar
[INFO] Installing F:\jenkins\jenkins-slave\workspace\maven-box_maven-scm_SCM-917\m\maven-scm-providers\maven-scm-providers-git\pom.xml
to F:\jenkins\jenkins-slave\workspace\maven-box_maven-scm_SCM-917\m\maven-scm-plugin\target\local-repo\org\apache\maven\scm\maven-scm-providers-git\1.11.2-SNAPSHOT\maven-scm-providers-git-1.11.2-SNAPSHOT.pom
[INFO] Installing F:\jenkins\jenkins-slave\workspace\maven-box_maven-scm_SCM-917\m\maven-scm-providers\pom.xml
to F:\jenkins\jenkins-slave\workspace\maven-box_maven-scm_SCM-917\m\maven-scm-plugin\target\local-repo\org\apache\maven\scm\maven-scm-providers\1.11.2-SNAPSHOT\maven-scm-providers-1.11.2-SNAPSHOT.pom
[INFO] Installing F:\jenkins\jenkins-slave\workspace\maven-box_maven-scm_SCM-917\m\maven-scm-providers\maven-scm-provider-local\pom.xml
to F:\jenkins\jenkins-slave\workspace\maven-box_maven-scm_SCM-917\m\maven-scm-plugin\target\local-repo\org\apache\maven\scm\maven-scm-provider-local\1.11.2-SNAPSHOT\maven-scm-provider-local-1.11.2-SNAPSHOT.pom
[INFO] Installing F:\jenkins\jenkins-slave\workspace\maven-box_maven-scm_SCM-917\m\maven-scm-providers\maven-scm-provider-local\target\maven-scm-provider-local-1.11.2-SNAPSHOT.jar
to F:\jenkins\jenkins-slave\workspace\maven-box_maven-scm_SCM-917\m\maven-scm-plugin\target\local-repo\org\apache\maven\scm\maven-scm-provider-local\1.11.2-SNAPSHOT\maven-scm-provider-local-1.11.2-SNAPSHOT.jar
[INFO] Installing F:\jenkins\jenkins-slave\workspace\maven-box_maven-scm_SCM-917\m\maven-scm-providers\maven-scm-providers-svn\maven-scm-provider-svn-commons\pom.xml
to F:\jenkins\jenkins-slave\workspace\maven-box_maven-scm_SCM-917\m\maven-scm-plugin\target\local-repo\org\apache\maven\scm\maven-scm-provider-svn-commons\1.11.2-SNAPSHOT\maven-scm-provider-svn-commons-1.11.2-SNAPSHOT.pom
[INFO] Installing F:\jenkins\jenkins-slave\workspace\maven-box_maven-scm_SCM-917\m\maven-scm-providers\maven-scm-providers-svn\maven-scm-provider-svn-commons\target\maven-scm-provider-svn-commons-1.11.2-SNAPSHOT.jar
to F:\jenkins\jenkins-slave\workspace\maven-box_maven-scm_SCM-917\m\maven-scm-plugin\target\local-repo\org\apache\maven\scm\maven-scm-provider-svn-commons\1.11.2-SNAPSHOT\maven-scm-provider-svn-commons-1.11.2-SNAPSHOT.jar
[INFO] Installing F:\jenkins\jenkins-slave\workspace\maven-box_maven-scm_SCM-917\m\maven-scm-providers\maven-scm-providers-svn\pom.xml
to F:\jenkins\jenkins-slave\workspace\maven-box_maven-scm_SCM-917\m\maven-scm-plugin\target\local-repo\org\apache\maven\scm\maven-scm-providers-svn\1.11.2-SNAPSHOT\maven-scm-providers-svn-1.11.2-SNAPSHOT.pom
[INFO] Installing F:\jenkins\jenkins-slave\workspace\maven-box_maven-scm_SCM-917\m\maven-scm-providers\maven-scm-providers-svn\maven-scm-provider-svntest\pom.xml
to F:\jenkins\jenkins-slave\workspace\maven-box_maven-scm_SCM-917\m\maven-scm-plugin\target\local-repo\org\apache\maven\scm\maven-scm-provider-svntest\1.11.2-SNAPSHOT\maven-scm-provider-svntest-1.11.2-SNAPSHOT.pom
[INFO] Installing F:\jenkins\jenkins-slave\workspace\maven-box_maven-scm_SCM-917\m\maven-scm-providers\maven-scm-providers-svn\maven-scm-provider-svntest\target\maven-scm-provider-svntest-1.11.2-SNAPSHOT.jar
to F:\jenkins\jenkins-slave\workspace\maven-box_maven-scm_SCM-917\m\maven-scm-plugin\target\local-repo\org\apache\maven\scm\maven-scm-provider-svntest\1.11.2-SNAPSHOT\maven-scm-provider-svntest-1.11.2-SNAPSHOT.jar
[INFO] Installing F:\jenkins\jenkins-slave\workspace\maven-box_maven-scm_SCM-917\m\maven-scm-providers\maven-scm-providers-standard\pom.xml
to F:\jenkins\jenkins-slave\workspace\maven-box_maven-scm_SCM-917\m\maven-scm-plugin\target\local-repo\org\apache\maven\scm\maven-scm-providers-standard\1.11.2-SNAPSHOT\maven-scm-providers-standard-1.11.2-SNAPSHOT.pom
[INFO] Installing F:\jenkins\jenkins-slave\workspace\maven-box_maven-scm_SCM-917\m\maven-scm-plugin\pom.xml
to F:\jenkins\jenkins-slave\workspace\maven-box_maven-scm_SCM-917\m\maven-scm-plugin\target\local-repo\org\apache\maven\plugins\maven-scm-plugin\1.11.2-SNAPSHOT\maven-scm-plugin-1.11.2-SNAPSHOT.pom
[INFO] Installing F:\jenkins\jenkins-slave\workspace\maven-box_maven-scm_SCM-917\m\maven-scm-plugin\target\maven-scm-plugin-1.11.2-SNAPSHOT.jar
to F:\jenkins\jenkins-slave\workspace\maven-box_maven-scm_SCM-917\m\maven-scm-plugin\target\local-repo\org\apache\maven\plugins\maven-scm-plugin\1.11.2-SNAPSHOT\maven-scm-plugin-1.11.2-SNAPSHOT.jar
[INFO] 
[INFO] --- maven-invoker-plugin:3.1.0:run (integration-test) @ maven-scm-plugin ---
[INFO] No projects were selected for execution.
[INFO] 
[INFO] --- maven-checkstyle-plugin:3.0.0:check (checkstyle-check) @ maven-scm-plugin ---
[INFO] ------------------------------------------------------------------------
[INFO] Reactor Summary for Maven SCM 1.11.2-SNAPSHOT:
[INFO] 
[INFO] Maven SCM .......................................... SUCCESS [ 17.899 s]
[INFO] Maven SCM API ...................................... SUCCESS [  9.555 s]
[INFO] Maven SCM Managers ................................. SUCCESS [  1.005 s]
[INFO] Maven SCM Manager for Plexus ....................... SUCCESS [  1.800 s]
[INFO] Maven SCM Test ..................................... SUCCESS [  3.109 s]
[INFO] Maven SCM Providers ................................ SUCCESS [  1.526 s]
[INFO] Maven SCM AccuRev Provider ......................... SUCCESS [  9.468 s]
[INFO] Maven SCM Bazaar Provider .......................... SUCCESS [  3.679 s]
[INFO] Maven SCM Clearcase Provider ....................... SUCCESS [  5.106 s]
[INFO] Maven SCM CVS Provider - Parent .................... SUCCESS [  1.111 s]
[INFO] Maven SCM CVS Provider TCK tests ................... SUCCESS [  1.534 s]
[INFO] Maven SCM CVS Provider - Common library ............ SUCCESS [  2.932 s]
[INFO] Maven SCM CVS Provider - CVS Executable Impl. ...... SUCCESS [  2.547 s]
[INFO] Maven SCM CVS Provider - CVS Java Impl. ............ SUCCESS [  2.707 s]
[INFO] Maven SCM Mercurial (Hg) Provider .................. SUCCESS [  3.302 s]
[INFO] Maven SCM Git Provider - Parent .................... SUCCESS [  0.832 s]
[INFO] Maven SCM Git Provider - Common library ............ SUCCESS [  2.937 s]
[INFO] Maven SCM Git Provider TCK Tests ................... SUCCESS [  1.228 s]
[INFO] Maven SCM Git Provider - Git Executable Impl. ...... SUCCESS [ 10.181 s]
[INFO] Maven SCM Git Provider - JGit Impl. ................ SUCCESS [ 55.141 s]
[INFO] Maven SCM Local Provider ........................... SUCCESS [  3.843 s]
[INFO] Maven SCM Perforce Provider ........................ SUCCESS [  4.530 s]
[INFO] Maven SCM Starteam Provider ........................ SUCCESS [  6.882 s]
[INFO] Maven SCM Subversion Provider - Parent ............. SUCCESS [  1.338 s]
[INFO] Maven SCM Subversion Provider - Common library ..... SUCCESS [  4.112 s]
[INFO] Maven SCM Subversion Provider TCK Tests ............ SUCCESS [  1.824 s]
[INFO] Maven SCM Subversion Provider - SVN Executable Impl. SUCCESS [  7.097 s]
[INFO] Maven SCM Synergy Provider ......................... SUCCESS [  3.918 s]
[INFO] Maven SCM Visual Source Safe Provider .............. SUCCESS [  2.941 s]
[INFO] Maven SCM TFS Provider ............................. SUCCESS [  3.240 s]
[INFO] Maven SCM MKS Integrity Provider ................... SUCCESS [  3.617 s]
[INFO] Maven SCM Jazz/Rational Team Concert Provider ...... SUCCESS [  4.106 s]
[INFO] Maven SCM Standard Providers ....................... SUCCESS [  2.086 s]
[INFO] Maven SCM Client ................................... SUCCESS [  4.384 s]
[INFO] Maven SCM Plugin ................................... SUCCESS [ 28.120 s]
[INFO] ------------------------------------------------------------------------
[INFO] BUILD SUCCESS
[INFO] ------------------------------------------------------------------------
[INFO] Total time:  03:42 min
[INFO] Finished at: 2019-06-02T19:21:08Z
[INFO] ------------------------------------------------------------------------
[WARNING] The requested profile "run-its" could not be activated because it does not exist.
[INFO] [jenkins-event-spy] Generated F:\jenkins\jenkins-slave\workspace\maven-box_maven-scm_SCM-917@tmp\withMavena7a83557\maven-spy-20190602-191725-4249161622878315717389.log
[Pipeline] }
[Pipeline] // dir
[Pipeline] }
[withMaven] invokerPublisher - Archive invoker results for Maven artifact MavenArtifact{org.apache.maven.plugins:maven-scm-plugin:maven-plugin:1.11.2-SNAPSHOT(version:
1.11.2-SNAPSHOT, snapshot:false) } generated by PluginInvocation{org.apache.maven.plugins:maven-invoker-plugin:3.1.0@run
 integration-test}: m\maven-scm-plugin\target\invoker-reports\*.xml
[withMaven] junitPublisher - Archive test results for Maven artifact org.apache.maven.scm:maven-scm-api:jar:1.11.2-SNAPSHOT
generated by maven-surefire-plugin:test (default-test): m\maven-scm-api\target\surefire-reports\*.xml
[withMaven] junitPublisher - Archive test results for Maven artifact org.apache.maven.scm:maven-scm-manager-plexus:jar:1.11.2-SNAPSHOT
generated by maven-surefire-plugin:test (default-test): m\maven-scm-managers\maven-scm-manager-plexus\target\surefire-reports\*.xml
[withMaven] junitPublisher - Archive test results for Maven artifact org.apache.maven.scm:maven-scm-test:jar:1.11.2-SNAPSHOT
generated by maven-surefire-plugin:test (default-test): m\maven-scm-test\target\surefire-reports\*.xml
[withMaven] junitPublisher - Archive test results for Maven artifact org.apache.maven.scm:maven-scm-provider-accurev:jar:1.11.2-SNAPSHOT
generated by maven-surefire-plugin:test (default-test): m\maven-scm-providers\maven-scm-provider-accurev\target\surefire-reports\*.xml
[withMaven] junitPublisher - Archive test results for Maven artifact org.apache.maven.scm:maven-scm-provider-bazaar:jar:1.11.2-SNAPSHOT
generated by maven-surefire-plugin:test (default-test): m\maven-scm-providers\maven-scm-provider-bazaar\target\surefire-reports\*.xml
[withMaven] junitPublisher - Archive test results for Maven artifact org.apache.maven.scm:maven-scm-provider-clearcase:jar:1.11.2-SNAPSHOT
generated by maven-surefire-plugin:test (default-test): m\maven-scm-providers\maven-scm-provider-clearcase\target\surefire-reports\*.xml
[withMaven] junitPublisher - Archive test results for Maven artifact org.apache.maven.scm:maven-scm-provider-cvstest:jar:1.11.2-SNAPSHOT
generated by maven-surefire-plugin:test (default-test): m\maven-scm-providers\maven-scm-providers-cvs\maven-scm-provider-cvstest\target\surefire-reports\*.xml
[withMaven] junitPublisher - Archive test results for Maven artifact org.apache.maven.scm:maven-scm-provider-cvs-commons:jar:1.11.2-SNAPSHOT
generated by maven-surefire-plugin:test (default-test): m\maven-scm-providers\maven-scm-providers-cvs\maven-scm-provider-cvs-commons\target\surefire-reports\*.xml
[withMaven] junitPublisher - Archive test results for Maven artifact org.apache.maven.scm:maven-scm-provider-cvsexe:jar:1.11.2-SNAPSHOT
generated by maven-surefire-plugin:test (default-test): m\maven-scm-providers\maven-scm-providers-cvs\maven-scm-provider-cvsexe\target\surefire-reports\*.xml
[withMaven] junitPublisher - Archive test results for Maven artifact org.apache.maven.scm:maven-scm-provider-cvsjava:jar:1.11.2-SNAPSHOT
generated by maven-surefire-plugin:test (default-test): m\maven-scm-providers\maven-scm-providers-cvs\maven-scm-provider-cvsjava\target\surefire-reports\*.xml
[withMaven] junitPublisher - Archive test results for Maven artifact org.apache.maven.scm:maven-scm-provider-hg:jar:1.11.2-SNAPSHOT
generated by maven-surefire-plugin:test (default-test): m\maven-scm-providers\maven-scm-provider-hg\target\surefire-reports\*.xml
[withMaven] junitPublisher - Archive test results for Maven artifact org.apache.maven.scm:maven-scm-provider-git-commons:jar:1.11.2-SNAPSHOT
generated by maven-surefire-plugin:test (default-test): m\maven-scm-providers\maven-scm-providers-git\maven-scm-provider-git-commons\target\surefire-reports\*.xml
[withMaven] junitPublisher - Archive test results for Maven artifact org.apache.maven.scm:maven-scm-provider-gittest:jar:1.11.2-SNAPSHOT
generated by maven-surefire-plugin:test (default-test): m\maven-scm-providers\maven-scm-providers-git\maven-scm-provider-gittest\target\surefire-reports\*.xml
[withMaven] junitPublisher - Archive test results for Maven artifact org.apache.maven.scm:maven-scm-provider-gitexe:jar:1.11.2-SNAPSHOT
generated by maven-surefire-plugin:test (default-test): m\maven-scm-providers\maven-scm-providers-git\maven-scm-provider-gitexe\target\surefire-reports\*.xml
[withMaven] junitPublisher - Archive test results for Maven artifact org.apache.maven.scm:maven-scm-provider-jgit:jar:1.11.2-SNAPSHOT
generated by maven-surefire-plugin:test (default-test): m\maven-scm-providers\maven-scm-providers-git\maven-scm-provider-jgit\target\surefire-reports\*.xml
[withMaven] junitPublisher - Archive test results for Maven artifact org.apache.maven.scm:maven-scm-provider-local:jar:1.11.2-SNAPSHOT
generated by maven-surefire-plugin:test (default-test): m\maven-scm-providers\maven-scm-provider-local\target\surefire-reports\*.xml
[withMaven] junitPublisher - Archive test results for Maven artifact org.apache.maven.scm:maven-scm-provider-perforce:jar:1.11.2-SNAPSHOT
generated by maven-surefire-plugin:test (default-test): m\maven-scm-providers\maven-scm-provider-perforce\target\surefire-reports\*.xml
[withMaven] junitPublisher - Archive test results for Maven artifact org.apache.maven.scm:maven-scm-provider-starteam:jar:1.11.2-SNAPSHOT
generated by maven-surefire-plugin:test (default-test): m\maven-scm-providers\maven-scm-provider-starteam\target\surefire-reports\*.xml
[withMaven] junitPublisher - Archive test results for Maven artifact org.apache.maven.scm:maven-scm-provider-svn-commons:jar:1.11.2-SNAPSHOT
generated by maven-surefire-plugin:test (default-test): m\maven-scm-providers\maven-scm-providers-svn\maven-scm-provider-svn-commons\target\surefire-reports\*.xml
[withMaven] junitPublisher - Archive test results for Maven artifact org.apache.maven.scm:maven-scm-provider-svntest:jar:1.11.2-SNAPSHOT
generated by maven-surefire-plugin:test (default-test): m\maven-scm-providers\maven-scm-providers-svn\maven-scm-provider-svntest\target\surefire-reports\*.xml
[withMaven] junitPublisher - Archive test results for Maven artifact org.apache.maven.scm:maven-scm-provider-svnexe:jar:1.11.2-SNAPSHOT
generated by maven-surefire-plugin:test (default-test): m\maven-scm-providers\maven-scm-providers-svn\maven-scm-provider-svnexe\target\surefire-reports\*.xml
[withMaven] junitPublisher - Archive test results for Maven artifact org.apache.maven.scm:maven-scm-provider-synergy:jar:1.11.2-SNAPSHOT
generated by maven-surefire-plugin:test (default-test): m\maven-scm-providers\maven-scm-provider-synergy\target\surefire-reports\*.xml
[withMaven] junitPublisher - Archive test results for Maven artifact org.apache.maven.scm:maven-scm-provider-vss:jar:1.11.2-SNAPSHOT
generated by maven-surefire-plugin:test (default-test): m\maven-scm-providers\maven-scm-provider-vss\target\surefire-reports\*.xml
[withMaven] junitPublisher - Archive test results for Maven artifact org.apache.maven.scm:maven-scm-provider-tfs:jar:1.11.2-SNAPSHOT
generated by maven-surefire-plugin:test (default-test): m\maven-scm-providers\maven-scm-provider-tfs\target\surefire-reports\*.xml
[withMaven] junitPublisher - Archive test results for Maven artifact org.apache.maven.scm:maven-scm-provider-integrity:jar:1.11.2-SNAPSHOT
generated by maven-surefire-plugin:test (default-test): m\maven-scm-providers\maven-scm-provider-integrity\target\surefire-reports\*.xml
[withMaven] junitPublisher - Archive test results for Maven artifact org.apache.maven.scm:maven-scm-provider-jazz:jar:1.11.2-SNAPSHOT
generated by maven-surefire-plugin:test (default-test): m\maven-scm-providers\maven-scm-provider-jazz\target\surefire-reports\*.xml
[withMaven] junitPublisher - Archive test results for Maven artifact org.apache.maven.scm:maven-scm-client:jar:1.11.2-SNAPSHOT
generated by maven-surefire-plugin:test (default-test): m\maven-scm-client\target\surefire-reports\*.xml
[withMaven] junitPublisher - Archive test results for Maven artifact org.apache.maven.plugins:maven-scm-plugin:maven-plugin:1.11.2-SNAPSHOT
generated by maven-surefire-plugin:test (default-test): m\maven-scm-plugin\target\surefire-reports\*.xml
Recording test results
[withMaven] Publishers: Pipeline Graph Publisher: 24 ms, Invoker Publisher: 386 ms, Junit
Publisher: 11903 ms, Concordion Publisher: 1 ms, Dependencies Fingerprint Publisher: 2296
ms, JGiven Publisher: 1 ms, Jacoco Publisher: 1 ms, SpotBugs Publisher: 1 ms
[Pipeline] // withMaven
[Pipeline] cleanWs
[WS-CLEANUP] Deleting project workspace...
[WS-CLEANUP] Deferred wipeout is used...
[WS-CLEANUP] done
[Pipeline] }
[Pipeline] // stage
[Pipeline] }
[Pipeline] // node
[Pipeline] }
[Pipeline] // parallel
[Pipeline] echo
[FAILURE-003] AbortException hudson.AbortException: script returned exit code 1
[Pipeline] stage
[Pipeline] { (Notifications)
[Pipeline] echo
Build result: FAILURE
[Pipeline] jiraIssueSelector
[Pipeline] jiraComment
[Pipeline] emailext
Mime
  • Unnamed multipart/mixed (inline, None, 0 bytes)
View raw message