maven-notifications mailing list archives

Site index · List index
Message view « Date » · « Thread »
Top « Date » · « Thread »
From Apache Jenkins Server <jenk...@builds.apache.org>
Subject Build failed in Jenkins: Maven TLP » maven-archetype » ARCHETYPE-567 #5
Date Sun, 02 Jun 2019 10:40:27 GMT
See https://builds.apache.org/job/maven-box/job/maven-archetype/job/ARCHETYPE-567/5/

No changes.

All tests passed

Build log:
[...truncated 15703 lines...]
[INFO] Maven Archetype Catalog Model ...................... SUCCESS [  5.598 s]
[INFO] Maven Archetype Descriptor Model ................... SUCCESS [  2.360 s]
[INFO] Maven Archetype Common ............................. SUCCESS [ 28.845 s]
[INFO] Maven Archetype Packaging .......................... SUCCESS [  1.375 s]
[INFO] Maven Archetype Plugin ............................. FAILURE [06:36 min]
[INFO] ------------------------------------------------------------------------
[INFO] BUILD FAILURE
[INFO] ------------------------------------------------------------------------
[INFO] Total time:  07:26 min
[INFO] Finished at: 2019-06-02T10:39:16Z
[INFO] ------------------------------------------------------------------------
[INFO] [jenkins-event-spy] Generated F:\short\jenkins-maven-box-maven-archetype-ARCHETYPE-567-5@2@tmp\withMavena2a60e53\maven-spy-20190602-103149-80313732759358546338262.log
[ERROR] Failed to execute goal org.apache.maven.plugins:maven-invoker-plugin:3.1.0:run (integration-test)
on project maven-archetype-plugin: 1 build failed. See console output above for details. ->
[Help 1]
org.apache.maven.lifecycle.LifecycleExecutionException: Failed to execute goal org.apache.maven.plugins:maven-invoker-plugin:3.1.0:run
(integration-test) on project maven-archetype-plugin: 1 build failed. See console output above
for details.
    at org.apache.maven.lifecycle.internal.MojoExecutor.execute (MojoExecutor.java:215)
    at org.apache.maven.lifecycle.internal.MojoExecutor.execute (MojoExecutor.java:156)
    at org.apache.maven.lifecycle.internal.MojoExecutor.execute (MojoExecutor.java:148)
    at org.apache.maven.lifecycle.internal.LifecycleModuleBuilder.buildProject (LifecycleModuleBuilder.java:117)
    at org.apache.maven.lifecycle.internal.LifecycleModuleBuilder.buildProject (LifecycleModuleBuilder.java:81)
    at org.apache.maven.lifecycle.internal.builder.singlethreaded.SingleThreadedBuilder.build
(SingleThreadedBuilder.java:56)
    at org.apache.maven.lifecycle.internal.LifecycleStarter.execute (LifecycleStarter.java:128)
    at org.apache.maven.DefaultMaven.doExecute (DefaultMaven.java:305)
    at org.apache.maven.DefaultMaven.doExecute (DefaultMaven.java:192)
    at org.apache.maven.DefaultMaven.execute (DefaultMaven.java:105)
    at org.apache.maven.cli.MavenCli.execute (MavenCli.java:956)
    at org.apache.maven.cli.MavenCli.doMain (MavenCli.java:288)
    at org.apache.maven.cli.MavenCli.main (MavenCli.java:192)
    at jdk.internal.reflect.NativeMethodAccessorImpl.invoke0 (Native Method)
    at jdk.internal.reflect.NativeMethodAccessorImpl.invoke (NativeMethodAccessorImpl.java:62)
    at jdk.internal.reflect.DelegatingMethodAccessorImpl.invoke (DelegatingMethodAccessorImpl.java:43)
    at java.lang.reflect.Method.invoke (Method.java:566)
    at org.codehaus.plexus.classworlds.launcher.Launcher.launchEnhanced (Launcher.java:289)
    at org.codehaus.plexus.classworlds.launcher.Launcher.launch (Launcher.java:229)
    at org.codehaus.plexus.classworlds.launcher.Launcher.mainWithExitCode (Launcher.java:415)
    at org.codehaus.plexus.classworlds.launcher.Launcher.main (Launcher.java:356)
Caused by: org.apache.maven.plugin.MojoFailureException: 1 build failed. See console output
above for details.
    at org.apache.maven.plugins.invoker.InvokerSession.handleFailures (InvokerSession.java:260)
    at org.apache.maven.plugins.invoker.InvokerMojo.processResults (InvokerMojo.java:68)
    at org.apache.maven.plugins.invoker.AbstractInvokerMojo.execute (AbstractInvokerMojo.java:738)
    at org.apache.maven.plugin.DefaultBuildPluginManager.executeMojo (DefaultBuildPluginManager.java:137)
    at org.apache.maven.lifecycle.internal.MojoExecutor.execute (MojoExecutor.java:210)
    at org.apache.maven.lifecycle.internal.MojoExecutor.execute (MojoExecutor.java:156)
    at org.apache.maven.lifecycle.internal.MojoExecutor.execute (MojoExecutor.java:148)
    at org.apache.maven.lifecycle.internal.LifecycleModuleBuilder.buildProject (LifecycleModuleBuilder.java:117)
    at org.apache.maven.lifecycle.internal.LifecycleModuleBuilder.buildProject (LifecycleModuleBuilder.java:81)
    at org.apache.maven.lifecycle.internal.builder.singlethreaded.SingleThreadedBuilder.build
(SingleThreadedBuilder.java:56)
    at org.apache.maven.lifecycle.internal.LifecycleStarter.execute (LifecycleStarter.java:128)
    at org.apache.maven.DefaultMaven.doExecute (DefaultMaven.java:305)
    at org.apache.maven.DefaultMaven.doExecute (DefaultMaven.java:192)
    at org.apache.maven.DefaultMaven.execute (DefaultMaven.java:105)
    at org.apache.maven.cli.MavenCli.execute (MavenCli.java:956)
    at org.apache.maven.cli.MavenCli.doMain (MavenCli.java:288)
    at org.apache.maven.cli.MavenCli.main (MavenCli.java:192)
    at jdk.internal.reflect.NativeMethodAccessorImpl.invoke0 (Native Method)
    at jdk.internal.reflect.NativeMethodAccessorImpl.invoke (NativeMethodAccessorImpl.java:62)
    at jdk.internal.reflect.DelegatingMethodAccessorImpl.invoke (DelegatingMethodAccessorImpl.java:43)
    at java.lang.reflect.Method.invoke (Method.java:566)
    at org.codehaus.plexus.classworlds.launcher.Launcher.launchEnhanced (Launcher.java:289)
    at org.codehaus.plexus.classworlds.launcher.Launcher.launch (Launcher.java:229)
    at org.codehaus.plexus.classworlds.launcher.Launcher.mainWithExitCode (Launcher.java:415)
    at org.codehaus.plexus.classworlds.launcher.Launcher.main (Launcher.java:356)
[ERROR] 
[ERROR] Re-run Maven using the -X switch to enable full debug logging.
[ERROR] 
[ERROR] For more information about the errors and possible solutions, please read the following
articles:
[ERROR] [Help 1] http://cwiki.apache.org/confluence/display/MAVEN/MojoFailureException
[ERROR] 
[ERROR] After correcting the problems, you can resume the build with the command
[ERROR]   mvn <goals> -rf :maven-archetype-plugin
[Pipeline] }
[Pipeline] // dir
[Pipeline] }
[withMaven] artifactsPublisher - Archive artifact j11m3.6.xb\pom.xml under org\apache\maven\archetype\maven-archetype\3.1.1-SNAPSHOT\maven-archetype-3.1.1-SNAPSHOT.pom
[withMaven] artifactsPublisher - Archive artifact j11m3.6.xb\target\maven-archetype-3.1.1-SNAPSHOT-site.xml
under org\apache\maven\archetype\maven-archetype\3.1.1-SNAPSHOT\maven-archetype-3.1.1-SNAPSHOT-site.xml
[withMaven] artifactsPublisher - Archive artifact j11m3.6.xb\archetype-models\pom.xml under
org\apache\maven\archetype\archetype-models\3.1.1-SNAPSHOT\archetype-models-3.1.1-SNAPSHOT.pom
[withMaven] artifactsPublisher - Archive artifact j11m3.6.xb\archetype-models\target\archetype-models-3.1.1-SNAPSHOT-site.xml
under org\apache\maven\archetype\archetype-models\3.1.1-SNAPSHOT\archetype-models-3.1.1-SNAPSHOT-site.xml
[withMaven] artifactsPublisher - Archive artifact j11m3.6.xb\archetype-models\archetype-catalog\pom.xml
under org\apache\maven\archetype\archetype-catalog\3.1.1-SNAPSHOT\archetype-catalog-3.1.1-SNAPSHOT.pom
[withMaven] artifactsPublisher - Archive artifact j11m3.6.xb\archetype-models\archetype-catalog\target\archetype-catalog-3.1.1-SNAPSHOT.jar
under org\apache\maven\archetype\archetype-catalog\3.1.1-SNAPSHOT\archetype-catalog-3.1.1-SNAPSHOT.jar
[withMaven] artifactsPublisher - Archive artifact j11m3.6.xb\archetype-models\archetype-descriptor\pom.xml
under org\apache\maven\archetype\archetype-descriptor\3.1.1-SNAPSHOT\archetype-descriptor-3.1.1-SNAPSHOT.pom
[withMaven] artifactsPublisher - Archive artifact j11m3.6.xb\archetype-models\archetype-descriptor\target\archetype-descriptor-3.1.1-SNAPSHOT.jar
under org\apache\maven\archetype\archetype-descriptor\3.1.1-SNAPSHOT\archetype-descriptor-3.1.1-SNAPSHOT.jar
[withMaven] artifactsPublisher - Archive artifact j11m3.6.xb\archetype-common\pom.xml under
org\apache\maven\archetype\archetype-common\3.1.1-SNAPSHOT\archetype-common-3.1.1-SNAPSHOT.pom
[withMaven] artifactsPublisher - Archive artifact j11m3.6.xb\archetype-common\target\archetype-common-3.1.1-SNAPSHOT.jar
under org\apache\maven\archetype\archetype-common\3.1.1-SNAPSHOT\archetype-common-3.1.1-SNAPSHOT.jar
[withMaven] artifactsPublisher - Archive artifact j11m3.6.xb\archetype-packaging\pom.xml under
org\apache\maven\archetype\archetype-packaging\3.1.1-SNAPSHOT\archetype-packaging-3.1.1-SNAPSHOT.pom
[withMaven] artifactsPublisher - Archive artifact j11m3.6.xb\archetype-packaging\target\archetype-packaging-3.1.1-SNAPSHOT.jar
under org\apache\maven\archetype\archetype-packaging\3.1.1-SNAPSHOT\archetype-packaging-3.1.1-SNAPSHOT.jar
[Fast Archiver] No prior successful build to compare, so performing full copy of artifacts
[withMaven] junitPublisher - Archive test results for Maven artifact org.apache.maven.archetype:archetype-catalog:jar:3.1.1-SNAPSHOT
generated by maven-surefire-plugin:test (default-test): j11m3.6.xb\archetype-models\archetype-catalog\target\surefire-reports\*.xml
Recording test results
None of the test reports contained any result
[withMaven] junitPublisher - Archive test results for Maven artifact org.apache.maven.archetype:archetype-descriptor:jar:3.1.1-SNAPSHOT
generated by maven-surefire-plugin:test (default-test): j11m3.6.xb\archetype-models\archetype-descriptor\target\surefire-reports\*.xml
Recording test results
None of the test reports contained any result
[withMaven] junitPublisher - Archive test results for Maven artifact org.apache.maven.archetype:archetype-common:jar:3.1.1-SNAPSHOT
generated by maven-surefire-plugin:test (default-test): j11m3.6.xb\archetype-common\target\surefire-reports\*.xml
Recording test results
[withMaven] junitPublisher - Archive test results for Maven artifact org.apache.maven.archetype:archetype-packaging:jar:3.1.1-SNAPSHOT
generated by maven-surefire-plugin:test (default-test): j11m3.6.xb\archetype-packaging\target\surefire-reports\*.xml
Recording test results
None of the test reports contained any result
[withMaven] junitPublisher - Archive test results for Maven artifact org.apache.maven.plugins:maven-archetype-plugin:maven-plugin:3.1.1-SNAPSHOT
generated by maven-surefire-plugin:test (default-test): j11m3.6.xb\maven-archetype-plugin\target\surefire-reports\*.xml
Recording test results
[withMaven] openTasksPublisher - Scan Tasks for Maven artifact org.apache.maven.archetype:archetype-common:jar:3.1.1-SNAPSHOT
in source directory j11m3.6.xb\archetype-common\src\main\java
[withMaven] openTasksPublisher - Scan Tasks for Maven artifact org.apache.maven.plugins:maven-archetype-plugin:maven-plugin:3.1.1-SNAPSHOT
in source directory j11m3.6.xb\maven-archetype-plugin\src\main\java
[TASKS] Scanning folder 'F:\short\jenkins-maven-box-maven-archetype-ARCHETYPE-567-5@2' for
files matching the pattern 'j11m3.6.xb\archetype-common\src\main\java\**\*,j11m3.6.xb\maven-archetype-plugin\src\main\java\**\*'
- excludes: null
[TASKS] Found 88 files to scan for tasks
[TASKS] Found 27 open tasks.
Skipping warnings blame since pipelines do not have an SCM link.%n
[withMaven] invokerPublisher - Archive invoker results for Maven artifact MavenArtifact{org.apache.maven.plugins:maven-archetype-plugin:maven-plugin:3.1.1-SNAPSHOT(version:
3.1.1-SNAPSHOT, snapshot:false) } generated by PluginInvocation{org.apache.maven.plugins:maven-invoker-plugin:3.1.0@run
 integration-test}: j11m3.6.xb\maven-archetype-plugin\target\invoker-reports\*.xml
[withMaven] Publishers: Generated Artifacts Publisher: 669 ms, Junit Publisher: 1666 ms, Open
Task Scanner Publisher: 715 ms, Dependencies Fingerprint Publisher: 181 ms, Invoker Publisher:
23197 ms, Pipeline Graph Publisher: 5 ms
[Pipeline] // withMaven
[Pipeline] cleanWs
[WS-CLEANUP] Deleting project workspace...
[WS-CLEANUP] Deferred wipeout is used...
[WS-CLEANUP] done
[Pipeline] }
[Pipeline] // stage
[Pipeline] }
[Pipeline] // ws
[Pipeline] }
[Pipeline] // node
[Pipeline] }
[withMaven] Publishers: Generated Artifacts Publisher: 906 ms, Junit Publisher: 1421 ms, Open
Task Scanner Publisher: 693 ms, Dependencies Fingerprint Publisher: 199 ms, Invoker Publisher:
23657 ms, Pipeline Graph Publisher: 4 ms
[Pipeline] // withMaven
[Pipeline] cleanWs
[WS-CLEANUP] Deleting project workspace...
[WS-CLEANUP] Deferred wipeout is used...
[WS-CLEANUP] done
[Pipeline] }
[Pipeline] // stage
[Pipeline] }
[Pipeline] // ws
[Pipeline] }
[Pipeline] // node
[Pipeline] }
[INFO] run post-build script verify.groovy
[INFO]           roundtrip-1-project .............................. SUCCESS (27.5 s)
[INFO] Building: roundtrip-multi\pom.xml
[withMaven] Publishers: Generated Artifacts Publisher: 628 ms, Junit Publisher: 1630 ms, Open
Task Scanner Publisher: 569 ms, Dependencies Fingerprint Publisher: 211 ms, Invoker Publisher:
18360 ms, Pipeline Graph Publisher: 4 ms
[Pipeline] // withMaven
[Pipeline] cleanWs
[WS-CLEANUP] Deleting project workspace...
[WS-CLEANUP] Deferred wipeout is used...
[WS-CLEANUP] done
[Pipeline] cleanWs
[WS-CLEANUP] Deleting project workspace...
[WS-CLEANUP] Deferred wipeout is used...
[WS-CLEANUP] done
[Pipeline] }
[Pipeline] // stage
[Pipeline] }
[Pipeline] // ws
[Pipeline] }
[Pipeline] // node
[Pipeline] }
Failed in branch windows-jdk11-m3.6.x_build
[INFO] run post-build script verify.groovy
[INFO]           roundtrip-multi\pom.xml .......................... SUCCESS (25.1 s)
[INFO] -------------------------------------------------
[INFO] Build Summary:
[INFO]   Passed: 25, Failed: 0, Errors: 0, Skipped: 0
[INFO] -------------------------------------------------
[INFO] 
[INFO] --- mrm-maven-plugin:1.1.0:stop (mirror) @ maven-archetype-plugin ---
[INFO] Stopping Mock Repository Manager on http://localhost:58572
[INFO] Stopped SocketConnector@0.0.0.0:58572
[INFO] Mock Repository Manager http://localhost:58572 is stopped.
[INFO] 
[INFO] --- mrm-maven-plugin:1.1.0:stop (archetype-repository) @ maven-archetype-plugin ---
[INFO] Stopping Mock Repository Manager on http://localhost:58573
[INFO] Stopped SocketConnector@0.0.0.0:58573
[INFO] Mock Repository Manager http://localhost:58573 is stopped.
[INFO] 
[INFO] --- maven-checkstyle-plugin:3.0.0:check (checkstyle-check) @ maven-archetype-plugin
---
[INFO] There are 46 errors reported by Checkstyle 6.18 with config/maven_checks.xml ruleset.
[INFO] Ignored 46 errors, 0 violation remaining.
[INFO] ------------------------------------------------------------------------
[INFO] Reactor Summary:
[INFO] 
[INFO] Maven Archetype .................................... SUCCESS [  9.949 s]
[INFO] Maven Archetype Models ............................. SUCCESS [  1.235 s]
[INFO] Maven Archetype Catalog Model ...................... SUCCESS [  5.206 s]
[INFO] Maven Archetype Descriptor Model ................... SUCCESS [  2.201 s]
[INFO] Maven Archetype Common ............................. SUCCESS [ 26.722 s]
[INFO] Maven Archetype Packaging .......................... SUCCESS [  1.053 s]
[INFO] Maven Archetype Plugin ............................. SUCCESS [07:28 min]
[INFO] ------------------------------------------------------------------------
[INFO] BUILD SUCCESS
[INFO] ------------------------------------------------------------------------
[INFO] Total time: 08:14 min
[INFO] Finished at: 2019-06-02T10:40:03Z
[INFO] Final Memory: 65M/1069M
[INFO] ------------------------------------------------------------------------
[INFO] [jenkins-event-spy] Generated F:\short\jenkins-maven-box-maven-archetype-ARCHETYPE-567-5@tmp\withMavend9e5b25a\maven-spy-20190602-103148-308254218452030018690.log
Picked up JAVA_TOOL_OPTIONS: -Dmaven.ext.class.path="F:\short\jenkins-maven-box-maven-archetype-ARCHETYPE-567-5@tmp\withMavend9e5b25a\pipeline-maven-spy.jar"
-Dorg.jenkinsci.plugins.pipeline.maven.reportsFolder="F:\short\jenkins-maven-box-maven-archetype-ARCHETYPE-567-5@tmp\withMavend9e5b25a"

[Pipeline] }
[Pipeline] // dir
[Pipeline] }
[withMaven] artifactsPublisher - Archive artifact j8m3.5.xb\pom.xml under org\apache\maven\archetype\maven-archetype\3.1.1-SNAPSHOT\maven-archetype-3.1.1-SNAPSHOT.pom
[withMaven] artifactsPublisher - Archive artifact j8m3.5.xb\target\maven-archetype-3.1.1-SNAPSHOT-site.xml
under org\apache\maven\archetype\maven-archetype\3.1.1-SNAPSHOT\maven-archetype-3.1.1-SNAPSHOT-site.xml
[withMaven] artifactsPublisher - Archive artifact j8m3.5.xb\archetype-models\pom.xml under
org\apache\maven\archetype\archetype-models\3.1.1-SNAPSHOT\archetype-models-3.1.1-SNAPSHOT.pom
[withMaven] artifactsPublisher - Archive artifact j8m3.5.xb\archetype-models\target\archetype-models-3.1.1-SNAPSHOT-site.xml
under org\apache\maven\archetype\archetype-models\3.1.1-SNAPSHOT\archetype-models-3.1.1-SNAPSHOT-site.xml
[withMaven] artifactsPublisher - Archive artifact j8m3.5.xb\archetype-models\archetype-catalog\pom.xml
under org\apache\maven\archetype\archetype-catalog\3.1.1-SNAPSHOT\archetype-catalog-3.1.1-SNAPSHOT.pom
[withMaven] artifactsPublisher - Archive artifact j8m3.5.xb\archetype-models\archetype-catalog\target\archetype-catalog-3.1.1-SNAPSHOT.jar
under org\apache\maven\archetype\archetype-catalog\3.1.1-SNAPSHOT\archetype-catalog-3.1.1-SNAPSHOT.jar
[withMaven] artifactsPublisher - Archive artifact j8m3.5.xb\archetype-models\archetype-descriptor\pom.xml
under org\apache\maven\archetype\archetype-descriptor\3.1.1-SNAPSHOT\archetype-descriptor-3.1.1-SNAPSHOT.pom
[withMaven] artifactsPublisher - Archive artifact j8m3.5.xb\archetype-models\archetype-descriptor\target\archetype-descriptor-3.1.1-SNAPSHOT.jar
under org\apache\maven\archetype\archetype-descriptor\3.1.1-SNAPSHOT\archetype-descriptor-3.1.1-SNAPSHOT.jar
[withMaven] artifactsPublisher - Archive artifact j8m3.5.xb\archetype-common\pom.xml under
org\apache\maven\archetype\archetype-common\3.1.1-SNAPSHOT\archetype-common-3.1.1-SNAPSHOT.pom
[withMaven] artifactsPublisher - Archive artifact j8m3.5.xb\archetype-common\target\archetype-common-3.1.1-SNAPSHOT.jar
under org\apache\maven\archetype\archetype-common\3.1.1-SNAPSHOT\archetype-common-3.1.1-SNAPSHOT.jar
[withMaven] artifactsPublisher - Archive artifact j8m3.5.xb\archetype-packaging\pom.xml under
org\apache\maven\archetype\archetype-packaging\3.1.1-SNAPSHOT\archetype-packaging-3.1.1-SNAPSHOT.pom
[withMaven] artifactsPublisher - Archive artifact j8m3.5.xb\archetype-packaging\target\archetype-packaging-3.1.1-SNAPSHOT.jar
under org\apache\maven\archetype\archetype-packaging\3.1.1-SNAPSHOT\archetype-packaging-3.1.1-SNAPSHOT.jar
[withMaven] artifactsPublisher - Archive artifact j8m3.5.xb\maven-archetype-plugin\pom.xml
under org\apache\maven\plugins\maven-archetype-plugin\3.1.1-SNAPSHOT\maven-archetype-plugin-3.1.1-SNAPSHOT.pom
[withMaven] artifactsPublisher - Archive artifact j8m3.5.xb\maven-archetype-plugin\target\maven-archetype-plugin-3.1.1-SNAPSHOT.jar
under org\apache\maven\plugins\maven-archetype-plugin\3.1.1-SNAPSHOT\maven-archetype-plugin-3.1.1-SNAPSHOT.jar
[Fast Archiver] No prior successful build to compare, so performing full copy of artifacts
[withMaven] junitPublisher - Archive test results for Maven artifact org.apache.maven.archetype:archetype-catalog:jar:3.1.1-SNAPSHOT
generated by maven-surefire-plugin:test (default-test): j8m3.5.xb\archetype-models\archetype-catalog\target\surefire-reports\*.xml
Recording test results
None of the test reports contained any result
[withMaven] junitPublisher - Archive test results for Maven artifact org.apache.maven.archetype:archetype-descriptor:jar:3.1.1-SNAPSHOT
generated by maven-surefire-plugin:test (default-test): j8m3.5.xb\archetype-models\archetype-descriptor\target\surefire-reports\*.xml
Recording test results
None of the test reports contained any result
[withMaven] junitPublisher - Archive test results for Maven artifact org.apache.maven.archetype:archetype-common:jar:3.1.1-SNAPSHOT
generated by maven-surefire-plugin:test (default-test): j8m3.5.xb\archetype-common\target\surefire-reports\*.xml
Recording test results
[withMaven] junitPublisher - Archive test results for Maven artifact org.apache.maven.archetype:archetype-packaging:jar:3.1.1-SNAPSHOT
generated by maven-surefire-plugin:test (default-test): j8m3.5.xb\archetype-packaging\target\surefire-reports\*.xml
Recording test results
None of the test reports contained any result
[withMaven] junitPublisher - Archive test results for Maven artifact org.apache.maven.plugins:maven-archetype-plugin:maven-plugin:3.1.1-SNAPSHOT
generated by maven-surefire-plugin:test (default-test): j8m3.5.xb\maven-archetype-plugin\target\surefire-reports\*.xml
Recording test results
[withMaven] openTasksPublisher - Scan Tasks for Maven artifact org.apache.maven.archetype:archetype-common:jar:3.1.1-SNAPSHOT
in source directory j8m3.5.xb\archetype-common\src\main\java
[withMaven] openTasksPublisher - Scan Tasks for Maven artifact org.apache.maven.plugins:maven-archetype-plugin:maven-plugin:3.1.1-SNAPSHOT
in source directory j8m3.5.xb\maven-archetype-plugin\src\main\java
[TASKS] Scanning folder 'F:\short\jenkins-maven-box-maven-archetype-ARCHETYPE-567-5' for files
matching the pattern 'j8m3.5.xb\archetype-common\src\main\java\**\*,j8m3.5.xb\maven-archetype-plugin\src\main\java\**\*'
- excludes: null
[TASKS] Found 88 files to scan for tasks
[TASKS] Found 27 open tasks.
Skipping warnings blame since pipelines do not have an SCM link.%n
[withMaven] invokerPublisher - Archive invoker results for Maven artifact MavenArtifact{org.apache.maven.plugins:maven-archetype-plugin:maven-plugin:3.1.1-SNAPSHOT(version:
3.1.1-SNAPSHOT, snapshot:false) } generated by PluginInvocation{org.apache.maven.plugins:maven-invoker-plugin:3.1.0@run
 integration-test}: j8m3.5.xb\maven-archetype-plugin\target\invoker-reports\*.xml
[withMaven] Publishers: Generated Artifacts Publisher: 722 ms, Junit Publisher: 1321 ms, Open
Task Scanner Publisher: 588 ms, Dependencies Fingerprint Publisher: 160 ms, Invoker Publisher:
15934 ms, Pipeline Graph Publisher: 5 ms
[Pipeline] // withMaven
[Pipeline] cleanWs
[WS-CLEANUP] Deleting project workspace...
[WS-CLEANUP] Deferred wipeout is used...
[WS-CLEANUP] done
[Pipeline] }
[Pipeline] // stage
[Pipeline] }
[Pipeline] // ws
[Pipeline] }
[Pipeline] // node
[Pipeline] }
[Pipeline] // parallel
[Pipeline] stage
[Pipeline] { (Notifications)
[Pipeline] echo
Build result: FAILURE
[Pipeline] jiraIssueSelector
[Pipeline] emailext
Mime
  • Unnamed multipart/mixed (inline, None, 0 bytes)
View raw message