maven-notifications mailing list archives

Site index · List index
Message view « Date » · « Thread »
Top « Date » · « Thread »
From Apache Jenkins Server <jenk...@builds.apache.org>
Subject Build failed in Jenkins: Maven TLP » maven-surefire » release/3.0.0-M6 #5
Date Tue, 04 Jun 2019 07:17:17 GMT
See https://builds.apache.org/job/maven-box/job/maven-surefire/job/release%252F3.0.0-M6/5/

Changes:

* [MNG-6573] Use Maven 3.6.0 as default
* H39 has weird issues, exclude it for now
* Fix no access to currentBuild.rawBuild
* fixed typo
* Include more recent JDKs

All tests passed

Build log:
[...truncated 29822 lines...]
[2019-06-04T07:17:02.491Z] [INFO] Exclude: **/.svn/**/*
[2019-06-04T07:17:02.491Z] [INFO] Exclude: **/*.iml
[2019-06-04T07:17:02.491Z] [INFO] Exclude: **/*.ipr
[2019-06-04T07:17:02.491Z] [INFO] Exclude: **/*.iws
[2019-06-04T07:17:02.491Z] [INFO] Exclude: **/*.versionsBackup
[2019-06-04T07:17:02.491Z] [INFO] Exclude: **/dependency-reduced-pom.xml
[2019-06-04T07:17:02.491Z] [INFO] Exclude: .repository/**
[2019-06-04T07:17:02.491Z] [INFO] Exclude: src/test/resources/**/*
[2019-06-04T07:17:02.491Z] [INFO] Exclude: src/test/resources/**/*.css
[2019-06-04T07:17:02.491Z] [INFO] Exclude: **/*.jj
[2019-06-04T07:17:02.492Z] [INFO] Exclude: src/main/resources/META-INF/services/org.apache.maven.surefire.providerapi.SurefireProvider
[2019-06-04T07:17:02.492Z] [INFO] Exclude: DEPENDENCIES
[2019-06-04T07:17:02.492Z] [INFO] Exclude: .m2/**
[2019-06-04T07:17:02.492Z] [INFO] Exclude: .m2
[2019-06-04T07:17:02.492Z] [INFO] Exclude: .travis.yml
[2019-06-04T07:17:02.492Z] [INFO] 33 resources included (use -debug for more details)
[2019-06-04T07:17:02.492Z] [INFO] Rat check: Summary over all files. Unapproved: 0, unknown:
0, generated: 0, approved: 33 licenses.
[2019-06-04T07:17:02.492Z] [INFO] 
[2019-06-04T07:17:02.492Z] [INFO] --- jacoco-maven-plugin:0.8.3:prepare-agent (jacoco-agent)
@ surefire-booter ---
[2019-06-04T07:17:02.492Z] [INFO] Skipping JaCoCo execution because property jacoco.skip is
set.
[2019-06-04T07:17:02.492Z] [INFO] jacoco.agent set to empty
[2019-06-04T07:17:02.492Z] [INFO] 
[2019-06-04T07:17:02.492Z] [INFO] --- maven-dependency-plugin:3.1.1:build-classpath (build-test-classpath)
@ surefire-booter ---
[2019-06-04T07:17:03.127Z] [INFO] Wrote classpath file 'C:\Users\jenkins\AppData\Local\Temp\2\jenkins-maven-box-maven-surefire-release%2F3.0.0-M6-5\surefire-booter\target\test-classpath\cp.txt'.
[2019-06-04T07:17:03.127Z] [INFO] 
[2019-06-04T07:17:03.127Z] [INFO] --- maven-compiler-plugin:3.7.0:compile (compile-generated)
@ surefire-booter ---
[2019-06-04T07:17:03.127Z] [INFO] Nothing to compile - all classes are up to date
[2019-06-04T07:17:03.127Z] [INFO] 
[2019-06-04T07:17:03.127Z] [INFO] --- maven-remote-resources-plugin:1.5:process (process-resource-bundles)
@ surefire-booter ---
[2019-06-04T07:17:03.127Z] [INFO] 
[2019-06-04T07:17:03.127Z] [INFO] --- maven-resources-plugin:3.1.0:resources (default-resources)
@ surefire-booter ---
[2019-06-04T07:17:03.127Z] [INFO] Using 'UTF-8' encoding to copy filtered resources.
[2019-06-04T07:17:03.127Z] [INFO] skip non existing resourceDirectory C:\Users\jenkins\AppData\Local\Temp\2\jenkins-maven-box-maven-surefire-release%2F3.0.0-M6-5\surefire-booter\src\main\resources
[2019-06-04T07:17:03.127Z] [INFO] Copying 3 resources
[2019-06-04T07:17:03.127Z] [INFO] 
[2019-06-04T07:17:03.127Z] [INFO] --- maven-compiler-plugin:3.7.0:compile (default-compile)
@ surefire-booter ---
[2019-06-04T07:17:03.127Z] [INFO] Changes detected - recompiling the module!
[2019-06-04T07:17:03.127Z] [INFO] Compiling 23 source files to C:\Users\jenkins\AppData\Local\Temp\2\jenkins-maven-box-maven-surefire-release%2F3.0.0-M6-5\surefire-booter\target\classes
[2019-06-04T07:17:06.320Z] [INFO] 
[2019-06-04T07:17:06.320Z] [INFO] --- animal-sniffer-maven-plugin:1.17:check (signature-check)
@ surefire-booter ---
[2019-06-04T07:17:06.320Z] [INFO] Checking unresolved references to org.codehaus.mojo.signature:java17:1.0
[2019-06-04T07:17:06.320Z] [INFO] 
[2019-06-04T07:17:06.320Z] [INFO] --- maven-resources-plugin:3.1.0:testResources (default-testResources)
@ surefire-booter ---
[2019-06-04T07:17:06.320Z] [INFO] Using 'UTF-8' encoding to copy filtered resources.
[2019-06-04T07:17:06.617Z] [INFO] Copying 7 resources
[2019-06-04T07:17:06.617Z] [INFO] Copying 3 resources
[2019-06-04T07:17:06.617Z] [INFO] 
[2019-06-04T07:17:06.617Z] [INFO] --- maven-compiler-plugin:3.7.0:testCompile (default-testCompile)
@ surefire-booter ---
[2019-06-04T07:17:06.617Z] [INFO] Changes detected - recompiling the module!
[2019-06-04T07:17:06.617Z] [INFO] Compiling 9 source files to C:\Users\jenkins\AppData\Local\Temp\2\jenkins-maven-box-maven-surefire-release%2F3.0.0-M6-5\surefire-booter\target\test-classes
[2019-06-04T07:17:09.527Z] [INFO] 
[2019-06-04T07:17:09.527Z] [INFO] --- maven-surefire-plugin:3.0.0-M3:test (default-test) @
surefire-booter ---
[2019-06-04T07:17:09.527Z] [INFO] Surefire report directory: C:\Users\jenkins\AppData\Local\Temp\2\jenkins-maven-box-maven-surefire-release%2F3.0.0-M6-5\surefire-booter\target\surefire-reports
[2019-06-04T07:17:09.527Z] [INFO] Using configured provider org.apache.maven.shadefire.surefire.junit.JUnit3Provider
[2019-06-04T07:17:09.527Z] [INFO] parallel='none', perCoreThreadCount=true, threadCount=0,
useUnlimitedThreads=false, threadCountSuites=0, threadCountClasses=0, threadCountMethods=0,
parallelOptimized=true
[2019-06-04T07:17:09.527Z] [INFO] 
[2019-06-04T07:17:09.527Z] [INFO] -------------------------------------------------------
[2019-06-04T07:17:09.527Z] [INFO]  T E S T S
[2019-06-04T07:17:09.527Z] [INFO] -------------------------------------------------------
[2019-06-04T07:17:09.527Z] [INFO] Running org.apache.maven.surefire.booter.JUnit4SuiteTest
[2019-06-04T07:17:13.301Z] [ERROR] Tests run: 52, Failures: 0, Errors: 1, Skipped: 0, Time
elapsed: 3.21 s <<< FAILURE! - in org.apache.maven.surefire.booter.JUnit4SuiteTest
[2019-06-04T07:17:13.301Z] [ERROR] org.apache.maven.surefire.booter.CommandReaderTest  Time
elapsed: 0.041 s  <<< ERROR!
[2019-06-04T07:17:13.301Z] java.lang.IllegalStateException: java.lang.ClassNotFoundException:
org.apache.maven.surefire.booter.CommandReaderTest
[2019-06-04T07:17:13.301Z] 	at org.apache.maven.surefire.booter.NewClassLoaderRunner.getFromTestClassLoader(NewClassLoaderRunner.java:189)
[2019-06-04T07:17:13.301Z] 	at org.apache.maven.surefire.booter.NewClassLoaderRunner.runChild(NewClassLoaderRunner.java:76)
[2019-06-04T07:17:13.301Z] 	at org.apache.maven.surefire.booter.NewClassLoaderRunner.runChild(NewClassLoaderRunner.java:57)
[2019-06-04T07:17:13.301Z] 	at org.junit.runners.ParentRunner$3.run(ParentRunner.java:290)
[2019-06-04T07:17:13.301Z] 	at org.junit.runners.ParentRunner$1.schedule(ParentRunner.java:71)
[2019-06-04T07:17:13.301Z] 	at org.junit.runners.ParentRunner.runChildren(ParentRunner.java:288)
[2019-06-04T07:17:13.301Z] 	at org.junit.runners.ParentRunner.access$000(ParentRunner.java:58)
[2019-06-04T07:17:13.301Z] 	at org.junit.runners.ParentRunner$2.evaluate(ParentRunner.java:268)
[2019-06-04T07:17:13.301Z] 	at org.junit.runners.ParentRunner.run(ParentRunner.java:363)
[2019-06-04T07:17:13.301Z] 	at org.junit.runners.Suite.runChild(Suite.java:128)
[2019-06-04T07:17:13.301Z] 	at org.junit.runners.Suite.runChild(Suite.java:27)
[2019-06-04T07:17:13.301Z] 	at org.junit.runners.ParentRunner$3.run(ParentRunner.java:290)
[2019-06-04T07:17:13.301Z] 	at org.junit.runners.ParentRunner$1.schedule(ParentRunner.java:71)
[2019-06-04T07:17:13.301Z] 	at org.junit.runners.ParentRunner.runChildren(ParentRunner.java:288)
[2019-06-04T07:17:13.301Z] 	at org.junit.runners.ParentRunner.access$000(ParentRunner.java:58)
[2019-06-04T07:17:13.301Z] 	at org.junit.runners.ParentRunner$2.evaluate(ParentRunner.java:268)
[2019-06-04T07:17:13.301Z] 	at org.junit.runners.ParentRunner.run(ParentRunner.java:363)
[2019-06-04T07:17:13.301Z] 	at junit.framework.JUnit4TestAdapter.run(JUnit4TestAdapter.java:38)
[2019-06-04T07:17:13.301Z] 	at sun.reflect.NativeMethodAccessorImpl.invoke0(Native Method)
[2019-06-04T07:17:13.301Z] 	at sun.reflect.NativeMethodAccessorImpl.invoke(NativeMethodAccessorImpl.java:57)
[2019-06-04T07:17:13.301Z] 	at sun.reflect.DelegatingMethodAccessorImpl.invoke(DelegatingMethodAccessorImpl.java:43)
[2019-06-04T07:17:13.301Z] 	at java.lang.reflect.Method.invoke(Method.java:606)
[2019-06-04T07:17:13.301Z] 	at org.apache.maven.shadefire.surefire.junit.JUnitTestSet.execute(JUnitTestSet.java:99)
[2019-06-04T07:17:13.301Z] 	at org.apache.maven.shadefire.surefire.junit.JUnit3Provider.executeTestSet(JUnit3Provider.java:140)
[2019-06-04T07:17:13.301Z] 	at org.apache.maven.shadefire.surefire.junit.JUnit3Provider.invoke(JUnit3Provider.java:113)
[2019-06-04T07:17:13.301Z] 	at org.apache.maven.shadefire.surefire.booter.ForkedBooter.invokeProviderInSameClassLoader(ForkedBooter.java:384)
[2019-06-04T07:17:13.301Z] 	at org.apache.maven.shadefire.surefire.booter.ForkedBooter.runSuitesInProcess(ForkedBooter.java:345)
[2019-06-04T07:17:13.301Z] 	at org.apache.maven.shadefire.surefire.booter.ForkedBooter.execute(ForkedBooter.java:126)
[2019-06-04T07:17:13.301Z] 	at org.apache.maven.shadefire.surefire.booter.ForkedBooter.main(ForkedBooter.java:418)
[2019-06-04T07:17:13.301Z] Caused by: java.lang.ClassNotFoundException: org.apache.maven.surefire.booter.CommandReaderTest
[2019-06-04T07:17:13.301Z] 	at java.net.URLClassLoader$1.run(URLClassLoader.java:366)
[2019-06-04T07:17:13.301Z] 	at java.net.URLClassLoader$1.run(URLClassLoader.java:355)
[2019-06-04T07:17:13.301Z] 	at java.security.AccessController.doPrivileged(Native Method)
[2019-06-04T07:17:13.301Z] 	at java.net.URLClassLoader.findClass(URLClassLoader.java:354)
[2019-06-04T07:17:13.301Z] 	at java.lang.ClassLoader.loadClass(ClassLoader.java:425)
[2019-06-04T07:17:13.301Z] 	at java.lang.ClassLoader.loadClass(ClassLoader.java:358)
[2019-06-04T07:17:13.301Z] 	at java.lang.Class.forName0(Native Method)
[2019-06-04T07:17:13.301Z] 	at java.lang.Class.forName(Class.java:274)
[2019-06-04T07:17:13.301Z] 	at org.apache.maven.surefire.booter.NewClassLoaderRunner.getFromTestClassLoader(NewClassLoaderRunner.java:185)
[2019-06-04T07:17:13.301Z] 	... 28 more
[2019-06-04T07:17:13.301Z] Caused by: java.lang.ClassNotFoundException: org.apache.maven.surefire.booter.CommandReaderTest
[2019-06-04T07:17:13.301Z] 	at java.net.URLClassLoader$1.run(URLClassLoader.java:366)
[2019-06-04T07:17:13.301Z] 	at java.net.URLClassLoader$1.run(URLClassLoader.java:355)
[2019-06-04T07:17:13.301Z] 	at java.security.AccessController.doPrivileged(Native Method)
[2019-06-04T07:17:13.301Z] 	at java.net.URLClassLoader.findClass(URLClassLoader.java:354)
[2019-06-04T07:17:13.301Z] 	at java.lang.ClassLoader.loadClass(ClassLoader.java:425)
[2019-06-04T07:17:13.301Z] 	at java.lang.ClassLoader.loadClass(ClassLoader.java:358)
[2019-06-04T07:17:13.301Z] 	at java.lang.Class.forName0(Native Method)
[2019-06-04T07:17:13.301Z] 	at java.lang.Class.forName(Class.java:274)
[2019-06-04T07:17:13.301Z] 	at org.apache.maven.surefire.booter.NewClassLoaderRunner.getFromTestClassLoader(NewClassLoaderRunner.java:185)
[2019-06-04T07:17:13.301Z] 	... 28 more
[2019-06-04T07:17:13.301Z] 
[2019-06-04T07:17:13.301Z] [INFO] 
[2019-06-04T07:17:13.301Z] [INFO] Results:
[2019-06-04T07:17:13.301Z] [INFO] 
[2019-06-04T07:17:13.301Z] [ERROR] Errors: 
[2019-06-04T07:17:13.301Z] [ERROR]   junit.framework.TestSuite#org.apache.maven.surefire.booter.CommandReaderTest
IllegalStateException
[2019-06-04T07:17:13.301Z] [INFO] 
[2019-06-04T07:17:13.301Z] [ERROR] Tests run: 52, Failures: 0, Errors: 1, Skipped: 0
[2019-06-04T07:17:13.301Z] [INFO] 
[2019-06-04T07:17:13.301Z] [INFO] ------------------------------------------------------------------------
[2019-06-04T07:17:13.301Z] [INFO] Reactor Summary for Apache Maven Surefire 3.0.0-SNAPSHOT:
[2019-06-04T07:17:13.301Z] [INFO] 
[2019-06-04T07:17:13.301Z] [INFO] Apache Maven Surefire .............................. SUCCESS
[  7.362 s]
[2019-06-04T07:17:13.301Z] [INFO] SureFire Logger API ................................ SUCCESS
[  4.255 s]
[2019-06-04T07:17:13.301Z] [INFO] SureFire API ....................................... SUCCESS
[ 13.287 s]
[2019-06-04T07:17:13.301Z] [INFO] SureFire Booter .................................... FAILURE
[ 12.530 s]
[2019-06-04T07:17:13.301Z] [INFO] Maven Surefire Test-Grouping Support ............... SKIPPED
[2019-06-04T07:17:13.301Z] [INFO] SureFire Providers ................................. SKIPPED
[2019-06-04T07:17:13.301Z] [INFO] Shared JUnit3 Provider Code ........................ SKIPPED
[2019-06-04T07:17:13.301Z] [INFO] Shared Java 5 Provider Base ........................ SKIPPED
[2019-06-04T07:17:13.301Z] [INFO] Shared JUnit4 Provider Code ........................ SKIPPED
[2019-06-04T07:17:13.301Z] [INFO] Shared JUnit48 Provider Code ....................... SKIPPED
[2019-06-04T07:17:13.301Z] [INFO] SureFire JUnit Runner .............................. SKIPPED
[2019-06-04T07:17:13.301Z] [INFO] SureFire JUnit4 Runner ............................. SKIPPED
[2019-06-04T07:17:13.301Z] [INFO] Maven Surefire Common .............................. SKIPPED
[2019-06-04T07:17:13.301Z] [INFO] SureFire JUnitCore Runner .......................... SKIPPED
[2019-06-04T07:17:13.301Z] [INFO] SureFire JUnit Platform Runner ..................... SKIPPED
[2019-06-04T07:17:13.301Z] [INFO] SureFire TestNG Utils .............................. SKIPPED
[2019-06-04T07:17:13.301Z] [INFO] SureFire TestNG Runner ............................. SKIPPED
[2019-06-04T07:17:13.301Z] [INFO] ShadeFire JUnit3 Provider .......................... SKIPPED
[2019-06-04T07:17:13.301Z] [INFO] Surefire Report Parser ............................. SKIPPED
[2019-06-04T07:17:13.301Z] [INFO] Maven Surefire Plugin .............................. SKIPPED
[2019-06-04T07:17:13.301Z] [INFO] Maven Failsafe Plugin .............................. SKIPPED
[2019-06-04T07:17:13.301Z] [INFO] Maven Surefire Report Plugin ....................... SKIPPED
[2019-06-04T07:17:13.301Z] [INFO] Maven Surefire Integration Tests ................... SKIPPED
[2019-06-04T07:17:13.301Z] [INFO] ------------------------------------------------------------------------
[2019-06-04T07:17:13.301Z] [INFO] BUILD FAILURE
[2019-06-04T07:17:13.301Z] [INFO] ------------------------------------------------------------------------
[2019-06-04T07:17:13.301Z] [INFO] Total time:  38.123 s
[2019-06-04T07:17:13.301Z] [INFO] Finished at: 2019-06-04T07:17:12Z
[2019-06-04T07:17:13.302Z] [INFO] ------------------------------------------------------------------------
[2019-06-04T07:17:13.302Z] [ERROR] Failed to execute goal org.apache.maven.plugins:maven-surefire-plugin:3.0.0-M3:test
(default-test) on project surefire-booter: There are test failures.
[2019-06-04T07:17:13.302Z] [ERROR] 
[2019-06-04T07:17:13.302Z] [ERROR] Please refer to C:\Users\jenkins\AppData\Local\Temp\2\jenkins-maven-box-maven-surefire-release%2F3.0.0-M6-5\surefire-booter\target\surefire-reports
for the individual test results.
[2019-06-04T07:17:13.302Z] [ERROR] Please refer to dump files (if any exist) [date].dump,
[date]-jvmRun[N].dump and [date].dumpstream.
[2019-06-04T07:17:13.302Z] [ERROR] -> [Help 1]
[2019-06-04T07:17:13.302Z] org.apache.maven.lifecycle.LifecycleExecutionException: Failed
to execute goal org.apache.maven.plugins:maven-surefire-plugin:3.0.0-M3:test (default-test)
on project surefire-booter: There are test failures.
[2019-06-04T07:17:13.302Z] 
[2019-06-04T07:17:13.302Z] Please refer to C:\Users\jenkins\AppData\Local\Temp\2\jenkins-maven-box-maven-surefire-release%2F3.0.0-M6-5\surefire-booter\target\surefire-reports
for the individual test results.
[2019-06-04T07:17:13.302Z] Please refer to dump files (if any exist) [date].dump, [date]-jvmRun[N].dump
and [date].dumpstream.
[2019-06-04T07:17:13.302Z]     at org.apache.maven.lifecycle.internal.MojoExecutor.execute
(MojoExecutor.java:215)
[2019-06-04T07:17:13.302Z]     at org.apache.maven.lifecycle.internal.MojoExecutor.execute
(MojoExecutor.java:156)
[2019-06-04T07:17:13.302Z]     at org.apache.maven.lifecycle.internal.MojoExecutor.execute
(MojoExecutor.java:148)
[2019-06-04T07:17:13.302Z]     at org.apache.maven.lifecycle.internal.LifecycleModuleBuilder.buildProject
(LifecycleModuleBuilder.java:117)
[2019-06-04T07:17:13.302Z]     at org.apache.maven.lifecycle.internal.LifecycleModuleBuilder.buildProject
(LifecycleModuleBuilder.java:81)
[2019-06-04T07:17:13.302Z]     at org.apache.maven.lifecycle.internal.builder.singlethreaded.SingleThreadedBuilder.build
(SingleThreadedBuilder.java:56)
[2019-06-04T07:17:13.302Z]     at org.apache.maven.lifecycle.internal.LifecycleStarter.execute
(LifecycleStarter.java:128)
[2019-06-04T07:17:13.302Z]     at org.apache.maven.DefaultMaven.doExecute (DefaultMaven.java:305)
[2019-06-04T07:17:13.302Z]     at org.apache.maven.DefaultMaven.doExecute (DefaultMaven.java:192)
[2019-06-04T07:17:13.302Z]     at org.apache.maven.DefaultMaven.execute (DefaultMaven.java:105)
[2019-06-04T07:17:13.302Z]     at org.apache.maven.cli.MavenCli.execute (MavenCli.java:956)
[2019-06-04T07:17:13.302Z]     at org.apache.maven.cli.MavenCli.doMain (MavenCli.java:288)
[2019-06-04T07:17:13.302Z]     at org.apache.maven.cli.MavenCli.main (MavenCli.java:192)
[2019-06-04T07:17:13.302Z]     at sun.reflect.NativeMethodAccessorImpl.invoke0 (Native Method)
[2019-06-04T07:17:13.302Z]     at sun.reflect.NativeMethodAccessorImpl.invoke (NativeMethodAccessorImpl.java:62)
[2019-06-04T07:17:13.302Z]     at sun.reflect.DelegatingMethodAccessorImpl.invoke (DelegatingMethodAccessorImpl.java:43)
[2019-06-04T07:17:13.302Z]     at java.lang.reflect.Method.invoke (Method.java:498)
[2019-06-04T07:17:13.302Z]     at org.codehaus.plexus.classworlds.launcher.Launcher.launchEnhanced
(Launcher.java:289)
[2019-06-04T07:17:13.302Z]     at org.codehaus.plexus.classworlds.launcher.Launcher.launch
(Launcher.java:229)
[2019-06-04T07:17:13.302Z]     at org.codehaus.plexus.classworlds.launcher.Launcher.mainWithExitCode
(Launcher.java:415)
[2019-06-04T07:17:13.302Z]     at org.codehaus.plexus.classworlds.launcher.Launcher.main (Launcher.java:356)
[2019-06-04T07:17:13.302Z] Caused by: org.apache.maven.plugin.MojoFailureException: There
are test failures.
[2019-06-04T07:17:13.302Z] 
[2019-06-04T07:17:13.302Z] Please refer to C:\Users\jenkins\AppData\Local\Temp\2\jenkins-maven-box-maven-surefire-release%2F3.0.0-M6-5\surefire-booter\target\surefire-reports
for the individual test results.
[2019-06-04T07:17:13.302Z] Please refer to dump files (if any exist) [date].dump, [date]-jvmRun[N].dump
and [date].dumpstream.
[2019-06-04T07:17:13.302Z]     at org.apache.maven.plugin.surefire.SurefireHelper.throwException
(SurefireHelper.java:271)
[2019-06-04T07:17:13.302Z]     at org.apache.maven.plugin.surefire.SurefireHelper.reportExecution
(SurefireHelper.java:159)
[2019-06-04T07:17:13.302Z]     at org.apache.maven.plugin.surefire.SurefirePlugin.handleSummary
(SurefirePlugin.java:373)
[2019-06-04T07:17:13.302Z]     at org.apache.maven.plugin.surefire.AbstractSurefireMojo.executeAfterPreconditionsChecked
(AbstractSurefireMojo.java:1018)
[2019-06-04T07:17:13.302Z]     at org.apache.maven.plugin.surefire.AbstractSurefireMojo.execute
(AbstractSurefireMojo.java:848)
[2019-06-04T07:17:13.302Z]     at org.apache.maven.plugin.DefaultBuildPluginManager.executeMojo
(DefaultBuildPluginManager.java:137)
[2019-06-04T07:17:13.302Z]     at org.apache.maven.lifecycle.internal.MojoExecutor.execute
(MojoExecutor.java:210)
[2019-06-04T07:17:13.302Z]     at org.apache.maven.lifecycle.internal.MojoExecutor.execute
(MojoExecutor.java:156)
[2019-06-04T07:17:13.302Z]     at org.apache.maven.lifecycle.internal.MojoExecutor.execute
(MojoExecutor.java:148)
[2019-06-04T07:17:13.302Z]     at org.apache.maven.lifecycle.internal.LifecycleModuleBuilder.buildProject
(LifecycleModuleBuilder.java:117)
[2019-06-04T07:17:13.302Z]     at org.apache.maven.lifecycle.internal.LifecycleModuleBuilder.buildProject
(LifecycleModuleBuilder.java:81)
[2019-06-04T07:17:13.302Z]     at org.apache.maven.lifecycle.internal.builder.singlethreaded.SingleThreadedBuilder.build
(SingleThreadedBuilder.java:56)
[2019-06-04T07:17:13.302Z]     at org.apache.maven.lifecycle.internal.LifecycleStarter.execute
(LifecycleStarter.java:128)
[2019-06-04T07:17:13.302Z]     at org.apache.maven.DefaultMaven.doExecute (DefaultMaven.java:305)
[2019-06-04T07:17:13.302Z]     at org.apache.maven.DefaultMaven.doExecute (DefaultMaven.java:192)
[2019-06-04T07:17:13.302Z]     at org.apache.maven.DefaultMaven.execute (DefaultMaven.java:105)
[2019-06-04T07:17:13.302Z]     at org.apache.maven.cli.MavenCli.execute (MavenCli.java:956)
[2019-06-04T07:17:13.302Z]     at org.apache.maven.cli.MavenCli.doMain (MavenCli.java:288)
[2019-06-04T07:17:13.302Z]     at org.apache.maven.cli.MavenCli.main (MavenCli.java:192)
[2019-06-04T07:17:13.302Z]     at sun.reflect.NativeMethodAccessorImpl.invoke0 (Native Method)
[2019-06-04T07:17:13.302Z]     at sun.reflect.NativeMethodAccessorImpl.invoke (NativeMethodAccessorImpl.java:62)
[2019-06-04T07:17:13.302Z]     at sun.reflect.DelegatingMethodAccessorImpl.invoke (DelegatingMethodAccessorImpl.java:43)
[2019-06-04T07:17:13.302Z]     at java.lang.reflect.Method.invoke (Method.java:498)
[2019-06-04T07:17:13.302Z]     at org.codehaus.plexus.classworlds.launcher.Launcher.launchEnhanced
(Launcher.java:289)
[2019-06-04T07:17:13.302Z]     at org.codehaus.plexus.classworlds.launcher.Launcher.launch
(Launcher.java:229)
[2019-06-04T07:17:13.302Z]     at org.codehaus.plexus.classworlds.launcher.Launcher.mainWithExitCode
(Launcher.java:415)
[2019-06-04T07:17:13.302Z]     at org.codehaus.plexus.classworlds.launcher.Launcher.main (Launcher.java:356)
[2019-06-04T07:17:13.302Z] [ERROR] 
[2019-06-04T07:17:13.302Z] [ERROR] Re-run Maven using the -X switch to enable full debug logging.
[2019-06-04T07:17:13.302Z] [ERROR] 
[2019-06-04T07:17:13.302Z] [ERROR] For more information about the errors and possible solutions,
please read the following articles:
[2019-06-04T07:17:13.302Z] [ERROR] [Help 1] http://cwiki.apache.org/confluence/display/MAVEN/MojoFailureException
[2019-06-04T07:17:13.303Z] [ERROR] 
[2019-06-04T07:17:13.303Z] [ERROR] After correcting the problems, you can resume the build
with the command
[2019-06-04T07:17:13.303Z] [ERROR]   mvn <goals> -rf :surefire-booter
[Pipeline] }
[Pipeline] // withEnv
[Pipeline] }
[Pipeline] // stage
[Pipeline] fileExists
[Pipeline] fileExists
[Pipeline] archiveArtifacts
[2019-06-04T07:17:13.615Z] Archiving artifacts
[Pipeline] cleanWs
[2019-06-04T07:17:13.679Z] [WS-CLEANUP] Deleting project workspace...
[2019-06-04T07:17:13.679Z] [WS-CLEANUP] Deferred wipeout is used...
[2019-06-04T07:17:13.725Z] [WS-CLEANUP] done
[Pipeline] }
[Pipeline] // ws
[Pipeline] }
[Pipeline] // timestamps
[Pipeline] }
[Pipeline] // node
[Pipeline] }
[Pipeline] // parallel
[Pipeline] echo
Build result: FAILURE
[Pipeline] jiraIssueSelector
[Pipeline] jiraComment
[Pipeline] emailext
Mime
  • Unnamed multipart/mixed (inline, None, 0 bytes)
View raw message