maven-notifications mailing list archives

Site index · List index
Message view « Date » · « Thread »
Top « Date » · « Thread »
From Apache Jenkins Server <jenk...@builds.apache.org>
Subject Build failed in Jenkins: Maven TLP » maven-compiler-plugin » master #110
Date Mon, 03 Jun 2019 17:39:43 GMT
See https://builds.apache.org/job/maven-box/job/maven-compiler-plugin/job/master/110/

Changes:

* fixed typo
* Include more recent JDKs
* Cleanup debug log handling
* Cleanup debug log handling
* Cleanup debug log handling
* Cleanup debug log handling
* Cleanup debug log handling
* Cleanup debug log handling
* Cleanup debug log handling
* Cleanup debug log handling
* Cleanup debug log handling

All tests passed

Build log:
[...truncated 11758 lines...]
[INFO]           mcompiler-179/pom.xml ............................ SUCCESS (3.7 s)
[INFO] Building: MCOMPILER-203-processorpath/pom.xml
[INFO]           MCOMPILER-203-processorpath/pom.xml .............. SUCCESS (12.4 s)
[INFO] Building: MCOMPILER-190/pom.xml
[INFO] run post-build script verify.groovy
[INFO]           multirelease-patterns\multiproject\pom.xml ....... SUCCESS (44.6 s)
[INFO] Building: multirelease-patterns\packaging-plugin\pom.xml
[INFO]           MCOMPILER-190/pom.xml ............................ SUCCESS (5.9 s)
[INFO] Building: MCOMPILER-197/pom.xml
[INFO]           MCOMPILER-197/pom.xml ............................ SKIPPED due to JRE version
[INFO] Building: jpms_compile-main-foo-test-bar/pom.xml
[INFO] run post-build script verify.groovy
[INFO]           multirelease-patterns\multiproject\pom.xml ....... SUCCESS (44.6 s)
[INFO] Building: multirelease-patterns\packaging-plugin\pom.xml
[INFO] run post-build script verify.groovy
[INFO]           jpms_compile-main-foo-test-bar/pom.xml ........... SUCCESS (4.5 s)
[INFO] Building: MCOMPILER-157/pom.xml
[INFO]           MCOMPILER-157/pom.xml ............................ SUCCESS (6.5 s)
[INFO] 
[INFO] --- maven-checkstyle-plugin:3.0.0:check (checkstyle-check) @ maven-compiler-plugin
---
[withMaven] Publishers: Generated Artifacts Publisher: 1116 ms, Junit Publisher: 653 ms, Open
Task Scanner Publisher: 692 ms, Invoker Publisher: 56629 ms, Pipeline Graph Publisher: 2 ms
[Pipeline] // withMaven
[Pipeline] cleanWs
[WS-CLEANUP] Deleting project workspace...
[WS-CLEANUP] Deferred wipeout is used...
[WS-CLEANUP] done
[Pipeline] }
[Pipeline] // stage
[Pipeline] }
[Pipeline] // ws
[Pipeline] }
[Pipeline] // node
[Pipeline] }
[INFO] There are 2 errors reported by Checkstyle 6.18 with config/maven_checks.xml ruleset.
[INFO] Ignored 2 errors, 0 violation remaining.
[INFO] 
[INFO] --- maven-invoker-plugin:3.2.0:verify (integration-test) @ maven-compiler-plugin ---
[INFO] -------------------------------------------------
[INFO] Build Summary:
[INFO]   Passed: 51, Failed: 1, Errors: 0, Skipped: 3
[INFO] -------------------------------------------------
[ERROR] The following builds failed:
[ERROR] *  error-prone-compiler/pom.xml
[INFO] -------------------------------------------------
[INFO] ------------------------------------------------------------------------
[INFO] BUILD FAILURE
[INFO] ------------------------------------------------------------------------
[INFO] Total time:  05:52 min
[INFO] Finished at: 2019-06-03T17:38:42Z
[INFO] ------------------------------------------------------------------------
[INFO] [jenkins-event-spy] Generated /home/jenkins/jenkins-slave/workspace/box_maven-compiler-plugin_master@2@tmp/withMaven3beeaa34/maven-spy-20190603-173250-69712822507632333961007.log
[ERROR] Failed to execute goal org.apache.maven.plugins:maven-invoker-plugin:3.2.0:verify
(integration-test) on project maven-compiler-plugin: 1 build failed. See console output above
for details. -> [Help 1]
org.apache.maven.lifecycle.LifecycleExecutionException: Failed to execute goal org.apache.maven.plugins:maven-invoker-plugin:3.2.0:verify
(integration-test) on project maven-compiler-plugin: 1 build failed. See console output above
for details.
    at org.apache.maven.lifecycle.internal.MojoExecutor.execute (MojoExecutor.java:215)
    at org.apache.maven.lifecycle.internal.MojoExecutor.execute (MojoExecutor.java:156)
    at org.apache.maven.lifecycle.internal.MojoExecutor.execute (MojoExecutor.java:148)
    at org.apache.maven.lifecycle.internal.LifecycleModuleBuilder.buildProject (LifecycleModuleBuilder.java:117)
    at org.apache.maven.lifecycle.internal.LifecycleModuleBuilder.buildProject (LifecycleModuleBuilder.java:81)
    at org.apache.maven.lifecycle.internal.builder.singlethreaded.SingleThreadedBuilder.build
(SingleThreadedBuilder.java:56)
    at org.apache.maven.lifecycle.internal.LifecycleStarter.execute (LifecycleStarter.java:128)
    at org.apache.maven.DefaultMaven.doExecute (DefaultMaven.java:305)
    at org.apache.maven.DefaultMaven.doExecute (DefaultMaven.java:192)
    at org.apache.maven.DefaultMaven.execute (DefaultMaven.java:105)
    at org.apache.maven.cli.MavenCli.execute (MavenCli.java:956)
    at org.apache.maven.cli.MavenCli.doMain (MavenCli.java:288)
    at org.apache.maven.cli.MavenCli.main (MavenCli.java:192)
    at jdk.internal.reflect.NativeMethodAccessorImpl.invoke0 (Native Method)
    at jdk.internal.reflect.NativeMethodAccessorImpl.invoke (NativeMethodAccessorImpl.java:62)
    at jdk.internal.reflect.DelegatingMethodAccessorImpl.invoke (DelegatingMethodAccessorImpl.java:43)
    at java.lang.reflect.Method.invoke (Method.java:567)
    at org.codehaus.plexus.classworlds.launcher.Launcher.launchEnhanced (Launcher.java:289)
    at org.codehaus.plexus.classworlds.launcher.Launcher.launch (Launcher.java:229)
    at org.codehaus.plexus.classworlds.launcher.Launcher.mainWithExitCode (Launcher.java:415)
    at org.codehaus.plexus.classworlds.launcher.Launcher.main (Launcher.java:356)
Caused by: org.apache.maven.plugin.MojoFailureException: 1 build failed. See console output
above for details.
    at org.apache.maven.plugins.invoker.InvokerSession.handleFailures (InvokerSession.java:260)
    at org.apache.maven.plugins.invoker.VerifyMojo.execute (VerifyMojo.java:140)
    at org.apache.maven.plugin.DefaultBuildPluginManager.executeMojo (DefaultBuildPluginManager.java:137)
    at org.apache.maven.lifecycle.internal.MojoExecutor.execute (MojoExecutor.java:210)
    at org.apache.maven.lifecycle.internal.MojoExecutor.execute (MojoExecutor.java:156)
    at org.apache.maven.lifecycle.internal.MojoExecutor.execute (MojoExecutor.java:148)
    at org.apache.maven.lifecycle.internal.LifecycleModuleBuilder.buildProject (LifecycleModuleBuilder.java:117)
    at org.apache.maven.lifecycle.internal.LifecycleModuleBuilder.buildProject (LifecycleModuleBuilder.java:81)
    at org.apache.maven.lifecycle.internal.builder.singlethreaded.SingleThreadedBuilder.build
(SingleThreadedBuilder.java:56)
    at org.apache.maven.lifecycle.internal.LifecycleStarter.execute (LifecycleStarter.java:128)
    at org.apache.maven.DefaultMaven.doExecute (DefaultMaven.java:305)
    at org.apache.maven.DefaultMaven.doExecute (DefaultMaven.java:192)
    at org.apache.maven.DefaultMaven.execute (DefaultMaven.java:105)
    at org.apache.maven.cli.MavenCli.execute (MavenCli.java:956)
    at org.apache.maven.cli.MavenCli.doMain (MavenCli.java:288)
    at org.apache.maven.cli.MavenCli.main (MavenCli.java:192)
    at jdk.internal.reflect.NativeMethodAccessorImpl.invoke0 (Native Method)
    at jdk.internal.reflect.NativeMethodAccessorImpl.invoke (NativeMethodAccessorImpl.java:62)
    at jdk.internal.reflect.DelegatingMethodAccessorImpl.invoke (DelegatingMethodAccessorImpl.java:43)
    at java.lang.reflect.Method.invoke (Method.java:567)
    at org.codehaus.plexus.classworlds.launcher.Launcher.launchEnhanced (Launcher.java:289)
    at org.codehaus.plexus.classworlds.launcher.Launcher.launch (Launcher.java:229)
    at org.codehaus.plexus.classworlds.launcher.Launcher.mainWithExitCode (Launcher.java:415)
    at org.codehaus.plexus.classworlds.launcher.Launcher.main (Launcher.java:356)
[ERROR] 
[ERROR] Re-run Maven using the -X switch to enable full debug logging.
[ERROR] 
[ERROR] For more information about the errors and possible solutions, please read the following
articles:
[ERROR] [Help 1] http://cwiki.apache.org/confluence/display/MAVEN/MojoFailureException
[Pipeline] }
[Pipeline] // dir
[Pipeline] }
[withMaven] junitPublisher - Archive test results for Maven artifact org.apache.maven.plugins:maven-compiler-plugin:maven-plugin:3.8.2-SNAPSHOT
generated by maven-surefire-plugin:test (default-test): linux-jdk13-m3.6.x_build/target/surefire-reports/*.xml
Recording test results
[INFO] run post-build script verify.groovy
[INFO]           multirelease-patterns\packaging-plugin\pom.xml ... SUCCESS (20.2 s)
[INFO] Building: multirelease-patterns\singleproject-runtime\pom.xml
[withMaven] openTasksPublisher - Scan Tasks for Maven artifact org.apache.maven.plugins:maven-compiler-plugin:maven-plugin:3.8.2-SNAPSHOT
in source directory linux-jdk13-m3.6.x_build/src/main/java
[TASKS] Scanning folder '/home/jenkins/jenkins-slave/workspace/box_maven-compiler-plugin_master@2'
for files matching the pattern 'linux-jdk13-m3.6.x_build/src/main/java/**/*' - excludes: null
[TASKS] Found 9 files to scan for tasks
[TASKS] Found 6 open tasks.
Skipping warnings blame since pipelines do not have an SCM link.%n
[TASKS] Computing warning deltas based on reference build #109
[INFO] run post-build script verify.groovy
[INFO]           multirelease-patterns\packaging-plugin\pom.xml ... SUCCESS (20.1 s)
[INFO] Building: multirelease-patterns\singleproject-runtime\pom.xml
[withMaven] invokerPublisher - Archive invoker results for Maven artifact MavenArtifact{org.apache.maven.plugins:maven-compiler-plugin:maven-plugin:3.8.2-SNAPSHOT(version:
3.8.2-SNAPSHOT, snapshot:false) } generated by PluginInvocation{org.apache.maven.plugins:maven-invoker-plugin:3.2.0@integration-test
 integration-test}: linux-jdk13-m3.6.x_build/target/invoker-reports/*.xml
[INFO] run post-build script verify.groovy
[INFO]           multirelease-patterns\singleproject-runtime\pom.xml SUCCESS (14.2 s)
[INFO] Building: non-english-warnings\pom.xml
[INFO] run post-build script verify.groovy
[INFO]           multirelease-patterns\singleproject-runtime\pom.xml SUCCESS (14.9 s)
[INFO] Building: non-english-warnings\pom.xml
[INFO] run post-build script verify.bsh
[INFO]           non-english-warnings\pom.xml ..................... SUCCESS (7.1 s)
[INFO] Building: test1\pom.xml
[INFO] run post-build script verify.bsh
[INFO]           non-english-warnings\pom.xml ..................... SUCCESS (7.3 s)
[INFO] Building: test1\pom.xml
[INFO]           test1\pom.xml .................................... SUCCESS (7.0 s)
[INFO] 
[INFO] --- maven-checkstyle-plugin:3.0.0:check (checkstyle-check) @ maven-compiler-plugin
---
[INFO]           test1\pom.xml .................................... SUCCESS (7.1 s)
[INFO] 
[INFO] --- maven-checkstyle-plugin:3.0.0:check (checkstyle-check) @ maven-compiler-plugin
---
[INFO] There are 2 errors reported by Checkstyle 6.18 with config/maven_checks.xml ruleset.
[INFO] Ignored 2 errors, 0 violation remaining.
[INFO] 
[INFO] --- maven-invoker-plugin:3.2.0:verify (integration-test) @ maven-compiler-plugin ---
[INFO] -------------------------------------------------
[INFO] Build Summary:
[INFO]   Passed: 51, Failed: 0, Errors: 0, Skipped: 4
[INFO] -------------------------------------------------
[INFO] ------------------------------------------------------------------------
[INFO] BUILD SUCCESS
[INFO] ------------------------------------------------------------------------
[INFO] Total time:  10:42 min
[INFO] Finished at: 2019-06-03T10:39:16-07:00
[INFO] ------------------------------------------------------------------------
[INFO] [jenkins-event-spy] Generated F:\jenkins\jenkins-slave\workspace\box_maven-compiler-plugin_master@2@2@tmp\withMaven3c680ca5\maven-spy-20190603-102833-6923408763865743379369.log
[INFO] There are 2 errors reported by Checkstyle 6.18 with config/maven_checks.xml ruleset.
[INFO] Ignored 2 errors, 0 violation remaining.
[INFO] 
[INFO] --- maven-invoker-plugin:3.2.0:verify (integration-test) @ maven-compiler-plugin ---
[INFO] -------------------------------------------------
[INFO] Build Summary:
[INFO]   Passed: 51, Failed: 0, Errors: 0, Skipped: 4
[INFO] -------------------------------------------------
[INFO] ------------------------------------------------------------------------
[INFO] BUILD SUCCESS
[INFO] ------------------------------------------------------------------------
[INFO] Total time:  10:42 min
[INFO] Finished at: 2019-06-03T10:39:16-07:00
[INFO] ------------------------------------------------------------------------
[INFO] [jenkins-event-spy] Generated F:\jenkins\jenkins-slave\workspace\box_maven-compiler-plugin_master@3@tmp\withMaven29a7e9ae\maven-spy-20190603-102833-3552615587744671073691.log
[Pipeline] }
[Pipeline] // dir
[Pipeline] }
[Pipeline] }
[Pipeline] // dir
[Pipeline] }
[withMaven] artifactsPublisher - Archive artifact windows-jdk12-m3.6.x_build\pom.xml under
org\apache\maven\plugins\maven-compiler-plugin\3.8.2-SNAPSHOT\maven-compiler-plugin-3.8.2-SNAPSHOT.pom
[withMaven] artifactsPublisher - Archive artifact windows-jdk12-m3.6.x_build\target\maven-compiler-plugin-3.8.2-SNAPSHOT.jar
under org\apache\maven\plugins\maven-compiler-plugin\3.8.2-SNAPSHOT\maven-compiler-plugin-3.8.2-SNAPSHOT.jar
[withMaven] artifactsPublisher - Archive artifact windows-jdk11-m3.6.x_build\pom.xml under
org\apache\maven\plugins\maven-compiler-plugin\3.8.2-SNAPSHOT\maven-compiler-plugin-3.8.2-SNAPSHOT.pom
[withMaven] artifactsPublisher - Archive artifact windows-jdk11-m3.6.x_build\target\maven-compiler-plugin-3.8.2-SNAPSHOT.jar
under org\apache\maven\plugins\maven-compiler-plugin\3.8.2-SNAPSHOT\maven-compiler-plugin-3.8.2-SNAPSHOT.jar
[withMaven] junitPublisher - Archive test results for Maven artifact org.apache.maven.plugins:maven-compiler-plugin:maven-plugin:3.8.2-SNAPSHOT
generated by maven-surefire-plugin:test (default-test): windows-jdk12-m3.6.x_build\target\surefire-reports\*.xml
Recording test results
[withMaven] junitPublisher - Archive test results for Maven artifact org.apache.maven.plugins:maven-compiler-plugin:maven-plugin:3.8.2-SNAPSHOT
generated by maven-surefire-plugin:test (default-test): windows-jdk11-m3.6.x_build\target\surefire-reports\*.xml
Recording test results
[withMaven] openTasksPublisher - Scan Tasks for Maven artifact org.apache.maven.plugins:maven-compiler-plugin:maven-plugin:3.8.2-SNAPSHOT
in source directory windows-jdk12-m3.6.x_build\src\main\java
[TASKS] Scanning folder 'f:\jenkins\jenkins-slave\workspace\box_maven-compiler-plugin_master@2@2'
for files matching the pattern 'windows-jdk12-m3.6.x_build\src\main\java\**\*' - excludes:
null
[TASKS] Found 9 files to scan for tasks
[TASKS] Found 6 open tasks.
Skipping warnings blame since pipelines do not have an SCM link.%n
[TASKS] Computing warning deltas based on reference build #109
[withMaven] openTasksPublisher - Scan Tasks for Maven artifact org.apache.maven.plugins:maven-compiler-plugin:maven-plugin:3.8.2-SNAPSHOT
in source directory windows-jdk11-m3.6.x_build\src\main\java
[TASKS] Scanning folder 'f:\jenkins\jenkins-slave\workspace\box_maven-compiler-plugin_master@3'
for files matching the pattern 'windows-jdk11-m3.6.x_build\src\main\java\**\*' - excludes:
null
[TASKS] Found 9 files to scan for tasks
[TASKS] Found 6 open tasks.
Skipping warnings blame since pipelines do not have an SCM link.%n
[withMaven] invokerPublisher - Archive invoker results for Maven artifact MavenArtifact{org.apache.maven.plugins:maven-compiler-plugin:maven-plugin:3.8.2-SNAPSHOT(version:
3.8.2-SNAPSHOT, snapshot:false) } generated by PluginInvocation{org.apache.maven.plugins:maven-invoker-plugin:3.2.0@integration-test
 integration-test}: windows-jdk12-m3.6.x_build\target\invoker-reports\*.xml
[TASKS] Computing warning deltas based on reference build #109
[withMaven] invokerPublisher - Archive invoker results for Maven artifact MavenArtifact{org.apache.maven.plugins:maven-compiler-plugin:maven-plugin:3.8.2-SNAPSHOT(version:
3.8.2-SNAPSHOT, snapshot:false) } generated by PluginInvocation{org.apache.maven.plugins:maven-invoker-plugin:3.2.0@integration-test
 integration-test}: windows-jdk11-m3.6.x_build\target\invoker-reports\*.xml
[withMaven] Publishers: Generated Artifacts Publisher: 307 ms, Junit Publisher: 663 ms, Open
Task Scanner Publisher: 683 ms, Invoker Publisher: 53112 ms
[withMaven] Publishers: Generated Artifacts Publisher: 140 ms, Junit Publisher: 103 ms, Open
Task Scanner Publisher: 99 ms, Invoker Publisher: 23676 ms, Pipeline Graph Publisher: 2 ms
[withMaven] Publishers: Generated Artifacts Publisher: 127 ms, Junit Publisher: 143 ms, Open
Task Scanner Publisher: 102 ms, Invoker Publisher: 23521 ms, Pipeline Graph Publisher: 1 ms
[Pipeline] // withMaven
[Pipeline] cleanWs
[Pipeline] // withMaven
[WS-CLEANUP] Deleting project workspace...
[WS-CLEANUP] Deferred wipeout is used...
[Pipeline] cleanWs
[Pipeline] // withMaven
[WS-CLEANUP] Deleting project workspace...
[WS-CLEANUP] Deferred wipeout is used...
[Pipeline] cleanWs
[WS-CLEANUP] done
[Pipeline] }
[WS-CLEANUP] done
[Pipeline] // stage
[Pipeline] }
[Pipeline] }
[Pipeline] // ws
[Pipeline] // stage
[Pipeline] }
[Pipeline] }
[Pipeline] // ws
[Pipeline] // node
[Pipeline] }
[Pipeline] }
[WS-CLEANUP] Deleting project workspace...
[WS-CLEANUP] Deferred wipeout is used...
[Pipeline] // node
[Pipeline] }
[WS-CLEANUP] done
[Pipeline] cleanWs
[WS-CLEANUP] Deleting project workspace...
[WS-CLEANUP] Deferred wipeout is used...
[WS-CLEANUP] done
[Pipeline] }
[Pipeline] // stage
[Pipeline] }
[Pipeline] // ws
[Pipeline] }
[Pipeline] // node
[Pipeline] }
Failed in branch linux-jdk13-m3.6.x_build
[Pipeline] // parallel
[Pipeline] stage
[Pipeline] { (Notifications)
[Pipeline] echo
Build result: FAILURE
[Pipeline] jiraIssueSelector
[Pipeline] emailext
Mime
  • Unnamed multipart/mixed (inline, None, 0 bytes)
View raw message