maven-notifications mailing list archives

Site index · List index
Message view « Date » · « Thread »
Top « Date » · « Thread »
From Apache Jenkins Server <jenk...@builds.apache.org>
Subject Build failed in Jenkins: Maven TLP » maven-plugin-testing » master #6
Date Mon, 03 Jun 2019 23:32:32 GMT
See https://builds.apache.org/job/maven-box/job/maven-plugin-testing/job/master/6/

Changes:

* [MNG-6573] Use Maven 3.6.0 as default
* H39 has weird issues, exclude it for now
* Fix no access to currentBuild.rawBuild
* fixed typo
* Include more recent JDKs

All tests passed

Build log:
[...truncated 16241 lines...]
Using target\it-build-target and target\it-build-target\classes to build IT version of plugin
Now Building test version of the plugin...
Using staged plugin-pom: F:\jenkins\jenkins-slave\workspace\-box_maven-plugin-testing_master\m\maven-plugin-testing-tools\target\unit\projects\basic\pom-test.xml
Using IT Plugin Jar: F:\jenkins\jenkins-slave\workspace\-box_maven-plugin-testing_master@2\m\maven-plugin-testing-tools\target\unit\projects\basic\target\it-build-target\maven-it-plugin-test.jar
Using target\it-build-target and target\it-build-target\classes to build IT version of plugin
Now Building test version of the plugin...
Using staged plugin-pom: F:\jenkins\jenkins-slave\workspace\-box_maven-plugin-testing_master@2\m\maven-plugin-testing-tools\target\unit\projects\basic\pom-test.xml
Using IT Plugin Jar: F:\jenkins\jenkins-slave\workspace\-box_maven-plugin-testing_master\m\maven-plugin-testing-tools\target\unit\projects\basic\target\it-build-target\maven-it-plugin-test.jar
Using target\it-build-target and target\it-build-target\classes to build IT version of plugin
Now Building test version of the plugin...
Using staged plugin-pom: F:\jenkins\jenkins-slave\workspace\-box_maven-plugin-testing_master\m\maven-plugin-testing-tools\target\unit\projects\basic\pom-test.xml
[withMaven] Publishers: Pipeline Graph Publisher: 1 ms, Junit Publisher: 4867 ms
[Pipeline] // withMaven
[Pipeline] cleanWs
[WS-CLEANUP] Deleting project workspace...
[WS-CLEANUP] Deferred wipeout is used...
[WS-CLEANUP] done
[Pipeline] }
[Pipeline] // stage
[Pipeline] }
[Pipeline] // node
[Pipeline] }
Using IT Plugin Jar: /home/jenkins/jenkins-slave/workspace/-box_maven-plugin-testing_master/m/maven-plugin-testing-tools/target/unit/projects/basic/target/it-build-target/maven-it-plugin-test.jar
Using target/it-build-target and target/it-build-target/classes to build IT version of plugin
Now Building test version of the plugin...
Using staged plugin-pom: /home/jenkins/jenkins-slave/workspace/-box_maven-plugin-testing_master/m/maven-plugin-testing-tools/target/unit/projects/basic/pom-test.xml
Using IT Plugin Jar: F:\jenkins\jenkins-slave\workspace\-box_maven-plugin-testing_master@2\m\maven-plugin-testing-tools\target\unit\projects\basic\target\it-build-target\maven-it-plugin-test.jar
Using target\it-build-target and target\it-build-target\classes to build IT version of plugin
[INFO] Tests run: 3, Failures: 0, Errors: 0, Skipped: 0, Time elapsed: 19.454 s - in org.apache.maven.shared.test.plugin.ProjectToolTest
[INFO] Running org.apache.maven.shared.test.plugin.RepositoryToolTest
[INFO] Tests run: 1, Failures: 0, Errors: 0, Skipped: 0, Time elapsed: 0.258 s - in org.apache.maven.shared.test.plugin.RepositoryToolTest
[INFO] 
[INFO] Results:
[INFO] 
[INFO] Tests run: 4, Failures: 0, Errors: 0, Skipped: 0
[INFO] 
[INFO] 
[INFO] --- maven-jar-plugin:3.1.0:jar (default-jar) @ maven-plugin-testing-tools ---
[INFO] Building jar: F:\jenkins\jenkins-slave\workspace\-box_maven-plugin-testing_master@2\m\maven-plugin-testing-tools\target\maven-plugin-testing-tools-3.3.1-SNAPSHOT.jar
[INFO] 
[INFO] --- maven-checkstyle-plugin:3.0.0:check (checkstyle-check) @ maven-plugin-testing-tools
---
Using IT Plugin Jar: /home/jenkins/jenkins-slave/workspace/-box_maven-plugin-testing_master/m/maven-plugin-testing-tools/target/unit/projects/basic/target/it-build-target/maven-it-plugin-test.jar
[INFO] ------------------------------------------------------------------------
[INFO] Reactor Summary for Maven Plugin Testing 3.3.1-SNAPSHOT:
[INFO] 
[INFO] Maven Plugin Testing ............................... SUCCESS [ 16.951 s]
[INFO] Maven Plugin Testing Mechanism ..................... SUCCESS [ 16.075 s]
[INFO] Maven Testing Tools ................................ SUCCESS [  1.397 s]
[INFO] Maven Plugin Testing Tools ......................... SUCCESS [ 23.935 s]
[INFO] ------------------------------------------------------------------------
[INFO] BUILD SUCCESS
[INFO] ------------------------------------------------------------------------
[INFO] Total time:  01:00 min
[INFO] Finished at: 2019-06-03T23:32:14Z
[INFO] ------------------------------------------------------------------------
[WARNING] The requested profile "run-its" could not be activated because it does not exist.
[INFO] [jenkins-event-spy] Generated F:\jenkins\jenkins-slave\workspace\-box_maven-plugin-testing_master@2@tmp\withMavena2dc86dd\maven-spy-20190603-233113-4305463274140352739117.log
Picked up JAVA_TOOL_OPTIONS: -Dmaven.ext.class.path="f:\jenkins\jenkins-slave\workspace\-box_maven-plugin-testing_master@2@tmp\withMavena2dc86dd\pipeline-maven-spy.jar"
-Dorg.jenkinsci.plugins.pipeline.maven.reportsFolder="f:\jenkins\jenkins-slave\workspace\-box_maven-plugin-testing_master@2@tmp\withMavena2dc86dd"

Using target/it-build-target and target/it-build-target/classes to build IT version of plugin
[INFO] Tests run: 3, Failures: 0, Errors: 0, Skipped: 0, Time elapsed: 12.565 s - in org.apache.maven.shared.test.plugin.ProjectToolTest
[INFO] 
[INFO] Results:
[INFO] 
[INFO] Tests run: 4, Failures: 0, Errors: 0, Skipped: 0
[INFO] 
[INFO] 
[INFO] --- maven-jar-plugin:3.1.0:jar (default-jar) @ maven-plugin-testing-tools ---
[INFO] Building jar: /home/jenkins/jenkins-slave/workspace/-box_maven-plugin-testing_master/m/maven-plugin-testing-tools/target/maven-plugin-testing-tools-3.3.1-SNAPSHOT.jar
[INFO] 
[INFO] --- maven-checkstyle-plugin:3.0.0:check (checkstyle-check) @ maven-plugin-testing-tools
---
[Pipeline] }
[Pipeline] // dir
[Pipeline] }
[withMaven] junitPublisher - Archive test results for Maven artifact org.apache.maven.plugin-testing:maven-plugin-testing-harness:jar:3.3.1-SNAPSHOT
generated by maven-surefire-plugin:test (default-test): m\maven-plugin-testing-harness\target\surefire-reports\*.xml
[withMaven] junitPublisher - Archive test results for Maven artifact org.apache.maven.plugin-testing:maven-test-tools:jar:3.3.1-SNAPSHOT
generated by maven-surefire-plugin:test (default-test): m\maven-test-tools\target\surefire-reports\*.xml
[withMaven] junitPublisher - Archive test results for Maven artifact org.apache.maven.plugin-testing:maven-plugin-testing-tools:jar:3.3.1-SNAPSHOT
generated by maven-surefire-plugin:test (default-test): m\maven-plugin-testing-tools\target\surefire-reports\*.xml
Recording test results
Using IT Plugin Jar: F:\jenkins\jenkins-slave\workspace\-box_maven-plugin-testing_master\m\maven-plugin-testing-tools\target\unit\projects\basic\target\it-build-target\maven-it-plugin-test.jar
Using target\it-build-target and target\it-build-target\classes to build IT version of plugin
[INFO] Tests run: 3, Failures: 0, Errors: 0, Skipped: 0, Time elapsed: 17.828 s - in org.apache.maven.shared.test.plugin.ProjectToolTest
[INFO] Running org.apache.maven.shared.test.plugin.RepositoryToolTest
[INFO] Tests run: 1, Failures: 0, Errors: 0, Skipped: 0, Time elapsed: 0.374 s - in org.apache.maven.shared.test.plugin.RepositoryToolTest
[INFO] 
[INFO] Results:
[INFO] 
[INFO] Tests run: 4, Failures: 0, Errors: 0, Skipped: 0
[INFO] 
[INFO] 
[INFO] --- maven-jar-plugin:3.1.0:jar (default-jar) @ maven-plugin-testing-tools ---
[INFO] Building jar: F:\jenkins\jenkins-slave\workspace\-box_maven-plugin-testing_master\m\maven-plugin-testing-tools\target\maven-plugin-testing-tools-3.3.1-SNAPSHOT.jar
[INFO] 
[INFO] --- maven-checkstyle-plugin:3.0.0:check (checkstyle-check) @ maven-plugin-testing-tools
---
[INFO] ------------------------------------------------------------------------
[INFO] Reactor Summary for Maven Plugin Testing 3.3.1-SNAPSHOT:
[INFO] 
[INFO] Maven Plugin Testing ............................... SUCCESS [ 19.004 s]
[INFO] Maven Plugin Testing Mechanism ..................... SUCCESS [ 15.424 s]
[INFO] Maven Testing Tools ................................ SUCCESS [  1.843 s]
[INFO] Maven Plugin Testing Tools ......................... SUCCESS [ 17.523 s]
[INFO] ------------------------------------------------------------------------
[INFO] BUILD SUCCESS
[INFO] ------------------------------------------------------------------------
[INFO] Total time:  55.332 s
[INFO] Finished at: 2019-06-03T23:32:14Z
[INFO] ------------------------------------------------------------------------
[WARNING] The requested profile "run-its" could not be activated because it does not exist.
[INFO] [jenkins-event-spy] Generated /home/jenkins/jenkins-slave/workspace/-box_maven-plugin-testing_master@tmp/withMavenf938d40d/maven-spy-20190603-233119-3448442077086335428837.log
[withMaven] Publishers: Pipeline Graph Publisher: 2 ms, Junit Publisher: 486 ms
[Pipeline] // withMaven
[Pipeline] cleanWs
[WS-CLEANUP] Deleting project workspace...
[WS-CLEANUP] Deferred wipeout is used...
[Pipeline] }
[WS-CLEANUP] done
[Pipeline] // dir
[Pipeline] }
[Pipeline] }
[Pipeline] // stage
[Pipeline] }
[Pipeline] // node
[Pipeline] }
[INFO] ------------------------------------------------------------------------
[INFO] Reactor Summary for Maven Plugin Testing 3.3.1-SNAPSHOT:
[INFO] 
[INFO] Maven Plugin Testing ............................... SUCCESS [ 17.207 s]
[INFO] Maven Plugin Testing Mechanism ..................... SUCCESS [ 19.017 s]
[INFO] Maven Testing Tools ................................ SUCCESS [  1.672 s]
[INFO] Maven Plugin Testing Tools ......................... SUCCESS [ 22.267 s]
[INFO] ------------------------------------------------------------------------
[INFO] BUILD SUCCESS
[INFO] ------------------------------------------------------------------------
[INFO] Total time:  01:01 min
[INFO] Finished at: 2019-06-03T23:32:15Z
[INFO] ------------------------------------------------------------------------
[WARNING] The requested profile "run-its" could not be activated because it does not exist.
[INFO] [jenkins-event-spy] Generated F:\jenkins\jenkins-slave\workspace\-box_maven-plugin-testing_master@tmp\withMaven93d50814\maven-spy-20190603-233113-3926233930646352982650.log
Picked up JAVA_TOOL_OPTIONS: -Dmaven.ext.class.path="f:\jenkins\jenkins-slave\workspace\-box_maven-plugin-testing_master@tmp\withMaven93d50814\pipeline-maven-spy.jar"
-Dorg.jenkinsci.plugins.pipeline.maven.reportsFolder="f:\jenkins\jenkins-slave\workspace\-box_maven-plugin-testing_master@tmp\withMaven93d50814"

[withMaven] artifactsPublisher - Archive artifact m/pom.xml under org/apache/maven/plugin-testing/maven-plugin-testing/3.3.1-SNAPSHOT/maven-plugin-testing-3.3.1-SNAPSHOT.pom
[Pipeline] }
[Pipeline] // dir
[Pipeline] }
[withMaven] artifactsPublisher - Archive artifact m/target/maven-plugin-testing-3.3.1-SNAPSHOT-site.xml
under org/apache/maven/plugin-testing/maven-plugin-testing/3.3.1-SNAPSHOT/maven-plugin-testing-3.3.1-SNAPSHOT-site.xml
[withMaven] junitPublisher - Archive test results for Maven artifact org.apache.maven.plugin-testing:maven-plugin-testing-harness:jar:3.3.1-SNAPSHOT
generated by maven-surefire-plugin:test (default-test): m\maven-plugin-testing-harness\target\surefire-reports\*.xml
[withMaven] junitPublisher - Archive test results for Maven artifact org.apache.maven.plugin-testing:maven-test-tools:jar:3.3.1-SNAPSHOT
generated by maven-surefire-plugin:test (default-test): m\maven-test-tools\target\surefire-reports\*.xml
[withMaven] junitPublisher - Archive test results for Maven artifact org.apache.maven.plugin-testing:maven-plugin-testing-tools:jar:3.3.1-SNAPSHOT
generated by maven-surefire-plugin:test (default-test): m\maven-plugin-testing-tools\target\surefire-reports\*.xml
Recording test results
[withMaven] artifactsPublisher - Archive artifact m/maven-plugin-testing-harness/pom.xml under
org/apache/maven/plugin-testing/maven-plugin-testing-harness/3.3.1-SNAPSHOT/maven-plugin-testing-harness-3.3.1-SNAPSHOT.pom
[withMaven] Publishers: Pipeline Graph Publisher: 1 ms, Junit Publisher: 468 ms
[Pipeline] // withMaven
[Pipeline] cleanWs
[WS-CLEANUP] Deleting project workspace...
[WS-CLEANUP] Deferred wipeout is used...
[WS-CLEANUP] done
[Pipeline] }
[withMaven] artifactsPublisher - Archive artifact m/maven-plugin-testing-harness/target/maven-plugin-testing-harness-3.3.1-SNAPSHOT.jar
under org/apache/maven/plugin-testing/maven-plugin-testing-harness/3.3.1-SNAPSHOT/maven-plugin-testing-harness-3.3.1-SNAPSHOT.jar
[Pipeline] // stage
[Pipeline] }
[Pipeline] // node
[Pipeline] }
[withMaven] artifactsPublisher - Archive artifact m/maven-plugin-testing-harness/target/maven-plugin-testing-harness-3.3.1-SNAPSHOT-sources.jar
under org/apache/maven/plugin-testing/maven-plugin-testing-harness/3.3.1-SNAPSHOT/maven-plugin-testing-harness-3.3.1-SNAPSHOT-sources.jar
[withMaven] artifactsPublisher - Archive artifact m/maven-test-tools/pom.xml under org/apache/maven/plugin-testing/maven-test-tools/3.3.1-SNAPSHOT/maven-test-tools-3.3.1-SNAPSHOT.pom
Using IT Plugin Jar: F:\jenkins\jenkins-slave\workspace\-box_maven-plugin-testing_master\m\maven-plugin-testing-tools\target\unit\projects\basic\target\it-build-target\maven-it-plugin-test.jar
Using target\it-build-target and target\it-build-target\classes to build IT version of plugin
Now Building test version of the plugin...
Using staged plugin-pom: F:\jenkins\jenkins-slave\workspace\-box_maven-plugin-testing_master\m\maven-plugin-testing-tools\target\unit\projects\basic\pom-test.xml
[withMaven] artifactsPublisher - Archive artifact m/maven-test-tools/target/maven-test-tools-3.3.1-SNAPSHOT.jar
under org/apache/maven/plugin-testing/maven-test-tools/3.3.1-SNAPSHOT/maven-test-tools-3.3.1-SNAPSHOT.jar
[withMaven] artifactsPublisher - Archive artifact m/maven-plugin-testing-tools/pom.xml under
org/apache/maven/plugin-testing/maven-plugin-testing-tools/3.3.1-SNAPSHOT/maven-plugin-testing-tools-3.3.1-SNAPSHOT.pom
[withMaven] artifactsPublisher - Archive artifact m/maven-plugin-testing-tools/target/maven-plugin-testing-tools-3.3.1-SNAPSHOT.jar
under org/apache/maven/plugin-testing/maven-plugin-testing-tools/3.3.1-SNAPSHOT/maven-plugin-testing-tools-3.3.1-SNAPSHOT.jar
[withMaven] junitPublisher - Archive test results for Maven artifact org.apache.maven.plugin-testing:maven-plugin-testing-harness:jar:3.3.1-SNAPSHOT
generated by maven-surefire-plugin:test (default-test): m/maven-plugin-testing-harness/target/surefire-reports/*.xml
[withMaven] junitPublisher - Archive test results for Maven artifact org.apache.maven.plugin-testing:maven-test-tools:jar:3.3.1-SNAPSHOT
generated by maven-surefire-plugin:test (default-test): m/maven-test-tools/target/surefire-reports/*.xml
[withMaven] junitPublisher - Archive test results for Maven artifact org.apache.maven.plugin-testing:maven-plugin-testing-tools:jar:3.3.1-SNAPSHOT
generated by maven-surefire-plugin:test (default-test): m/maven-plugin-testing-tools/target/surefire-reports/*.xml
Recording test results
[withMaven] openTasksPublisher - Scan Tasks for Maven artifact org.apache.maven.plugin-testing:maven-plugin-testing-harness:jar:3.3.1-SNAPSHOT
in source directory m/maven-plugin-testing-harness/src/main/java
Using IT Plugin Jar: F:\jenkins\jenkins-slave\workspace\-box_maven-plugin-testing_master\m\maven-plugin-testing-tools\target\unit\projects\basic\target\it-build-target\maven-it-plugin-test.jar
Using target\it-build-target and target\it-build-target\classes to build IT version of plugin
[INFO] Tests run: 3, Failures: 0, Errors: 0, Skipped: 0, Time elapsed: 26.187 s - in org.apache.maven.shared.test.plugin.ProjectToolTest
[INFO] Running org.apache.maven.shared.test.plugin.RepositoryToolTest
[INFO] Tests run: 1, Failures: 0, Errors: 0, Skipped: 0, Time elapsed: 0.425 s - in org.apache.maven.shared.test.plugin.RepositoryToolTest
[INFO] 
[INFO] Results:
[INFO] 
[INFO] Tests run: 4, Failures: 0, Errors: 0, Skipped: 0
[INFO] 
[INFO] 
[INFO] --- maven-jar-plugin:3.1.0:jar (default-jar) @ maven-plugin-testing-tools ---
[INFO] Building jar: F:\jenkins\jenkins-slave\workspace\-box_maven-plugin-testing_master\m\maven-plugin-testing-tools\target\maven-plugin-testing-tools-3.3.1-SNAPSHOT.jar
[withMaven] openTasksPublisher - Scan Tasks for Maven artifact org.apache.maven.plugin-testing:maven-test-tools:jar:3.3.1-SNAPSHOT
in source directory m/maven-test-tools/src/main/java
[withMaven] openTasksPublisher - Scan Tasks for Maven artifact org.apache.maven.plugin-testing:maven-plugin-testing-tools:jar:3.3.1-SNAPSHOT
in source directory m/maven-plugin-testing-tools/src/main/java
[INFO] 
[INFO] --- maven-checkstyle-plugin:3.0.0:check (checkstyle-check) @ maven-plugin-testing-tools
---
[TASKS] Scanning folder '/home/jenkins/jenkins-slave/workspace/-box_maven-plugin-testing_master'
for files matching the pattern 'm/maven-plugin-testing-harness/src/main/java/**/*,m/maven-test-tools/src/main/java/**/*,m/maven-plugin-testing-tools/src/main/java/**/*'
- excludes: null
[TASKS] Found 25 files to scan for tasks
[TASKS] Found 13 open tasks.
Skipping warnings blame since pipelines do not have an SCM link.%n
[TASKS] Computing warning deltas based on reference build #5
[INFO] ------------------------------------------------------------------------
[INFO] Reactor Summary for Maven Plugin Testing 3.3.1-SNAPSHOT:
[INFO] 
[INFO] Maven Plugin Testing ............................... SUCCESS [ 21.568 s]
[INFO] Maven Plugin Testing Mechanism ..................... SUCCESS [ 17.869 s]
[INFO] Maven Testing Tools ................................ SUCCESS [  1.355 s]
[INFO] Maven Plugin Testing Tools ......................... SUCCESS [ 31.345 s]
[INFO] ------------------------------------------------------------------------
[INFO] BUILD SUCCESS
[INFO] ------------------------------------------------------------------------
[INFO] Total time:  01:13 min
[INFO] Finished at: 2019-06-03T23:32:27Z
[INFO] ------------------------------------------------------------------------
[WARNING] The requested profile "run-its" could not be activated because it does not exist.
[INFO] [jenkins-event-spy] Generated F:\jenkins\jenkins-slave\workspace\-box_maven-plugin-testing_master@tmp\withMavenbebed8ef\maven-spy-20190603-233112-81010598539693838068875.log
[Pipeline] }
[Pipeline] // dir
[Pipeline] }
[withMaven] junitPublisher - Archive test results for Maven artifact org.apache.maven.plugin-testing:maven-plugin-testing-harness:jar:3.3.1-SNAPSHOT
generated by maven-surefire-plugin:test (default-test): m\maven-plugin-testing-harness\target\surefire-reports\*.xml
[withMaven] junitPublisher - Archive test results for Maven artifact org.apache.maven.plugin-testing:maven-test-tools:jar:3.3.1-SNAPSHOT
generated by maven-surefire-plugin:test (default-test): m\maven-test-tools\target\surefire-reports\*.xml
[withMaven] junitPublisher - Archive test results for Maven artifact org.apache.maven.plugin-testing:maven-plugin-testing-tools:jar:3.3.1-SNAPSHOT
generated by maven-surefire-plugin:test (default-test): m\maven-plugin-testing-tools\target\surefire-reports\*.xml
Recording test results
[withMaven] Publishers: Pipeline Graph Publisher: 3 ms, Generated Artifacts Publisher: 3839
ms, Junit Publisher: 4809 ms, Open Task Scanner Publisher: 1770 ms
[withMaven] Publishers: Pipeline Graph Publisher: 3 ms, Junit Publisher: 518 ms
[Pipeline] // withMaven
[Pipeline] cleanWs
[WS-CLEANUP] Deleting project workspace...
[WS-CLEANUP] Deferred wipeout is used...
[WS-CLEANUP] done
[Pipeline] }
[Pipeline] // stage
[Pipeline] // withMaven
[Pipeline] }
[Pipeline] cleanWs
[Pipeline] // node
[Pipeline] }
[WS-CLEANUP] Deleting project workspace...
[WS-CLEANUP] Deferred wipeout is used...
[WS-CLEANUP] done
[Pipeline] }
[Pipeline] // stage
[Pipeline] }
[Pipeline] // node
[Pipeline] }
[Pipeline] // parallel
[Pipeline] echo
[FAILURE-003] AbortException hudson.AbortException: script returned exit code 1
[Pipeline] stage
[Pipeline] { (Notifications)
[Pipeline] echo
Build result: FAILURE
[Pipeline] jiraIssueSelector
[Pipeline] jiraComment
[Pipeline] emailext
Mime
  • Unnamed multipart/mixed (inline, None, 0 bytes)
View raw message