maven-notifications mailing list archives

Site index · List index
Message view « Date » · « Thread »
Top « Date » · « Thread »
From Apache Jenkins Server <jenk...@builds.apache.org>
Subject Build failed in Jenkins: Maven TLP » maven-surefire » no_user.dir #6
Date Tue, 04 Jun 2019 09:32:02 GMT
See https://builds.apache.org/job/maven-box/job/maven-surefire/job/no_user.dir/6/

Changes:

* [MNG-6573] Use Maven 3.6.0 as default
* H39 has weird issues, exclude it for now
* Fix no access to currentBuild.rawBuild
* fixed typo
* Include more recent JDKs

2 tests failed.
FAILED:  org.apache.maven.surefire.its.JUnitPlatformEnginesIT.platform[1.4.0-SNAPSHOT]

Error Message:

Expected: <[\[DEBUG\] test\(compact\) classpath:  test-classes  classes  junit-jupiter-engine-5\.4\.0-SNAPSHOT\.jar  apiguardian-api-1\.0\.0\.jar  junit-platform-engine-1\.4\.0-SNAPSHOT\.jar  junit-platform-commons-1\.4\.0-SNAPSHOT\.jar  opentest4j-1\.1\.1\.jar  junit-jupiter-api-5\.4\.0-SNAPSHOT\.jar]>
     but: was <[[DEBUG] test(compact) classpath:  test-classes  classes  junit-jupiter-engine-5.4.0-SNAPSHOT.jar  apiguardian-api-1.0.0.jar  junit-platform-engine-1.4.0-SNAPSHOT.jar  opentest4j-1.1.1.jar  junit-platform-commons-1.4.0-SNAPSHOT.jar  junit-jupiter-api-5.4.0-SNAPSHOT.jar]>

Stack Trace:
java.lang.AssertionError: 

Expected: <[\[DEBUG\] test\(compact\) classpath:  test-classes  classes  junit-jupiter-engine-5\.4\.0-SNAPSHOT\.jar  apiguardian-api-1\.0\.0\.jar  junit-platform-engine-1\.4\.0-SNAPSHOT\.jar  junit-platform-commons-1\.4\.0-SNAPSHOT\.jar  opentest4j-1\.1\.1\.jar  junit-jupiter-api-5\.4\.0-SNAPSHOT\.jar]>
     but: was <[[DEBUG] test(compact) classpath:  test-classes  classes  junit-jupiter-engine-5.4.0-SNAPSHOT.jar  apiguardian-api-1.0.0.jar  junit-platform-engine-1.4.0-SNAPSHOT.jar  opentest4j-1.1.1.jar  junit-platform-commons-1.4.0-SNAPSHOT.jar  junit-jupiter-api-5.4.0-SNAPSHOT.jar]>
	at org.apache.maven.surefire.its.JUnitPlatformEnginesIT.platform(JUnitPlatformEnginesIT.java:111)


FAILED:  org.apache.maven.surefire.its.WorkingDirectoryIT.testWorkingDirectoryNoFork

Error Message:
Exit code was non-zero: 1; command line and log = 
/home/jenkins/tools/maven/apache-maven-3.6.0/bin/mvn -e --batch-mode -Dmaven.repo.local=/home/jenkins/jenkins-slave/workspace/n-box_maven-surefire_no_user.dir@2/.m2 org.apache.maven.plugins:maven-clean-plugin:clean -Dsurefire.version=3.0.0-M4-SNAPSHOT -Djacoco.agent=-javaagent:/home/jenkins/jenkins-slave/workspace/n-box_maven-surefire_no_user.dir@2/.m2/org/jacoco/org.jacoco.agent/0.8.3/org.jacoco.agent-0.8.3-runtime.jar=destfile=/home/jenkins/jenkins-slave/workspace/n-box_maven-surefire_no_user.dir@2/surefire-its/target/jacoco-it.exec,append=true,includes=**/failsafe/*:**/failsafe/**/*:**/surefire/*:**/surefire/**/*,inclnolocationclasses=true,jmx=false -Dhttps.protocols=TLSv1,TLSv1.1,TLSv1.2 -DforkMode=never test
[INFO] Error stacktraces are turned on.
[INFO] Scanning for projects...
[INFO] ------------------------------------------------------------------------
[INFO] Reactor Build Order:
[INFO] 
[INFO] Test for working directory configuration (parent)                  [pom]
[INFO] Test for working directory configuration                           [jar]
[INFO] 
[INFO] --------< org.apache.maven.plugins.surefire:working-directory >---------
[INFO] Building Test for working directory configuration (parent) 1.0-SNAPSHOT [1/2]
[INFO] --------------------------------[ pom ]---------------------------------
[INFO] 
[INFO] --- maven-clean-plugin:2.5:clean (default-cli) @ working-directory ---
[INFO] 
[INFO] -----< org.apache.maven.plugins.surefire:working-directory-child >------
[INFO] Building Test for working directory configuration 1.0-SNAPSHOT     [2/2]
[INFO] --------------------------------[ jar ]---------------------------------
[INFO] 
[INFO] --- maven-clean-plugin:2.5:clean (default-cli) @ working-directory-child ---
[INFO] 
[INFO] --- maven-resources-plugin:2.6:resources (default-resources) @ working-directory-child ---
[WARNING] Using platform encoding (ISO-8859-1 actually) to copy filtered resources, i.e. build is platform dependent!
[INFO] skip non existing resourceDirectory /home/jenkins/jenkins-slave/workspace/n-box_maven-surefire_no_user.dir@2/surefire-its/target/WorkingDirectoryIT_testWorkingDirectoryNoFork/child/src/main/resources
[INFO] 
[INFO] --- maven-compiler-plugin:3.1:compile (default-compile) @ working-directory-child ---
[INFO] No sources to compile
[INFO] 
[INFO] --- maven-resources-plugin:2.6:testResources (default-testResources) @ working-directory-child ---
[WARNING] Using platform encoding (ISO-8859-1 actually) to copy filtered resources, i.e. build is platform dependent!
[INFO] skip non existing resourceDirectory /home/jenkins/jenkins-slave/workspace/n-box_maven-surefire_no_user.dir@2/surefire-its/target/WorkingDirectoryIT_testWorkingDirectoryNoFork/child/src/test/resources
[INFO] 
[INFO] --- maven-compiler-plugin:3.1:testCompile (default-testCompile) @ working-directory-child ---
[INFO] Changes detected - recompiling the module!
[WARNING] File encoding has not been set, using platform encoding ISO-8859-1, i.e. build is platform dependent!
[INFO] Compiling 1 source file to /home/jenkins/jenkins-slave/workspace/n-box_maven-surefire_no_user.dir@2/surefire-its/target/WorkingDirectoryIT_testWorkingDirectoryNoFork/child/target/test-classes
[INFO] 
[INFO] --- maven-surefire-plugin:3.0.0-M4-SNAPSHOT:test (default-test) @ working-directory-child ---
[WARNING] The parameter forkMode is deprecated since version 2.14. Use forkCount and reuseForks instead.
[WARNING] useSystemClassloader setting has no effect when not forking
[INFO] Surefire report directory: /home/jenkins/jenkins-slave/workspace/n-box_maven-surefire_no_user.dir@2/surefire-its/target/WorkingDirectoryIT_testWorkingDirectoryNoFork/child/target/surefire-reports
[INFO] Running workingDir.BasicTest
[ERROR] Tests run: 1, Failures: 0, Errors: 1, Skipped: 0, Time elapsed: 0.013 s <<< FAILURE! - in workingDir.BasicTest
[ERROR] workingDir.BasicTest.testWorkingDir  Time elapsed: 0.003 s  <<< ERROR!
java.io.IOException: No such file or directory
 at java.base/java.io.UnixFileSystem.createFileExclusively(Native Method)
 at java.base/java.io.File.createNewFile(File.java:1024)
 at workingDir.BasicTest.testWorkingDir(BasicTest.java:36)

[INFO] 
[INFO] Results:
[INFO] 
[ERROR] Errors: 
[ERROR]   workingDir.BasicTest#testWorkingDir IOException No such file or directory
[INFO] 
[ERROR] Tests run: 1, Failures: 0, Errors: 1, Skipped: 0
[INFO] 
[INFO] ------------------------------------------------------------------------
[INFO] Reactor Summary for Test for working directory configuration (parent) 1.0-SNAPSHOT:
[INFO] 
[INFO] Test for working directory configuration (parent) .. SUCCESS [  0.139 s]
[INFO] Test for working directory configuration ........... FAILURE [  2.306 s]
[INFO] ------------------------------------------------------------------------
[INFO] BUILD FAILURE
[INFO] ------------------------------------------------------------------------
[INFO] Total time:  2.683 s
[INFO] Finished at: 2019-06-04T07:22:48Z
[INFO] ------------------------------------------------------------------------
[ERROR] Failed to execute goal org.apache.maven.plugins:maven-surefire-plugin:3.0.0-M4-SNAPSHOT:test (default-test) on project working-directory-child: There are test failures.
[ERROR] 
[ERROR] Please refer to /home/jenkins/jenkins-slave/workspace/n-box_maven-surefire_no_user.dir@2/surefire-its/target/WorkingDirectoryIT_testWorkingDirectoryNoFork/child/target/surefire-reports for the individual test results.
[ERROR] Please refer to dump files (if any exist) [date].dump, [date]-jvmRun[N].dump and [date].dumpstream.
[ERROR] -> [Help 1]
org.apache.maven.lifecycle.LifecycleExecutionException: Failed to execute goal org.apache.maven.plugins:maven-surefire-plugin:3.0.0-M4-SNAPSHOT:test (default-test) on project working-directory-child: There are test failures.

Please refer to /home/jenkins/jenkins-slave/workspace/n-box_maven-surefire_no_user.dir@2/surefire-its/target/WorkingDirectoryIT_testWorkingDirectoryNoFork/child/target/surefire-reports for the individual test results.
Please refer to dump files (if any exist) [date].dump, [date]-jvmRun[N].dump and [date].dumpstream.
    at org.apache.maven.lifecycle.internal.MojoExecutor.execute (MojoExecutor.java:215)
    at org.apache.maven.lifecycle.internal.MojoExecutor.execute (MojoExecutor.java:156)
    at org.apache.maven.lifecycle.internal.MojoExecutor.execute (MojoExecutor.java:148)
    at org.apache.maven.lifecycle.internal.LifecycleModuleBuilder.buildProject (LifecycleModuleBuilder.java:117)
    at org.apache.maven.lifecycle.internal.LifecycleModuleBuilder.buildProject (LifecycleModuleBuilder.java:81)
    at org.apache.maven.lifecycle.internal.builder.singlethreaded.SingleThreadedBuilder.build (SingleThreadedBuilder.java:56)
    at org.apache.maven.lifecycle.internal.LifecycleStarter.execute (LifecycleStarter.java:128)
    at org.apache.maven.DefaultMaven.doExecute (DefaultMaven.java:305)
    at org.apache.maven.DefaultMaven.doExecute (DefaultMaven.java:192)
    at org.apache.maven.DefaultMaven.execute (DefaultMaven.java:105)
    at org.apache.maven.cli.MavenCli.execute (MavenCli.java:956)
    at org.apache.maven.cli.MavenCli.doMain (MavenCli.java:288)
    at org.apache.maven.cli.MavenCli.main (MavenCli.java:192)
    at jdk.internal.reflect.NativeMethodAccessorImpl.invoke0 (Native Method)
    at jdk.internal.reflect.NativeMethodAccessorImpl.invoke (NativeMethodAccessorImpl.java:62)
    at jdk.internal.reflect.DelegatingMethodAccessorImpl.invoke (DelegatingMethodAccessorImpl.java:43)
    at java.lang.reflect.Method.invoke (Method.java:567)
    at org.codehaus.plexus.classworlds.launcher.Launcher.launchEnhanced (Launcher.java:289)
    at org.codehaus.plexus.classworlds.launcher.Launcher.launch (Launcher.java:229)
    at org.codehaus.plexus.classworlds.launcher.Launcher.mainWithExitCode (Launcher.java:415)
    at org.codehaus.plexus.classworlds.launcher.Launcher.main (Launcher.java:356)
Caused by: org.apache.maven.plugin.MojoFailureException: There are test failures.

Please refer to /home/jenkins/jenkins-slave/workspace/n-box_maven-surefire_no_user.dir@2/surefire-its/target/WorkingDirectoryIT_testWorkingDirectoryNoFork/child/target/surefire-reports for the individual test results.
Please refer to dump files (if any exist) [date].dump, [date]-jvmRun[N].dump and [date].dumpstream.
    at org.apache.maven.plugin.surefire.SurefireHelper.throwException (SurefireHelper.java:271)
    at org.apache.maven.plugin.surefire.SurefireHelper.reportExecution (SurefireHelper.java:159)
    at org.apache.maven.plugin.surefire.SurefirePlugin.handleSummary (SurefirePlugin.java:373)
    at org.apache.maven.plugin.surefire.AbstractSurefireMojo.executeAfterPreconditionsChecked (AbstractSurefireMojo.java:1011)
    at org.apache.maven.plugin.surefire.AbstractSurefireMojo.execute (AbstractSurefireMojo.java:841)
    at org.apache.maven.plugin.DefaultBuildPluginManager.executeMojo (DefaultBuildPluginManager.java:137)
    at org.apache.maven.lifecycle.internal.MojoExecutor.execute (MojoExecutor.java:210)
    at org.apache.maven.lifecycle.internal.MojoExecutor.execute (MojoExecutor.java:156)
    at org.apache.maven.lifecycle.internal.MojoExecutor.execute (MojoExecutor.java:148)
    at org.apache.maven.lifecycle.internal.LifecycleModuleBuilder.buildProject (LifecycleModuleBuilder.java:117)
    at org.apache.maven.lifecycle.internal.LifecycleModuleBuilder.buildProject (LifecycleModuleBuilder.java:81)
    at org.apache.maven.lifecycle.internal.builder.singlethreaded.SingleThreadedBuilder.build (SingleThreadedBuilder.java:56)
    at org.apache.maven.lifecycle.internal.LifecycleStarter.execute (LifecycleStarter.java:128)
    at org.apache.maven.DefaultMaven.doExecute (DefaultMaven.java:305)
    at org.apache.maven.DefaultMaven.doExecute (DefaultMaven.java:192)
    at org.apache.maven.DefaultMaven.execute (DefaultMaven.java:105)
    at org.apache.maven.cli.MavenCli.execute (MavenCli.java:956)
    at org.apache.maven.cli.MavenCli.doMain (MavenCli.java:288)
    at org.apache.maven.cli.MavenCli.main (MavenCli.java:192)
    at jdk.internal.reflect.NativeMethodAccessorImpl.invoke0 (Native Method)
    at jdk.internal.reflect.NativeMethodAccessorImpl.invoke (NativeMethodAccessorImpl.java:62)
    at jdk.internal.reflect.DelegatingMethodAccessorImpl.invoke (DelegatingMethodAccessorImpl.java:43)
    at java.lang.reflect.Method.invoke (Method.java:567)
    at org.codehaus.plexus.classworlds.launcher.Launcher.launchEnhanced (Launcher.java:289)
    at org.codehaus.plexus.classworlds.launcher.Launcher.launch (Launcher.java:229)
    at org.codehaus.plexus.classworlds.launcher.Launcher.mainWithExitCode (Launcher.java:415)
    at org.codehaus.plexus.classworlds.launcher.Launcher.main (Launcher.java:356)
[ERROR] 
[ERROR] Re-run Maven using the -X switch to enable full debug logging.
[ERROR] 
[ERROR] For more information about the errors and possible solutions, please read the following articles:
[ERROR] [Help 1] http://cwiki.apache.org/confluence/display/MAVEN/MojoFailureException
[ERROR] 
[ERROR] After correcting the problems, you can resume the build with the command
[ERROR]   mvn <goals> -rf :working-directory-child


Stack Trace:
org.apache.maven.surefire.its.fixture.SurefireVerifierException: 
Exit code was non-zero: 1; command line and log = 
/home/jenkins/tools/maven/apache-maven-3.6.0/bin/mvn -e --batch-mode -Dmaven.repo.local=/home/jenkins/jenkins-slave/workspace/n-box_maven-surefire_no_user.dir@2/.m2 org.apache.maven.plugins:maven-clean-plugin:clean -Dsurefire.version=3.0.0-M4-SNAPSHOT -Djacoco.agent=-javaagent:/home/jenkins/jenkins-slave/workspace/n-box_maven-surefire_no_user.dir@2/.m2/org/jacoco/org.jacoco.agent/0.8.3/org.jacoco.agent-0.8.3-runtime.jar=destfile=/home/jenkins/jenkins-slave/workspace/n-box_maven-surefire_no_user.dir@2/surefire-its/target/jacoco-it.exec,append=true,includes=**/failsafe/*:**/failsafe/**/*:**/surefire/*:**/surefire/**/*,inclnolocationclasses=true,jmx=false -Dhttps.protocols=TLSv1,TLSv1.1,TLSv1.2 -DforkMode=never test
[INFO] Error stacktraces are turned on.
[INFO] Scanning for projects...
[INFO] ------------------------------------------------------------------------
[INFO] Reactor Build Order:
[INFO] 
[INFO] Test for working directory configuration (parent)                  [pom]
[INFO] Test for working directory configuration                           [jar]
[INFO] 
[INFO] --------< org.apache.maven.plugins.surefire:working-directory >---------
[INFO] Building Test for working directory configuration (parent) 1.0-SNAPSHOT [1/2]
[INFO] --------------------------------[ pom ]---------------------------------
[INFO] 
[INFO] --- maven-clean-plugin:2.5:clean (default-cli) @ working-directory ---
[INFO] 
[INFO] -----< org.apache.maven.plugins.surefire:working-directory-child >------
[INFO] Building Test for working directory configuration 1.0-SNAPSHOT     [2/2]
[INFO] --------------------------------[ jar ]---------------------------------
[INFO] 
[INFO] --- maven-clean-plugin:2.5:clean (default-cli) @ working-directory-child ---
[INFO] 
[INFO] --- maven-resources-plugin:2.6:resources (default-resources) @ working-directory-child ---
[WARNING] Using platform encoding (ISO-8859-1 actually) to copy filtered resources, i.e. build is platform dependent!
[INFO] skip non existing resourceDirectory /home/jenkins/jenkins-slave/workspace/n-box_maven-surefire_no_user.dir@2/surefire-its/target/WorkingDirectoryIT_testWorkingDirectoryNoFork/child/src/main/resources
[INFO] 
[INFO] --- maven-compiler-plugin:3.1:compile (default-compile) @ working-directory-child ---
[INFO] No sources to compile
[INFO] 
[INFO] --- maven-resources-plugin:2.6:testResources (default-testResources) @ working-directory-child ---
[WARNING] Using platform encoding (ISO-8859-1 actually) to copy filtered resources, i.e. build is platform dependent!
[INFO] skip non existing resourceDirectory /home/jenkins/jenkins-slave/workspace/n-box_maven-surefire_no_user.dir@2/surefire-its/target/WorkingDirectoryIT_testWorkingDirectoryNoFork/child/src/test/resources
[INFO] 
[INFO] --- maven-compiler-plugin:3.1:testCompile (default-testCompile) @ working-directory-child ---
[INFO] Changes detected - recompiling the module!
[WARNING] File encoding has not been set, using platform encoding ISO-8859-1, i.e. build is platform dependent!
[INFO] Compiling 1 source file to /home/jenkins/jenkins-slave/workspace/n-box_maven-surefire_no_user.dir@2/surefire-its/target/WorkingDirectoryIT_testWorkingDirectoryNoFork/child/target/test-classes
[INFO] 
[INFO] --- maven-surefire-plugin:3.0.0-M4-SNAPSHOT:test (default-test) @ working-directory-child ---
[WARNING] The parameter forkMode is deprecated since version 2.14. Use forkCount and reuseForks instead.
[WARNING] useSystemClassloader setting has no effect when not forking
[INFO] Surefire report directory: /home/jenkins/jenkins-slave/workspace/n-box_maven-surefire_no_user.dir@2/surefire-its/target/WorkingDirectoryIT_testWorkingDirectoryNoFork/child/target/surefire-reports
[INFO] Running workingDir.BasicTest
[ERROR] Tests run: 1, Failures: 0, Errors: 1, Skipped: 0, Time elapsed: 0.013 s <<< FAILURE! - in workingDir.BasicTest
[ERROR] workingDir.BasicTest.testWorkingDir  Time elapsed: 0.003 s  <<< ERROR!
java.io.IOException: No such file or directory
	at java.base/java.io.UnixFileSystem.createFileExclusively(Native Method)
	at java.base/java.io.File.createNewFile(File.java:1024)
	at workingDir.BasicTest.testWorkingDir(BasicTest.java:36)

[INFO] 
[INFO] Results:
[INFO] 
[ERROR] Errors: 
[ERROR]   workingDir.BasicTest#testWorkingDir IOException No such file or directory
[INFO] 
[ERROR] Tests run: 1, Failures: 0, Errors: 1, Skipped: 0
[INFO] 
[INFO] ------------------------------------------------------------------------
[INFO] Reactor Summary for Test for working directory configuration (parent) 1.0-SNAPSHOT:
[INFO] 
[INFO] Test for working directory configuration (parent) .. SUCCESS [  0.139 s]
[INFO] Test for working directory configuration ........... FAILURE [  2.306 s]
[INFO] ------------------------------------------------------------------------
[INFO] BUILD FAILURE
[INFO] ------------------------------------------------------------------------
[INFO] Total time:  2.683 s
[INFO] Finished at: 2019-06-04T07:22:48Z
[INFO] ------------------------------------------------------------------------
[ERROR] Failed to execute goal org.apache.maven.plugins:maven-surefire-plugin:3.0.0-M4-SNAPSHOT:test (default-test) on project working-directory-child: There are test failures.
[ERROR] 
[ERROR] Please refer to /home/jenkins/jenkins-slave/workspace/n-box_maven-surefire_no_user.dir@2/surefire-its/target/WorkingDirectoryIT_testWorkingDirectoryNoFork/child/target/surefire-reports for the individual test results.
[ERROR] Please refer to dump files (if any exist) [date].dump, [date]-jvmRun[N].dump and [date].dumpstream.
[ERROR] -> [Help 1]
org.apache.maven.lifecycle.LifecycleExecutionException: Failed to execute goal org.apache.maven.plugins:maven-surefire-plugin:3.0.0-M4-SNAPSHOT:test (default-test) on project working-directory-child: There are test failures.

Please refer to /home/jenkins/jenkins-slave/workspace/n-box_maven-surefire_no_user.dir@2/surefire-its/target/WorkingDirectoryIT_testWorkingDirectoryNoFork/child/target/surefire-reports for the individual test results.
Please refer to dump files (if any exist) [date].dump, [date]-jvmRun[N].dump and [date].dumpstream.
    at org.apache.maven.lifecycle.internal.MojoExecutor.execute (MojoExecutor.java:215)
    at org.apache.maven.lifecycle.internal.MojoExecutor.execute (MojoExecutor.java:156)
    at org.apache.maven.lifecycle.internal.MojoExecutor.execute (MojoExecutor.java:148)
    at org.apache.maven.lifecycle.internal.LifecycleModuleBuilder.buildProject (LifecycleModuleBuilder.java:117)
    at org.apache.maven.lifecycle.internal.LifecycleModuleBuilder.buildProject (LifecycleModuleBuilder.java:81)
    at org.apache.maven.lifecycle.internal.builder.singlethreaded.SingleThreadedBuilder.build (SingleThreadedBuilder.java:56)
    at org.apache.maven.lifecycle.internal.LifecycleStarter.execute (LifecycleStarter.java:128)
    at org.apache.maven.DefaultMaven.doExecute (DefaultMaven.java:305)
    at org.apache.maven.DefaultMaven.doExecute (DefaultMaven.java:192)
    at org.apache.maven.DefaultMaven.execute (DefaultMaven.java:105)
    at org.apache.maven.cli.MavenCli.execute (MavenCli.java:956)
    at org.apache.maven.cli.MavenCli.doMain (MavenCli.java:288)
    at org.apache.maven.cli.MavenCli.main (MavenCli.java:192)
    at jdk.internal.reflect.NativeMethodAccessorImpl.invoke0 (Native Method)
    at jdk.internal.reflect.NativeMethodAccessorImpl.invoke (NativeMethodAccessorImpl.java:62)
    at jdk.internal.reflect.DelegatingMethodAccessorImpl.invoke (DelegatingMethodAccessorImpl.java:43)
    at java.lang.reflect.Method.invoke (Method.java:567)
    at org.codehaus.plexus.classworlds.launcher.Launcher.launchEnhanced (Launcher.java:289)
    at org.codehaus.plexus.classworlds.launcher.Launcher.launch (Launcher.java:229)
    at org.codehaus.plexus.classworlds.launcher.Launcher.mainWithExitCode (Launcher.java:415)
    at org.codehaus.plexus.classworlds.launcher.Launcher.main (Launcher.java:356)
Caused by: org.apache.maven.plugin.MojoFailureException: There are test failures.

Please refer to /home/jenkins/jenkins-slave/workspace/n-box_maven-surefire_no_user.dir@2/surefire-its/target/WorkingDirectoryIT_testWorkingDirectoryNoFork/child/target/surefire-reports for the individual test results.
Please refer to dump files (if any exist) [date].dump, [date]-jvmRun[N].dump and [date].dumpstream.
    at org.apache.maven.plugin.surefire.SurefireHelper.throwException (SurefireHelper.java:271)
    at org.apache.maven.plugin.surefire.SurefireHelper.reportExecution (SurefireHelper.java:159)
    at org.apache.maven.plugin.surefire.SurefirePlugin.handleSummary (SurefirePlugin.java:373)
    at org.apache.maven.plugin.surefire.AbstractSurefireMojo.executeAfterPreconditionsChecked (AbstractSurefireMojo.java:1011)
    at org.apache.maven.plugin.surefire.AbstractSurefireMojo.execute (AbstractSurefireMojo.java:841)
    at org.apache.maven.plugin.DefaultBuildPluginManager.executeMojo (DefaultBuildPluginManager.java:137)
    at org.apache.maven.lifecycle.internal.MojoExecutor.execute (MojoExecutor.java:210)
    at org.apache.maven.lifecycle.internal.MojoExecutor.execute (MojoExecutor.java:156)
    at org.apache.maven.lifecycle.internal.MojoExecutor.execute (MojoExecutor.java:148)
    at org.apache.maven.lifecycle.internal.LifecycleModuleBuilder.buildProject (LifecycleModuleBuilder.java:117)
    at org.apache.maven.lifecycle.internal.LifecycleModuleBuilder.buildProject (LifecycleModuleBuilder.java:81)
    at org.apache.maven.lifecycle.internal.builder.singlethreaded.SingleThreadedBuilder.build (SingleThreadedBuilder.java:56)
    at org.apache.maven.lifecycle.internal.LifecycleStarter.execute (LifecycleStarter.java:128)
    at org.apache.maven.DefaultMaven.doExecute (DefaultMaven.java:305)
    at org.apache.maven.DefaultMaven.doExecute (DefaultMaven.java:192)
    at org.apache.maven.DefaultMaven.execute (DefaultMaven.java:105)
    at org.apache.maven.cli.MavenCli.execute (MavenCli.java:956)
    at org.apache.maven.cli.MavenCli.doMain (MavenCli.java:288)
    at org.apache.maven.cli.MavenCli.main (MavenCli.java:192)
    at jdk.internal.reflect.NativeMethodAccessorImpl.invoke0 (Native Method)
    at jdk.internal.reflect.NativeMethodAccessorImpl.invoke (NativeMethodAccessorImpl.java:62)
    at jdk.internal.reflect.DelegatingMethodAccessorImpl.invoke (DelegatingMethodAccessorImpl.java:43)
    at java.lang.reflect.Method.invoke (Method.java:567)
    at org.codehaus.plexus.classworlds.launcher.Launcher.launchEnhanced (Launcher.java:289)
    at org.codehaus.plexus.classworlds.launcher.Launcher.launch (Launcher.java:229)
    at org.codehaus.plexus.classworlds.launcher.Launcher.mainWithExitCode (Launcher.java:415)
    at org.codehaus.plexus.classworlds.launcher.Launcher.main (Launcher.java:356)
[ERROR] 
[ERROR] Re-run Maven using the -X switch to enable full debug logging.
[ERROR] 
[ERROR] For more information about the errors and possible solutions, please read the following articles:
[ERROR] [Help 1] http://cwiki.apache.org/confluence/display/MAVEN/MojoFailureException
[ERROR] 
[ERROR] After correcting the problems, you can resume the build with the command
[ERROR]   mvn <goals> -rf :working-directory-child

	at org.apache.maven.surefire.its.WorkingDirectoryIT.testWorkingDirectoryNoFork(WorkingDirectoryIT.java:63)
Caused by: org.apache.maven.it.VerificationException: 
Exit code was non-zero: 1; command line and log = 
/home/jenkins/tools/maven/apache-maven-3.6.0/bin/mvn -e --batch-mode -Dmaven.repo.local=/home/jenkins/jenkins-slave/workspace/n-box_maven-surefire_no_user.dir@2/.m2 org.apache.maven.plugins:maven-clean-plugin:clean -Dsurefire.version=3.0.0-M4-SNAPSHOT -Djacoco.agent=-javaagent:/home/jenkins/jenkins-slave/workspace/n-box_maven-surefire_no_user.dir@2/.m2/org/jacoco/org.jacoco.agent/0.8.3/org.jacoco.agent-0.8.3-runtime.jar=destfile=/home/jenkins/jenkins-slave/workspace/n-box_maven-surefire_no_user.dir@2/surefire-its/target/jacoco-it.exec,append=true,includes=**/failsafe/*:**/failsafe/**/*:**/surefire/*:**/surefire/**/*,inclnolocationclasses=true,jmx=false -Dhttps.protocols=TLSv1,TLSv1.1,TLSv1.2 -DforkMode=never test
[INFO] Error stacktraces are turned on.
[INFO] Scanning for projects...
[INFO] ------------------------------------------------------------------------
[INFO] Reactor Build Order:
[INFO] 
[INFO] Test for working directory configuration (parent)                  [pom]
[INFO] Test for working directory configuration                           [jar]
[INFO] 
[INFO] --------< org.apache.maven.plugins.surefire:working-directory >---------
[INFO] Building Test for working directory configuration (parent) 1.0-SNAPSHOT [1/2]
[INFO] --------------------------------[ pom ]---------------------------------
[INFO] 
[INFO] --- maven-clean-plugin:2.5:clean (default-cli) @ working-directory ---
[INFO] 
[INFO] -----< org.apache.maven.plugins.surefire:working-directory-child >------
[INFO] Building Test for working directory configuration 1.0-SNAPSHOT     [2/2]
[INFO] --------------------------------[ jar ]---------------------------------
[INFO] 
[INFO] --- maven-clean-plugin:2.5:clean (default-cli) @ working-directory-child ---
[INFO] 
[INFO] --- maven-resources-plugin:2.6:resources (default-resources) @ working-directory-child ---
[WARNING] Using platform encoding (ISO-8859-1 actually) to copy filtered resources, i.e. build is platform dependent!
[INFO] skip non existing resourceDirectory /home/jenkins/jenkins-slave/workspace/n-box_maven-surefire_no_user.dir@2/surefire-its/target/WorkingDirectoryIT_testWorkingDirectoryNoFork/child/src/main/resources
[INFO] 
[INFO] --- maven-compiler-plugin:3.1:compile (default-compile) @ working-directory-child ---
[INFO] No sources to compile
[INFO] 
[INFO] --- maven-resources-plugin:2.6:testResources (default-testResources) @ working-directory-child ---
[WARNING] Using platform encoding (ISO-8859-1 actually) to copy filtered resources, i.e. build is platform dependent!
[INFO] skip non existing resourceDirectory /home/jenkins/jenkins-slave/workspace/n-box_maven-surefire_no_user.dir@2/surefire-its/target/WorkingDirectoryIT_testWorkingDirectoryNoFork/child/src/test/resources
[INFO] 
[INFO] --- maven-compiler-plugin:3.1:testCompile (default-testCompile) @ working-directory-child ---
[INFO] Changes detected - recompiling the module!
[WARNING] File encoding has not been set, using platform encoding ISO-8859-1, i.e. build is platform dependent!
[INFO] Compiling 1 source file to /home/jenkins/jenkins-slave/workspace/n-box_maven-surefire_no_user.dir@2/surefire-its/target/WorkingDirectoryIT_testWorkingDirectoryNoFork/child/target/test-classes
[INFO] 
[INFO] --- maven-surefire-plugin:3.0.0-M4-SNAPSHOT:test (default-test) @ working-directory-child ---
[WARNING] The parameter forkMode is deprecated since version 2.14. Use forkCount and reuseForks instead.
[WARNING] useSystemClassloader setting has no effect when not forking
[INFO] Surefire report directory: /home/jenkins/jenkins-slave/workspace/n-box_maven-surefire_no_user.dir@2/surefire-its/target/WorkingDirectoryIT_testWorkingDirectoryNoFork/child/target/surefire-reports
[INFO] Running workingDir.BasicTest
[ERROR] Tests run: 1, Failures: 0, Errors: 1, Skipped: 0, Time elapsed: 0.013 s <<< FAILURE! - in workingDir.BasicTest
[ERROR] workingDir.BasicTest.testWorkingDir  Time elapsed: 0.003 s  <<< ERROR!
java.io.IOException: No such file or directory
	at java.base/java.io.UnixFileSystem.createFileExclusively(Native Method)
	at java.base/java.io.File.createNewFile(File.java:1024)
	at workingDir.BasicTest.testWorkingDir(BasicTest.java:36)

[INFO] 
[INFO] Results:
[INFO] 
[ERROR] Errors: 
[ERROR]   workingDir.BasicTest#testWorkingDir IOException No such file or directory
[INFO] 
[ERROR] Tests run: 1, Failures: 0, Errors: 1, Skipped: 0
[INFO] 
[INFO] ------------------------------------------------------------------------
[INFO] Reactor Summary for Test for working directory configuration (parent) 1.0-SNAPSHOT:
[INFO] 
[INFO] Test for working directory configuration (parent) .. SUCCESS [  0.139 s]
[INFO] Test for working directory configuration ........... FAILURE [  2.306 s]
[INFO] ------------------------------------------------------------------------
[INFO] BUILD FAILURE
[INFO] ------------------------------------------------------------------------
[INFO] Total time:  2.683 s
[INFO] Finished at: 2019-06-04T07:22:48Z
[INFO] ------------------------------------------------------------------------
[ERROR] Failed to execute goal org.apache.maven.plugins:maven-surefire-plugin:3.0.0-M4-SNAPSHOT:test (default-test) on project working-directory-child: There are test failures.
[ERROR] 
[ERROR] Please refer to /home/jenkins/jenkins-slave/workspace/n-box_maven-surefire_no_user.dir@2/surefire-its/target/WorkingDirectoryIT_testWorkingDirectoryNoFork/child/target/surefire-reports for the individual test results.
[ERROR] Please refer to dump files (if any exist) [date].dump, [date]-jvmRun[N].dump and [date].dumpstream.
[ERROR] -> [Help 1]
org.apache.maven.lifecycle.LifecycleExecutionException: Failed to execute goal org.apache.maven.plugins:maven-surefire-plugin:3.0.0-M4-SNAPSHOT:test (default-test) on project working-directory-child: There are test failures.

Please refer to /home/jenkins/jenkins-slave/workspace/n-box_maven-surefire_no_user.dir@2/surefire-its/target/WorkingDirectoryIT_testWorkingDirectoryNoFork/child/target/surefire-reports for the individual test results.
Please refer to dump files (if any exist) [date].dump, [date]-jvmRun[N].dump and [date].dumpstream.
    at org.apache.maven.lifecycle.internal.MojoExecutor.execute (MojoExecutor.java:215)
    at org.apache.maven.lifecycle.internal.MojoExecutor.execute (MojoExecutor.java:156)
    at org.apache.maven.lifecycle.internal.MojoExecutor.execute (MojoExecutor.java:148)
    at org.apache.maven.lifecycle.internal.LifecycleModuleBuilder.buildProject (LifecycleModuleBuilder.java:117)
    at org.apache.maven.lifecycle.internal.LifecycleModuleBuilder.buildProject (LifecycleModuleBuilder.java:81)
    at org.apache.maven.lifecycle.internal.builder.singlethreaded.SingleThreadedBuilder.build (SingleThreadedBuilder.java:56)
    at org.apache.maven.lifecycle.internal.LifecycleStarter.execute (LifecycleStarter.java:128)
    at org.apache.maven.DefaultMaven.doExecute (DefaultMaven.java:305)
    at org.apache.maven.DefaultMaven.doExecute (DefaultMaven.java:192)
    at org.apache.maven.DefaultMaven.execute (DefaultMaven.java:105)
    at org.apache.maven.cli.MavenCli.execute (MavenCli.java:956)
    at org.apache.maven.cli.MavenCli.doMain (MavenCli.java:288)
    at org.apache.maven.cli.MavenCli.main (MavenCli.java:192)
    at jdk.internal.reflect.NativeMethodAccessorImpl.invoke0 (Native Method)
    at jdk.internal.reflect.NativeMethodAccessorImpl.invoke (NativeMethodAccessorImpl.java:62)
    at jdk.internal.reflect.DelegatingMethodAccessorImpl.invoke (DelegatingMethodAccessorImpl.java:43)
    at java.lang.reflect.Method.invoke (Method.java:567)
    at org.codehaus.plexus.classworlds.launcher.Launcher.launchEnhanced (Launcher.java:289)
    at org.codehaus.plexus.classworlds.launcher.Launcher.launch (Launcher.java:229)
    at org.codehaus.plexus.classworlds.launcher.Launcher.mainWithExitCode (Launcher.java:415)
    at org.codehaus.plexus.classworlds.launcher.Launcher.main (Launcher.java:356)
Caused by: org.apache.maven.plugin.MojoFailureException: There are test failures.

Please refer to /home/jenkins/jenkins-slave/workspace/n-box_maven-surefire_no_user.dir@2/surefire-its/target/WorkingDirectoryIT_testWorkingDirectoryNoFork/child/target/surefire-reports for the individual test results.
Please refer to dump files (if any exist) [date].dump, [date]-jvmRun[N].dump and [date].dumpstream.
    at org.apache.maven.plugin.surefire.SurefireHelper.throwException (SurefireHelper.java:271)
    at org.apache.maven.plugin.surefire.SurefireHelper.reportExecution (SurefireHelper.java:159)
    at org.apache.maven.plugin.surefire.SurefirePlugin.handleSummary (SurefirePlugin.java:373)
    at org.apache.maven.plugin.surefire.AbstractSurefireMojo.executeAfterPreconditionsChecked (AbstractSurefireMojo.java:1011)
    at org.apache.maven.plugin.surefire.AbstractSurefireMojo.execute (AbstractSurefireMojo.java:841)
    at org.apache.maven.plugin.DefaultBuildPluginManager.executeMojo (DefaultBuildPluginManager.java:137)
    at org.apache.maven.lifecycle.internal.MojoExecutor.execute (MojoExecutor.java:210)
    at org.apache.maven.lifecycle.internal.MojoExecutor.execute (MojoExecutor.java:156)
    at org.apache.maven.lifecycle.internal.MojoExecutor.execute (MojoExecutor.java:148)
    at org.apache.maven.lifecycle.internal.LifecycleModuleBuilder.buildProject (LifecycleModuleBuilder.java:117)
    at org.apache.maven.lifecycle.internal.LifecycleModuleBuilder.buildProject (LifecycleModuleBuilder.java:81)
    at org.apache.maven.lifecycle.internal.builder.singlethreaded.SingleThreadedBuilder.build (SingleThreadedBuilder.java:56)
    at org.apache.maven.lifecycle.internal.LifecycleStarter.execute (LifecycleStarter.java:128)
    at org.apache.maven.DefaultMaven.doExecute (DefaultMaven.java:305)
    at org.apache.maven.DefaultMaven.doExecute (DefaultMaven.java:192)
    at org.apache.maven.DefaultMaven.execute (DefaultMaven.java:105)
    at org.apache.maven.cli.MavenCli.execute (MavenCli.java:956)
    at org.apache.maven.cli.MavenCli.doMain (MavenCli.java:288)
    at org.apache.maven.cli.MavenCli.main (MavenCli.java:192)
    at jdk.internal.reflect.NativeMethodAccessorImpl.invoke0 (Native Method)
    at jdk.internal.reflect.NativeMethodAccessorImpl.invoke (NativeMethodAccessorImpl.java:62)
    at jdk.internal.reflect.DelegatingMethodAccessorImpl.invoke (DelegatingMethodAccessorImpl.java:43)
    at java.lang.reflect.Method.invoke (Method.java:567)
    at org.codehaus.plexus.classworlds.launcher.Launcher.launchEnhanced (Launcher.java:289)
    at org.codehaus.plexus.classworlds.launcher.Launcher.launch (Launcher.java:229)
    at org.codehaus.plexus.classworlds.launcher.Launcher.mainWithExitCode (Launcher.java:415)
    at org.codehaus.plexus.classworlds.launcher.Launcher.main (Launcher.java:356)
[ERROR] 
[ERROR] Re-run Maven using the -X switch to enable full debug logging.
[ERROR] 
[ERROR] For more information about the errors and possible solutions, please read the following articles:
[ERROR] [Help 1] http://cwiki.apache.org/confluence/display/MAVEN/MojoFailureException
[ERROR] 
[ERROR] After correcting the problems, you can resume the build with the command
[ERROR]   mvn <goals> -rf :working-directory-child

	at org.apache.maven.surefire.its.WorkingDirectoryIT.testWorkingDirectoryNoFork(WorkingDirectoryIT.java:63)




Build log:
[...truncated 49536 lines...]
[2019-06-04T09:31:38.095Z] [INFO] Total time:  01:31 h
[2019-06-04T09:31:38.095Z] [INFO] Finished at: 2019-06-04T09:31:36Z
[2019-06-04T09:31:38.095Z] [INFO] ------------------------------------------------------------------------
[2019-06-04T09:31:38.095Z] [ERROR] Failed to execute goal org.apache.maven.plugins:maven-failsafe-plugin:3.0.0-M3:verify (default) on project surefire-its: There are test failures.
[2019-06-04T09:31:38.095Z] [ERROR] 
[2019-06-04T09:31:38.095Z] [ERROR] Please refer to C:\Users\jenkins\AppData\Local\Temp\2\jenkins-maven-box-maven-surefire-no_user.dir-6\surefire-its\target\failsafe-reports for the individual test results.
[2019-06-04T09:31:38.095Z] [ERROR] Please refer to dump files (if any exist) [date].dump, [date]-jvmRun[N].dump and [date].dumpstream.
[2019-06-04T09:31:38.095Z] [ERROR] -> [Help 1]
[2019-06-04T09:31:38.095Z] org.apache.maven.lifecycle.LifecycleExecutionException: Failed to execute goal org.apache.maven.plugins:maven-failsafe-plugin:3.0.0-M3:verify (default) on project surefire-its: There are test failures.
[2019-06-04T09:31:38.095Z] 
[2019-06-04T09:31:38.095Z] Please refer to C:\Users\jenkins\AppData\Local\Temp\2\jenkins-maven-box-maven-surefire-no_user.dir-6\surefire-its\target\failsafe-reports for the individual test results.
[2019-06-04T09:31:38.095Z] Please refer to dump files (if any exist) [date].dump, [date]-jvmRun[N].dump and [date].dumpstream.
[2019-06-04T09:31:38.095Z]     at org.apache.maven.lifecycle.internal.MojoExecutor.execute (MojoExecutor.java:215)
[2019-06-04T09:31:38.095Z]     at org.apache.maven.lifecycle.internal.MojoExecutor.execute (MojoExecutor.java:156)
[2019-06-04T09:31:38.095Z]     at org.apache.maven.lifecycle.internal.MojoExecutor.execute (MojoExecutor.java:148)
[2019-06-04T09:31:38.095Z]     at org.apache.maven.lifecycle.internal.LifecycleModuleBuilder.buildProject (LifecycleModuleBuilder.java:117)
[2019-06-04T09:31:38.095Z]     at org.apache.maven.lifecycle.internal.LifecycleModuleBuilder.buildProject (LifecycleModuleBuilder.java:81)
[2019-06-04T09:31:38.095Z]     at org.apache.maven.lifecycle.internal.builder.singlethreaded.SingleThreadedBuilder.build (SingleThreadedBuilder.java:56)
[2019-06-04T09:31:38.095Z]     at org.apache.maven.lifecycle.internal.LifecycleStarter.execute (LifecycleStarter.java:128)
[2019-06-04T09:31:38.095Z]     at org.apache.maven.DefaultMaven.doExecute (DefaultMaven.java:305)
[2019-06-04T09:31:38.095Z]     at org.apache.maven.DefaultMaven.doExecute (DefaultMaven.java:192)
[2019-06-04T09:31:38.095Z]     at org.apache.maven.DefaultMaven.execute (DefaultMaven.java:105)
[2019-06-04T09:31:38.095Z]     at org.apache.maven.cli.MavenCli.execute (MavenCli.java:956)
[2019-06-04T09:31:38.095Z]     at org.apache.maven.cli.MavenCli.doMain (MavenCli.java:288)
[2019-06-04T09:31:38.095Z]     at org.apache.maven.cli.MavenCli.main (MavenCli.java:192)
[2019-06-04T09:31:38.095Z]     at sun.reflect.NativeMethodAccessorImpl.invoke0 (Native Method)
[2019-06-04T09:31:38.095Z]     at sun.reflect.NativeMethodAccessorImpl.invoke (NativeMethodAccessorImpl.java:62)
[2019-06-04T09:31:38.095Z]     at sun.reflect.DelegatingMethodAccessorImpl.invoke (DelegatingMethodAccessorImpl.java:43)
[2019-06-04T09:31:38.095Z]     at java.lang.reflect.Method.invoke (Method.java:498)
[2019-06-04T09:31:38.096Z]     at org.codehaus.plexus.classworlds.launcher.Launcher.launchEnhanced (Launcher.java:289)
[2019-06-04T09:31:38.096Z]     at org.codehaus.plexus.classworlds.launcher.Launcher.launch (Launcher.java:229)
[2019-06-04T09:31:38.096Z]     at org.codehaus.plexus.classworlds.launcher.Launcher.mainWithExitCode (Launcher.java:415)
[2019-06-04T09:31:38.096Z]     at org.codehaus.plexus.classworlds.launcher.Launcher.main (Launcher.java:356)
[2019-06-04T09:31:38.096Z] Caused by: org.apache.maven.plugin.MojoFailureException: There are test failures.
[2019-06-04T09:31:38.096Z] 
[2019-06-04T09:31:38.096Z] Please refer to C:\Users\jenkins\AppData\Local\Temp\2\jenkins-maven-box-maven-surefire-no_user.dir-6\surefire-its\target\failsafe-reports for the individual test results.
[2019-06-04T09:31:38.096Z] Please refer to dump files (if any exist) [date].dump, [date]-jvmRun[N].dump and [date].dumpstream.
[2019-06-04T09:31:38.096Z]     at org.apache.maven.plugin.surefire.SurefireHelper.throwException (SurefireHelper.java:271)
[2019-06-04T09:31:38.096Z]     at org.apache.maven.plugin.surefire.SurefireHelper.reportExecution (SurefireHelper.java:159)
[2019-06-04T09:31:38.096Z]     at org.apache.maven.plugin.failsafe.VerifyMojo.execute (VerifyMojo.java:192)
[2019-06-04T09:31:38.096Z]     at org.apache.maven.plugin.DefaultBuildPluginManager.executeMojo (DefaultBuildPluginManager.java:137)
[2019-06-04T09:31:38.096Z]     at org.apache.maven.lifecycle.internal.MojoExecutor.execute (MojoExecutor.java:210)
[2019-06-04T09:31:38.096Z]     at org.apache.maven.lifecycle.internal.MojoExecutor.execute (MojoExecutor.java:156)
[2019-06-04T09:31:38.096Z]     at org.apache.maven.lifecycle.internal.MojoExecutor.execute (MojoExecutor.java:148)
[2019-06-04T09:31:38.096Z]     at org.apache.maven.lifecycle.internal.LifecycleModuleBuilder.buildProject (LifecycleModuleBuilder.java:117)
[2019-06-04T09:31:38.096Z]     at org.apache.maven.lifecycle.internal.LifecycleModuleBuilder.buildProject (LifecycleModuleBuilder.java:81)
[2019-06-04T09:31:38.096Z]     at org.apache.maven.lifecycle.internal.builder.singlethreaded.SingleThreadedBuilder.build (SingleThreadedBuilder.java:56)
[2019-06-04T09:31:38.096Z]     at org.apache.maven.lifecycle.internal.LifecycleStarter.execute (LifecycleStarter.java:128)
[2019-06-04T09:31:38.096Z]     at org.apache.maven.DefaultMaven.doExecute (DefaultMaven.java:305)
[2019-06-04T09:31:38.096Z]     at org.apache.maven.DefaultMaven.doExecute (DefaultMaven.java:192)
[2019-06-04T09:31:38.096Z]     at org.apache.maven.DefaultMaven.execute (DefaultMaven.java:105)
[2019-06-04T09:31:38.096Z]     at org.apache.maven.cli.MavenCli.execute (MavenCli.java:956)
[2019-06-04T09:31:38.096Z]     at org.apache.maven.cli.MavenCli.doMain (MavenCli.java:288)
[2019-06-04T09:31:38.096Z]     at org.apache.maven.cli.MavenCli.main (MavenCli.java:192)
[2019-06-04T09:31:38.096Z]     at sun.reflect.NativeMethodAccessorImpl.invoke0 (Native Method)
[2019-06-04T09:31:38.096Z]     at sun.reflect.NativeMethodAccessorImpl.invoke (NativeMethodAccessorImpl.java:62)
[2019-06-04T09:31:38.096Z]     at sun.reflect.DelegatingMethodAccessorImpl.invoke (DelegatingMethodAccessorImpl.java:43)
[2019-06-04T09:31:38.096Z]     at java.lang.reflect.Method.invoke (Method.java:498)
[2019-06-04T09:31:38.096Z]     at org.codehaus.plexus.classworlds.launcher.Launcher.launchEnhanced (Launcher.java:289)
[2019-06-04T09:31:38.096Z]     at org.codehaus.plexus.classworlds.launcher.Launcher.launch (Launcher.java:229)
[2019-06-04T09:31:38.096Z]     at org.codehaus.plexus.classworlds.launcher.Launcher.mainWithExitCode (Launcher.java:415)
[2019-06-04T09:31:38.096Z]     at org.codehaus.plexus.classworlds.launcher.Launcher.main (Launcher.java:356)
[2019-06-04T09:31:38.096Z] [ERROR] 
[2019-06-04T09:31:38.096Z] [ERROR] Re-run Maven using the -X switch to enable full debug logging.
[2019-06-04T09:31:38.096Z] [ERROR] 
[2019-06-04T09:31:38.096Z] [ERROR] For more information about the errors and possible solutions, please read the following articles:
[2019-06-04T09:31:38.096Z] [ERROR] [Help 1] http://cwiki.apache.org/confluence/display/MAVEN/MojoFailureException
[2019-06-04T09:31:38.096Z] [ERROR] 
[2019-06-04T09:31:38.096Z] [ERROR] After correcting the problems, you can resume the build with the command
[2019-06-04T09:31:38.096Z] [ERROR]   mvn <goals> -rf :surefire-its
[Pipeline] }
[Pipeline] // withEnv
[Pipeline] }
[Pipeline] // stage
[Pipeline] fileExists
[Pipeline] zip
[2019-06-04T09:31:38.346Z] Writing zip file of C:\Users\jenkins\AppData\Local\Temp\2\jenkins-maven-box-maven-surefire-no_user.dir-6\maven-failsafe-plugin\target\it to C:\Users\jenkins\AppData\Local\Temp\2\jenkins-maven-box-maven-surefire-no_user.dir-6\maven-failsafe-plugin--windows-jdk8-maven3.6.x.zip
[2019-06-04T09:31:38.432Z] Zipped 78 entries.
[2019-06-04T09:31:38.432Z] Archiving C:\Users\jenkins\AppData\Local\Temp\2\jenkins-maven-box-maven-surefire-no_user.dir-6\maven-failsafe-plugin--windows-jdk8-maven3.6.x.zip
[2019-06-04T09:31:38.432Z] [Fast Archiver] No prior successful build to compare, so performing full copy of artifacts
[Pipeline] fileExists
[Pipeline] zip
[2019-06-04T09:31:38.566Z] Writing zip file of C:\Users\jenkins\AppData\Local\Temp\2\jenkins-maven-box-maven-surefire-no_user.dir-6\surefire-its\target to C:\Users\jenkins\AppData\Local\Temp\2\jenkins-maven-box-maven-surefire-no_user.dir-6\surefire-its--windows-jdk8-maven3.6.x.zip
[2019-06-04T09:31:38.621Z] [INFO] Tests run: 5, Failures: 0, Errors: 0, Skipped: 0, Time elapsed: 15.865 s - in org.apache.maven.surefire.its.jiras.Surefire995CategoryInheritanceIT
[2019-06-04T09:31:38.622Z] [INFO] 
[2019-06-04T09:31:38.622Z] [INFO] Results:
[2019-06-04T09:31:38.622Z] [INFO] 
[2019-06-04T09:31:38.622Z] [ERROR] Errors: 
[2019-06-04T09:31:38.622Z] [ERROR]   WorkingDirectoryIT.testWorkingDirectoryNoFork:63 » SurefireVerifier Exit code ...
[2019-06-04T09:31:38.622Z] [INFO] 
[2019-06-04T09:31:38.622Z] [ERROR] Tests run: 788, Failures: 0, Errors: 1, Skipped: 169
[2019-06-04T09:31:38.622Z] [INFO] 
[2019-06-04T09:31:38.622Z] [INFO] 
[2019-06-04T09:31:38.622Z] [INFO] --- maven-checkstyle-plugin:3.0.0:check (checkstyle-check) @ surefire-its ---
[2019-06-04T09:31:39.808Z] [INFO] 
[2019-06-04T09:31:39.808Z] [INFO] --- maven-failsafe-plugin:3.0.0-M3:verify (default) @ surefire-its ---
[2019-06-04T09:31:39.808Z] [INFO] Failsafe report directory: C:\Users\jenkins\AppData\Local\Temp\2\jenkins-maven-box-maven-surefire-no_user.dir-6\surefire-its\target\failsafe-reports
[2019-06-04T09:31:39.808Z] [INFO] ------------------------------------------------------------------------
[2019-06-04T09:31:39.808Z] [INFO] Reactor Summary for Apache Maven Surefire 3.0.0-M4-SNAPSHOT:
[2019-06-04T09:31:39.808Z] [INFO] 
[2019-06-04T09:31:39.808Z] [INFO] Apache Maven Surefire .............................. SUCCESS [ 14.876 s]
[2019-06-04T09:31:39.808Z] [INFO] SureFire Logger API ................................ SUCCESS [  2.888 s]
[2019-06-04T09:31:39.808Z] [INFO] SureFire API ....................................... SUCCESS [  7.608 s]
[2019-06-04T09:31:39.808Z] [INFO] SureFire Booter .................................... SUCCESS [  8.399 s]
[2019-06-04T09:31:39.808Z] [INFO] Maven Surefire Test-Grouping Support ............... SUCCESS [  3.918 s]
[2019-06-04T09:31:39.808Z] [INFO] SureFire Providers ................................. SUCCESS [  0.673 s]
[2019-06-04T09:31:39.808Z] [INFO] Shared JUnit3 Provider Code ........................ SUCCESS [  2.639 s]
[2019-06-04T09:31:39.808Z] [INFO] Shared Java 5 Provider Base ........................ SUCCESS [  3.076 s]
[2019-06-04T09:31:39.808Z] [INFO] Shared JUnit4 Provider Code ........................ SUCCESS [  3.242 s]
[2019-06-04T09:31:39.808Z] [INFO] Shared JUnit48 Provider Code ....................... SUCCESS [  3.627 s]
[2019-06-04T09:31:39.808Z] [INFO] SureFire JUnit Runner .............................. SUCCESS [  2.853 s]
[2019-06-04T09:31:39.808Z] [INFO] SureFire JUnit4 Runner ............................. SUCCESS [ 12.664 s]
[2019-06-04T09:31:39.808Z] [INFO] Maven Surefire Common .............................. SUCCESS [ 18.749 s]
[2019-06-04T09:31:39.808Z] [INFO] SureFire JUnitCore Runner .......................... SUCCESS [02:20 min]
[2019-06-04T09:31:39.808Z] [INFO] SureFire JUnit Platform Runner ..................... SUCCESS [  7.498 s]
[2019-06-04T09:31:39.808Z] [INFO] SureFire TestNG Utils .............................. SUCCESS [  3.122 s]
[2019-06-04T09:31:39.808Z] [INFO] SureFire TestNG Runner ............................. SUCCESS [  3.689 s]
[2019-06-04T09:31:39.808Z] [INFO] ShadeFire JUnit3 Provider .......................... SUCCESS [  1.050 s]
[2019-06-04T09:31:39.808Z] [INFO] Surefire Report Parser ............................. SUCCESS [  4.356 s]
[2019-06-04T09:31:39.808Z] [INFO] Maven Surefire Plugin .............................. SUCCESS [  7.911 s]
[2019-06-04T09:31:39.808Z] [INFO] Maven Failsafe Plugin .............................. SUCCESS [ 50.017 s]
[2019-06-04T09:31:39.808Z] [INFO] Maven Surefire Report Plugin ....................... SUCCESS [ 11.554 s]
[2019-06-04T09:31:39.808Z] [INFO] Maven Surefire Integration Tests ................... FAILURE [47:51 min]
[2019-06-04T09:31:39.808Z] [INFO] ------------------------------------------------------------------------
[2019-06-04T09:31:39.808Z] [INFO] BUILD FAILURE
[2019-06-04T09:31:39.809Z] [INFO] ------------------------------------------------------------------------
[2019-06-04T09:31:39.809Z] [INFO] Total time:  53:06 min
[2019-06-04T09:31:39.809Z] [INFO] Finished at: 2019-06-04T09:31:39Z
[2019-06-04T09:31:39.809Z] [INFO] ------------------------------------------------------------------------
[2019-06-04T09:31:39.809Z] [ERROR] Failed to execute goal org.apache.maven.plugins:maven-failsafe-plugin:3.0.0-M3:verify (default) on project surefire-its: There are test failures.
[2019-06-04T09:31:39.809Z] [ERROR] 
[2019-06-04T09:31:39.809Z] [ERROR] Please refer to C:\Users\jenkins\AppData\Local\Temp\2\jenkins-maven-box-maven-surefire-no_user.dir-6\surefire-its\target\failsafe-reports for the individual test results.
[2019-06-04T09:31:39.809Z] [ERROR] Please refer to dump files (if any exist) [date].dump, [date]-jvmRun[N].dump and [date].dumpstream.
[2019-06-04T09:31:39.809Z] [ERROR] -> [Help 1]
[2019-06-04T09:31:39.809Z] org.apache.maven.lifecycle.LifecycleExecutionException: Failed to execute goal org.apache.maven.plugins:maven-failsafe-plugin:3.0.0-M3:verify (default) on project surefire-its: There are test failures.
[2019-06-04T09:31:39.809Z] 
[2019-06-04T09:31:39.809Z] Please refer to C:\Users\jenkins\AppData\Local\Temp\2\jenkins-maven-box-maven-surefire-no_user.dir-6\surefire-its\target\failsafe-reports for the individual test results.
[2019-06-04T09:31:39.809Z] Please refer to dump files (if any exist) [date].dump, [date]-jvmRun[N].dump and [date].dumpstream.
[2019-06-04T09:31:39.809Z]     at org.apache.maven.lifecycle.internal.MojoExecutor.execute (MojoExecutor.java:215)
[2019-06-04T09:31:39.809Z]     at org.apache.maven.lifecycle.internal.MojoExecutor.execute (MojoExecutor.java:156)
[2019-06-04T09:31:39.809Z]     at org.apache.maven.lifecycle.internal.MojoExecutor.execute (MojoExecutor.java:148)
[2019-06-04T09:31:39.809Z]     at org.apache.maven.lifecycle.internal.LifecycleModuleBuilder.buildProject (LifecycleModuleBuilder.java:117)
[2019-06-04T09:31:39.809Z]     at org.apache.maven.lifecycle.internal.LifecycleModuleBuilder.buildProject (LifecycleModuleBuilder.java:81)
[2019-06-04T09:31:39.809Z]     at org.apache.maven.lifecycle.internal.builder.singlethreaded.SingleThreadedBuilder.build (SingleThreadedBuilder.java:56)
[2019-06-04T09:31:39.809Z]     at org.apache.maven.lifecycle.internal.LifecycleStarter.execute (LifecycleStarter.java:128)
[2019-06-04T09:31:39.809Z]     at org.apache.maven.DefaultMaven.doExecute (DefaultMaven.java:305)
[2019-06-04T09:31:39.809Z]     at org.apache.maven.DefaultMaven.doExecute (DefaultMaven.java:192)
[2019-06-04T09:31:39.809Z]     at org.apache.maven.DefaultMaven.execute (DefaultMaven.java:105)
[2019-06-04T09:31:39.809Z]     at org.apache.maven.cli.MavenCli.execute (MavenCli.java:956)
[2019-06-04T09:31:39.809Z]     at org.apache.maven.cli.MavenCli.doMain (MavenCli.java:288)
[2019-06-04T09:31:39.809Z]     at org.apache.maven.cli.MavenCli.main (MavenCli.java:192)
[2019-06-04T09:31:39.809Z]     at sun.reflect.NativeMethodAccessorImpl.invoke0 (Native Method)
[2019-06-04T09:31:39.809Z]     at sun.reflect.NativeMethodAccessorImpl.invoke (NativeMethodAccessorImpl.java:62)
[2019-06-04T09:31:39.809Z]     at sun.reflect.DelegatingMethodAccessorImpl.invoke (DelegatingMethodAccessorImpl.java:43)
[2019-06-04T09:31:39.809Z]     at java.lang.reflect.Method.invoke (Method.java:498)
[2019-06-04T09:31:39.809Z]     at org.codehaus.plexus.classworlds.launcher.Launcher.launchEnhanced (Launcher.java:289)
[2019-06-04T09:31:39.809Z]     at org.codehaus.plexus.classworlds.launcher.Launcher.launch (Launcher.java:229)
[2019-06-04T09:31:39.809Z]     at org.codehaus.plexus.classworlds.launcher.Launcher.mainWithExitCode (Launcher.java:415)
[2019-06-04T09:31:39.809Z]     at org.codehaus.plexus.classworlds.launcher.Launcher.main (Launcher.java:356)
[2019-06-04T09:31:39.809Z] Caused by: org.apache.maven.plugin.MojoFailureException: There are test failures.
[2019-06-04T09:31:39.809Z] 
[2019-06-04T09:31:39.809Z] Please refer to C:\Users\jenkins\AppData\Local\Temp\2\jenkins-maven-box-maven-surefire-no_user.dir-6\surefire-its\target\failsafe-reports for the individual test results.
[2019-06-04T09:31:39.809Z] Please refer to dump files (if any exist) [date].dump, [date]-jvmRun[N].dump and [date].dumpstream.
[2019-06-04T09:31:39.809Z]     at org.apache.maven.plugin.surefire.SurefireHelper.throwException (SurefireHelper.java:271)
[2019-06-04T09:31:39.809Z]     at org.apache.maven.plugin.surefire.SurefireHelper.reportExecution (SurefireHelper.java:159)
[2019-06-04T09:31:39.809Z]     at org.apache.maven.plugin.failsafe.VerifyMojo.execute (VerifyMojo.java:192)
[2019-06-04T09:31:39.809Z]     at org.apache.maven.plugin.DefaultBuildPluginManager.executeMojo (DefaultBuildPluginManager.java:137)
[2019-06-04T09:31:39.809Z]     at org.apache.maven.lifecycle.internal.MojoExecutor.execute (MojoExecutor.java:210)
[2019-06-04T09:31:39.809Z]     at org.apache.maven.lifecycle.internal.MojoExecutor.execute (MojoExecutor.java:156)
[2019-06-04T09:31:39.809Z]     at org.apache.maven.lifecycle.internal.MojoExecutor.execute (MojoExecutor.java:148)
[2019-06-04T09:31:39.809Z]     at org.apache.maven.lifecycle.internal.LifecycleModuleBuilder.buildProject (LifecycleModuleBuilder.java:117)
[2019-06-04T09:31:39.809Z]     at org.apache.maven.lifecycle.internal.LifecycleModuleBuilder.buildProject (LifecycleModuleBuilder.java:81)
[2019-06-04T09:31:39.809Z]     at org.apache.maven.lifecycle.internal.builder.singlethreaded.SingleThreadedBuilder.build (SingleThreadedBuilder.java:56)
[2019-06-04T09:31:39.809Z]     at org.apache.maven.lifecycle.internal.LifecycleStarter.execute (LifecycleStarter.java:128)
[2019-06-04T09:31:39.809Z]     at org.apache.maven.DefaultMaven.doExecute (DefaultMaven.java:305)
[2019-06-04T09:31:39.809Z]     at org.apache.maven.DefaultMaven.doExecute (DefaultMaven.java:192)
[2019-06-04T09:31:39.809Z]     at org.apache.maven.DefaultMaven.execute (DefaultMaven.java:105)
[2019-06-04T09:31:39.809Z]     at org.apache.maven.cli.MavenCli.execute (MavenCli.java:956)
[2019-06-04T09:31:39.809Z]     at org.apache.maven.cli.MavenCli.doMain (MavenCli.java:288)
[2019-06-04T09:31:39.809Z]     at org.apache.maven.cli.MavenCli.main (MavenCli.java:192)
[2019-06-04T09:31:39.809Z]     at sun.reflect.NativeMethodAccessorImpl.invoke0 (Native Method)
[2019-06-04T09:31:39.809Z]     at sun.reflect.NativeMethodAccessorImpl.invoke (NativeMethodAccessorImpl.java:62)
[2019-06-04T09:31:39.809Z]     at sun.reflect.DelegatingMethodAccessorImpl.invoke (DelegatingMethodAccessorImpl.java:43)
[2019-06-04T09:31:39.809Z]     at java.lang.reflect.Method.invoke (Method.java:498)
[2019-06-04T09:31:39.809Z]     at org.codehaus.plexus.classworlds.launcher.Launcher.launchEnhanced (Launcher.java:289)
[2019-06-04T09:31:39.809Z]     at org.codehaus.plexus.classworlds.launcher.Launcher.launch (Launcher.java:229)
[2019-06-04T09:31:39.809Z]     at org.codehaus.plexus.classworlds.launcher.Launcher.mainWithExitCode (Launcher.java:415)
[2019-06-04T09:31:39.809Z]     at org.codehaus.plexus.classworlds.launcher.Launcher.main (Launcher.java:356)
[2019-06-04T09:31:39.809Z] [ERROR] 
[2019-06-04T09:31:39.809Z] [ERROR] Re-run Maven using the -X switch to enable full debug logging.
[2019-06-04T09:31:39.809Z] [ERROR] 
[2019-06-04T09:31:39.809Z] [ERROR] For more information about the errors and possible solutions, please read the following articles:
[2019-06-04T09:31:39.809Z] [ERROR] [Help 1] http://cwiki.apache.org/confluence/display/MAVEN/MojoFailureException
[2019-06-04T09:31:39.809Z] [ERROR] 
[2019-06-04T09:31:39.810Z] [ERROR] After correcting the problems, you can resume the build with the command
[2019-06-04T09:31:39.810Z] [ERROR]   mvn <goals> -rf :surefire-its
[Pipeline] }
[Pipeline] // withEnv
[Pipeline] }
[Pipeline] // stage
[Pipeline] fileExists
[Pipeline] zip
[2019-06-04T09:31:40.581Z] Writing zip file of C:\Users\jenkins\AppData\Local\Temp\2\jenkins-maven-box-maven-surefire-no_user.dir-6\maven-failsafe-plugin\target\it to C:\Users\jenkins\AppData\Local\Temp\2\jenkins-maven-box-maven-surefire-no_user.dir-6\maven-failsafe-plugin--windows-jdk7-maven3.6.x.zip
[2019-06-04T09:31:40.768Z] Zipped 78 entries.
[2019-06-04T09:31:40.768Z] Archiving C:\Users\jenkins\AppData\Local\Temp\2\jenkins-maven-box-maven-surefire-no_user.dir-6\maven-failsafe-plugin--windows-jdk7-maven3.6.x.zip
[2019-06-04T09:31:40.769Z] [Fast Archiver] No prior successful build to compare, so performing full copy of artifacts
[Pipeline] fileExists
[Pipeline] zip
[2019-06-04T09:31:41.319Z] Writing zip file of C:\Users\jenkins\AppData\Local\Temp\2\jenkins-maven-box-maven-surefire-no_user.dir-6\surefire-its\target to C:\Users\jenkins\AppData\Local\Temp\2\jenkins-maven-box-maven-surefire-no_user.dir-6\surefire-its--windows-jdk7-maven3.6.x.zip
[2019-06-04T09:31:48.233Z] Zipped 15947 entries.
[2019-06-04T09:31:48.233Z] Archiving C:\Users\jenkins\AppData\Local\Temp\2\jenkins-maven-box-maven-surefire-no_user.dir-6\surefire-its--windows-jdk8-maven3.6.x.zip
[2019-06-04T09:31:48.233Z] [Fast Archiver] No prior successful build to compare, so performing full copy of artifacts
[Pipeline] archiveArtifacts
[2019-06-04T09:31:49.494Z] Archiving artifacts
[2019-06-04T09:31:49.519Z] [Fast Archiver] No prior successful build to compare, so performing full copy of artifacts
[Pipeline] cleanWs
[2019-06-04T09:31:51.063Z] [WS-CLEANUP] Deleting project workspace...
[2019-06-04T09:31:51.063Z] [WS-CLEANUP] Deferred wipeout is used...
[2019-06-04T09:31:51.229Z] [WS-CLEANUP] done
[Pipeline] }
[Pipeline] // ws
[Pipeline] }
[Pipeline] // timestamps
[Pipeline] }
[Pipeline] // node
[Pipeline] }
[2019-06-04T09:31:54.308Z] Zipped 15822 entries.
[2019-06-04T09:31:54.308Z] Archiving C:\Users\jenkins\AppData\Local\Temp\2\jenkins-maven-box-maven-surefire-no_user.dir-6\surefire-its--windows-jdk7-maven3.6.x.zip
[2019-06-04T09:31:54.309Z] [Fast Archiver] No prior successful build to compare, so performing full copy of artifacts
[Pipeline] archiveArtifacts
[2019-06-04T09:31:57.055Z] Archiving artifacts
[2019-06-04T09:31:57.162Z] [Fast Archiver] No prior successful build to compare, so performing full copy of artifacts
[Pipeline] cleanWs
[2019-06-04T09:31:59.831Z] [WS-CLEANUP] Deleting project workspace...
[2019-06-04T09:31:59.831Z] [WS-CLEANUP] Deferred wipeout is used...
[2019-06-04T09:32:00.148Z] [WS-CLEANUP] done
[Pipeline] }
[Pipeline] // ws
[Pipeline] }
[Pipeline] // timestamps
[Pipeline] }
[Pipeline] // node
[Pipeline] }
[Pipeline] // parallel
[Pipeline] echo
Build result: FAILURE
[Pipeline] jiraIssueSelector
[Pipeline] jiraComment
[Pipeline] emailext
Mime
  • Unnamed multipart/mixed (inline, None, 0 bytes)
View raw message