maven-notifications mailing list archives

Site index · List index
Message view « Date » · « Thread »
Top « Date » · « Thread »
From Apache Jenkins Server <jenk...@builds.apache.org>
Subject Build failed in Jenkins: Maven TLP » maven-enforcer » MENFORCER-294 #29
Date Tue, 04 Jun 2019 05:25:16 GMT
See https://builds.apache.org/job/maven-box/job/maven-enforcer/job/MENFORCER-294/29/

Changes:

* [MNG-6573] Use Maven 3.6.0 as default
* H39 has weird issues, exclude it for now
* Fix no access to currentBuild.rawBuild
* fixed typo
* Include more recent JDKs

All tests passed

Build log:
[...truncated 19262 lines...]
[INFO] ------------------------------------------------------------------------
[INFO] Reactor Summary for Apache Maven Enforcer 3.0.0-SNAPSHOT:
[INFO] 
[INFO] Apache Maven Enforcer .............................. SUCCESS [ 36.919 s]
[INFO] Apache Maven Enforcer API .......................... SUCCESS [  5.108 s]
[INFO] Apache Maven Enforcer Built-In Rules ............... SUCCESS [ 16.082 s]
[INFO] Apache Maven Enforcer Plugin ....................... SUCCESS [04:42 min]
[INFO] ------------------------------------------------------------------------
[INFO] BUILD SUCCESS
[INFO] ------------------------------------------------------------------------
[INFO] Total time:  05:41 min
[INFO] Finished at: 2019-06-04T05:21:49Z
[INFO] ------------------------------------------------------------------------
[INFO] [jenkins-event-spy] Generated /home/jenkins/jenkins-slave/workspace/box_maven-enforcer_MENFORCER-294@tmp/withMaven480443c4/maven-spy-20190604-051607-603625380088149794972.log
[Pipeline] // withMaven
[Pipeline] cleanWs
[Pipeline] }
[Pipeline] // dir
[Pipeline] }
[WS-CLEANUP] Deleting project workspace...
[WS-CLEANUP] Deferred wipeout is used...
[WS-CLEANUP] done
[Pipeline] }
[Pipeline] // stage
[Pipeline] }
[Pipeline] // node
[Pipeline] }
[INFO] run post-build script verify.groovy
[INFO]           require-no-repositories_failure_plugin-repositories\pom.xml SUCCESS (4.4
s)
[INFO] Building: require-no-repositories_failure_repositories\pom.xml
[withMaven] artifactsPublisher - Archive artifact m/pom.xml under org/apache/maven/enforcer/enforcer/3.0.0-SNAPSHOT/enforcer-3.0.0-SNAPSHOT.pom
[withMaven] artifactsPublisher - Archive artifact m/target/enforcer-3.0.0-SNAPSHOT-site.xml
under org/apache/maven/enforcer/enforcer/3.0.0-SNAPSHOT/enforcer-3.0.0-SNAPSHOT-site.xml
[withMaven] artifactsPublisher - Archive artifact m/enforcer-api/pom.xml under org/apache/maven/enforcer/enforcer-api/3.0.0-SNAPSHOT/enforcer-api-3.0.0-SNAPSHOT.pom
[withMaven] artifactsPublisher - Archive artifact m/enforcer-api/target/enforcer-api-3.0.0-SNAPSHOT.jar
under org/apache/maven/enforcer/enforcer-api/3.0.0-SNAPSHOT/enforcer-api-3.0.0-SNAPSHOT.jar
[withMaven] artifactsPublisher - Archive artifact m/enforcer-rules/pom.xml under org/apache/maven/enforcer/enforcer-rules/3.0.0-SNAPSHOT/enforcer-rules-3.0.0-SNAPSHOT.pom
[withMaven] artifactsPublisher - Archive artifact m/enforcer-rules/target/enforcer-rules-3.0.0-SNAPSHOT.jar
under org/apache/maven/enforcer/enforcer-rules/3.0.0-SNAPSHOT/enforcer-rules-3.0.0-SNAPSHOT.jar
[withMaven] artifactsPublisher - Archive artifact m/enforcer-rules/target/enforcer-rules-3.0.0-SNAPSHOT-tests.jar
under org/apache/maven/enforcer/enforcer-rules/3.0.0-SNAPSHOT/enforcer-rules-3.0.0-SNAPSHOT-tests.jar
[withMaven] artifactsPublisher - Archive artifact m/maven-enforcer-plugin/pom.xml under org/apache/maven/plugins/maven-enforcer-plugin/3.0.0-SNAPSHOT/maven-enforcer-plugin-3.0.0-SNAPSHOT.pom
[withMaven] artifactsPublisher - Archive artifact m/maven-enforcer-plugin/target/maven-enforcer-plugin-3.0.0-SNAPSHOT.jar
under org/apache/maven/plugins/maven-enforcer-plugin/3.0.0-SNAPSHOT/maven-enforcer-plugin-3.0.0-SNAPSHOT.jar
[withMaven] invokerPublisher - Archive invoker results for Maven artifact MavenArtifact{org.apache.maven.plugins:maven-enforcer-plugin:maven-plugin:3.0.0-SNAPSHOT(version:
3.0.0-SNAPSHOT, snapshot:false) } generated by PluginInvocation{org.apache.maven.plugins:maven-invoker-plugin:3.0.1@run
 integration-test}: m/maven-enforcer-plugin/target/invoker-reports/*.xml
[withMaven] junitPublisher - Archive test results for Maven artifact org.apache.maven.enforcer:enforcer-api:jar:3.0.0-SNAPSHOT
generated by maven-surefire-plugin:test (default-test): m/enforcer-api/target/surefire-reports/*.xml
[withMaven] junitPublisher - Archive test results for Maven artifact org.apache.maven.enforcer:enforcer-rules:jar:3.0.0-SNAPSHOT
generated by maven-surefire-plugin:test (default-test): m/enforcer-rules/target/surefire-reports/*.xml
[withMaven] junitPublisher - Archive test results for Maven artifact org.apache.maven.plugins:maven-enforcer-plugin:maven-plugin:3.0.0-SNAPSHOT
generated by maven-surefire-plugin:test (default-test): m/maven-enforcer-plugin/target/surefire-reports/*.xml
Recording test results
[INFO] run post-build script verify.groovy
[INFO]           require-no-repositories_failure_repositories\pom.xml SUCCESS (4.4 s)
[INFO] Building: require-no-repositories_mm\pom.xml
[INFO]           require-no-repositories_mm\pom.xml ............... SUCCESS (4.7 s)
[INFO] Building: require-no-repositories_mm_ci\pom.xml
[INFO]           require-no-repositories_mm_ci\pom.xml ............ SUCCESS (4.3 s)
[INFO] Building: require-plugin-versions\pom.xml
[INFO]           require-plugin-versions\pom.xml .................. SUCCESS (4.4 s)
[INFO] Building: require-plugin-versions-ci\pom.xml
[withMaven] junitPublisher - Archive test results for Maven artifact org.apache.maven.enforcer:enforcer-api:jar:3.0.0-SNAPSHOT
generated by maven-surefire-plugin:test (default-test): m\enforcer-api\target\surefire-reports\*.xml
[withMaven] junitPublisher - Archive test results for Maven artifact org.apache.maven.enforcer:enforcer-rules:jar:3.0.0-SNAPSHOT
generated by maven-surefire-plugin:test (default-test): m\enforcer-rules\target\surefire-reports\*.xml
[withMaven] junitPublisher - Archive test results for Maven artifact org.apache.maven.plugins:maven-enforcer-plugin:maven-plugin:3.0.0-SNAPSHOT
generated by maven-surefire-plugin:test (default-test): m\maven-enforcer-plugin\target\surefire-reports\*.xml
Recording test results
[withMaven] Publishers: Pipeline Graph Publisher: 3 ms, Invoker Publisher: 60771 ms, Junit
Publisher: 15371 ms, Dependencies Fingerprint Publisher: 933 ms
[Pipeline] // withMaven
[INFO] run post-build script verify.groovy
[INFO]           require-plugin-versions-ci\pom.xml ............... SUCCESS (4.2 s)
[INFO] Building: require-plugin-versions-custom-packaging\pom.xml
[Pipeline] cleanWs
[WS-CLEANUP] Deleting project workspace...
[WS-CLEANUP] Deferred wipeout is used...
[WS-CLEANUP] done
[Pipeline] }
[Pipeline] // stage
[Pipeline] }
[Pipeline] // node
[Pipeline] }
[withMaven] Publishers: Pipeline Graph Publisher: 4 ms, Invoker Publisher: 57216 ms, Junit
Publisher: 10154 ms, Dependencies Fingerprint Publisher: 623 ms
[Pipeline] // withMaven
[Pipeline] cleanWs
[INFO] artifact org.apache.maven.plugins:maven-resources-plugin: checking for updates from
central
[INFO] artifact org.apache.maven.plugins:maven-compiler-plugin: checking for updates from
central
[INFO] artifact org.apache.maven.plugins:maven-surefire-plugin: checking for updates from
central
[INFO] artifact org.apache.maven.plugins:maven-install-plugin: checking for updates from central
[WS-CLEANUP] Deleting project workspace...
[WS-CLEANUP] Deferred wipeout is used...
[INFO] artifact org.apache.maven.plugins:maven-deploy-plugin: checking for updates from central
[WS-CLEANUP] done
[Pipeline] }
[Pipeline] // stage
[Pipeline] }
[Pipeline] // node
[Pipeline] }
[withMaven] junitPublisher - Archive test results for Maven artifact org.apache.maven.enforcer:enforcer-api:jar:3.0.0-SNAPSHOT
generated by maven-surefire-plugin:test (default-test): m/enforcer-api/target/surefire-reports/*.xml
[withMaven] junitPublisher - Archive test results for Maven artifact org.apache.maven.enforcer:enforcer-rules:jar:3.0.0-SNAPSHOT
generated by maven-surefire-plugin:test (default-test): m/enforcer-rules/target/surefire-reports/*.xml
[withMaven] junitPublisher - Archive test results for Maven artifact org.apache.maven.plugins:maven-enforcer-plugin:maven-plugin:3.0.0-SNAPSHOT
generated by maven-surefire-plugin:test (default-test): m/maven-enforcer-plugin/target/surefire-reports/*.xml
Recording test results
[INFO]           require-plugin-versions-custom-packaging\pom.xml . SUCCESS (10.4 s)
[INFO] Building: require-plugin-versions-expressions\pom.xml
[INFO]           require-plugin-versions-expressions\pom.xml ...... SUCCESS (4.3 s)
[INFO] Building: require-plugin-versions-mm-ci-friendly\pom.xml
[INFO]           require-plugin-versions-mm-ci-friendly\pom.xml ... SUCCESS (7.5 s)
[INFO] Building: require-plugin-versions-plugin-with-extensions\pom.xml
[withMaven] Publishers: Pipeline Graph Publisher: 3 ms, Invoker Publisher: 61644 ms, Junit
Publisher: 15479 ms, Dependencies Fingerprint Publisher: 940 ms
[Pipeline] // withMaven
[Pipeline] cleanWs
[WS-CLEANUP] Deleting project workspace...
[WS-CLEANUP] Deferred wipeout is used...
[WS-CLEANUP] done
[Pipeline] }
[Pipeline] // stage
[Pipeline] }
[Pipeline] // node
[Pipeline] }
[INFO]           require-plugin-versions-plugin-with-extensions\pom.xml SUCCESS (8.7 s)
[INFO] Building: require-plugin-versions-plugin-with-integration-test-lifecycle\pom.xml
[withMaven] junitPublisher - Archive test results for Maven artifact org.apache.maven.enforcer:enforcer-api:jar:3.0.0-SNAPSHOT
generated by maven-surefire-plugin:test (default-test): m/enforcer-api/target/surefire-reports/*.xml
[withMaven] junitPublisher - Archive test results for Maven artifact org.apache.maven.enforcer:enforcer-rules:jar:3.0.0-SNAPSHOT
generated by maven-surefire-plugin:test (default-test): m/enforcer-rules/target/surefire-reports/*.xml
[withMaven] junitPublisher - Archive test results for Maven artifact org.apache.maven.plugins:maven-enforcer-plugin:maven-plugin:3.0.0-SNAPSHOT
generated by maven-surefire-plugin:test (default-test): m/maven-enforcer-plugin/target/surefire-reports/*.xml
Recording test results
[INFO]           require-plugin-versions-plugin-with-integration-test-lifecycle\pom.xml SUCCESS
(27.8 s)
[INFO] Building: require-plugin-versions-projectGAVexpressions\pom.xml
[withMaven] openTasksPublisher - Scan Tasks for Maven artifact org.apache.maven.enforcer:enforcer-api:jar:3.0.0-SNAPSHOT
in source directory m/enforcer-api/src/main/java
[withMaven] openTasksPublisher - Scan Tasks for Maven artifact org.apache.maven.enforcer:enforcer-rules:jar:3.0.0-SNAPSHOT
in source directory m/enforcer-rules/src/main/java
[withMaven] openTasksPublisher - Scan Tasks for Maven artifact org.apache.maven.plugins:maven-enforcer-plugin:maven-plugin:3.0.0-SNAPSHOT
in source directory m/maven-enforcer-plugin/src/main/java
[TASKS] Scanning folder '/home/jenkins/jenkins-slave/workspace/box_maven-enforcer_MENFORCER-294'
for files matching the pattern 'm/enforcer-api/src/main/java/**/*,m/enforcer-rules/src/main/java/**/*,m/maven-enforcer-plugin/src/main/java/**/*'
- excludes: null
[TASKS] Found 51 files to scan for tasks
[TASKS] Found 5 open tasks.
Skipping warnings blame since pipelines do not have an SCM link.%n
[TASKS] Computing warning deltas based on reference build #28
[withMaven] Publishers: Pipeline Graph Publisher: 5 ms, Generated Artifacts Publisher: 3788
ms, Invoker Publisher: 61665 ms, Junit Publisher: 15429 ms, Dependencies Fingerprint Publisher:
928 ms, Open Task Scanner Publisher: 1502 ms
[Pipeline] // withMaven
[Pipeline] cleanWs
[INFO]           require-plugin-versions-projectGAVexpressions\pom.xml SUCCESS (4.5 s)
[INFO] Building: require-profile-ids-exist_failure\pom.xml
[WS-CLEANUP] Deleting project workspace...
[WS-CLEANUP] Deferred wipeout is used...
[WS-CLEANUP] done
[Pipeline] }
[Pipeline] // stage
[Pipeline] }
[Pipeline] // node
[Pipeline] }
[INFO] run post-build script verify.groovy
[INFO]           require-profile-ids-exist_failure\pom.xml ........ SUCCESS (4.6 s)
[INFO] Building: require-profile-ids-exist_success\pom.xml
[INFO]           require-profile-ids-exist_success\pom.xml ........ SUCCESS (4.4 s)
[INFO] Building: require-property\pom.xml
[INFO]           require-property\pom.xml ......................... SUCCESS (4.5 s)
[INFO] Building: require-release-dependencies\pom.xml
[INFO]           require-release-dependencies\pom.xml ............. SUCCESS (4.5 s)
[INFO] Building: require-release-dependencies-excludes\pom.xml
[INFO] snapshot org.apache.maven.plugins.enforcer.its:menforcer85_api:1.0-SNAPSHOT: checking
for updates from apache-snapshots
[INFO] snapshot org.apache.maven.plugins.enforcer.its:menforcer85_api:1.0-SNAPSHOT: checking
for updates from Nexus
[INFO] artifact org.apache.maven.plugins.enforcer.its.menforcer85_api:1.0-SNAPSHOT: checking
for updates from central
[INFO] org.apache.maven.plugins.enforcer.its.menforcer85_api.1.0-SNAPSHOT: checking for updates
from central
[INFO]           require-release-dependencies-excludes\pom.xml .... SUCCESS (5.0 s)
[INFO] Building: require-release-dependencies-excludes_failure\pom.xml
[INFO]           require-release-dependencies-excludes_failure\pom.xml SUCCESS (4.4 s)
[INFO] Building: require-release-version\pom.xml
[INFO]           require-release-version\pom.xml .................. SUCCESS (4.5 s)
[INFO] Building: require-same-versions_failure\pom.xml
[INFO]           require-same-versions_failure\pom.xml ............ SUCCESS (4.6 s)
[INFO] Building: require-same-versions_success\pom.xml
[INFO]           require-same-versions_success\pom.xml ............ SUCCESS (4.6 s)
[INFO] Building: require-snapshot-version_failure\pom.xml
[INFO]           require-snapshot-version_failure\pom.xml ......... SUCCESS (4.4 s)
[INFO] Building: require-snapshot-version_success\pom.xml
[INFO]           require-snapshot-version_success\pom.xml ......... SUCCESS (4.2 s)
[INFO] Building: require-upper-bound-dependencies-managed_failure\pom.xml
[INFO] run post-build script verify.groovy
[INFO]           require-upper-bound-dependencies-managed_failure\pom.xml SUCCESS (4.5 s)
[INFO] Building: require-upper-bound-dependencies-managed_success\pom.xml
[INFO]           require-upper-bound-dependencies-managed_success\pom.xml SUCCESS (4.5 s)
[INFO] Building: require-upper-bound-dependencies-unique_failure\pom.xml
[INFO] snapshot org.apache.maven.plugins.enforcer.its:menforcer134_project:1.0-SNAPSHOT: checking
for updates from apache-snapshots
[INFO] snapshot org.apache.maven.plugins.enforcer.its:menforcer134_project:1.0-SNAPSHOT: checking
for updates from Nexus
[INFO] artifact org.apache.maven.plugins.enforcer.its.menforcer134_project:1.0-SNAPSHOT: checking
for updates from central
[INFO] org.apache.maven.plugins.enforcer.its.menforcer134_project.1.0-SNAPSHOT: checking for
updates from central
[INFO] snapshot org.apache.maven.plugins.enforcer.its:menforcer134_modelbuilder:1.0-SNAPSHOT:
checking for updates from apache-snapshots
[INFO] snapshot org.apache.maven.plugins.enforcer.its:menforcer134_modelbuilder:1.0-SNAPSHOT:
checking for updates from Nexus
[INFO] artifact org.apache.maven.plugins.enforcer.its.menforcer134_modelbuilder:1.0-SNAPSHOT:
checking for updates from central
[INFO] org.apache.maven.plugins.enforcer.its.menforcer134_modelbuilder.1.0-SNAPSHOT: checking
for updates from central
[INFO] snapshot org.apache.maven.plugins.enforcer.its:menforcer134_model:1.0-SNAPSHOT: checking
for updates from apache-snapshots
[INFO] snapshot org.apache.maven.plugins.enforcer.its:menforcer134_model:1.0-SNAPSHOT: checking
for updates from Nexus
[INFO] artifact org.apache.maven.plugins.enforcer.its.menforcer134_model:1.0-SNAPSHOT: checking
for updates from central
[INFO] org.apache.maven.plugins.enforcer.its.menforcer134_model.1.0-SNAPSHOT: checking for
updates from central
[INFO] run post-build script verify.groovy
[INFO]           require-upper-bound-dependencies-unique_failure\pom.xml SUCCESS (6.3 s)
[INFO] Building: require-upper-bound-dependencies-unique_success\pom.xml
[INFO]           require-upper-bound-dependencies-unique_success\pom.xml SUCCESS (4.6 s)
[INFO] Building: require-upper-bound-deps_failure\pom.xml
[INFO] run post-build script verify.groovy
[INFO]           require-upper-bound-deps_failure\pom.xml ......... SUCCESS (4.7 s)
[INFO] Building: require-upper-bound-deps_ignored\pom.xml
[INFO] run post-build script verify.groovy
[INFO]           require-upper-bound-deps_ignored\pom.xml ......... SUCCESS (4.4 s)
[INFO] Building: require-upper-bound-deps_success\pom.xml
[INFO]           require-upper-bound-deps_success\pom.xml ......... SUCCESS (4.5 s)
[INFO] Building: resolve_collect_dependencies\pom.xml
[INFO] run post-build script verify.groovy
[INFO]           resolve_collect_dependencies\pom.xml ............. SUCCESS (9.1 s)
[INFO] -------------------------------------------------
[INFO] Build Summary:
[INFO]   Passed: 68, Failed: 0, Errors: 0, Skipped: 0
[INFO] -------------------------------------------------
[INFO] 
[INFO] --- mrm-maven-plugin:1.0.0:stop (default) @ maven-enforcer-plugin ---
[INFO] Stopping Mock Repository Manager on http://localhost:59518
[INFO] Mock Repository Manager http://localhost:59518 is stopped.
[INFO] 
[INFO] --- maven-checkstyle-plugin:3.0.0:check (checkstyle-check) @ maven-enforcer-plugin
---
[INFO] ------------------------------------------------------------------------
[INFO] Reactor Summary for Apache Maven Enforcer 3.0.0-SNAPSHOT:
[INFO] 
[INFO] Apache Maven Enforcer .............................. SUCCESS [ 41.059 s]
[INFO] Apache Maven Enforcer API .......................... SUCCESS [  7.464 s]
[INFO] Apache Maven Enforcer Built-In Rules ............... SUCCESS [ 20.055 s]
[INFO] Apache Maven Enforcer Plugin ....................... SUCCESS [06:35 min]
[INFO] ------------------------------------------------------------------------
[INFO] BUILD SUCCESS
[INFO] ------------------------------------------------------------------------
[INFO] Total time:  07:45 min
[INFO] Finished at: 2019-06-03T22:24:50-07:00
[INFO] ------------------------------------------------------------------------
[INFO] [jenkins-event-spy] Generated F:\jenkins\jenkins-slave\workspace\box_maven-enforcer_MENFORCER-294@tmp\withMavene542900c\maven-spy-20190603-221704-7589252339177299733504.log
[Pipeline] }
[Pipeline] // dir
[Pipeline] }
[withMaven] invokerPublisher - Archive invoker results for Maven artifact MavenArtifact{org.apache.maven.plugins:maven-enforcer-plugin:maven-plugin:3.0.0-SNAPSHOT(version:
3.0.0-SNAPSHOT, snapshot:false) } generated by PluginInvocation{org.apache.maven.plugins:maven-invoker-plugin:3.0.1@run
 integration-test}: m\maven-enforcer-plugin\target\invoker-reports\*.xml
[withMaven] junitPublisher - Archive test results for Maven artifact org.apache.maven.enforcer:enforcer-api:jar:3.0.0-SNAPSHOT
generated by maven-surefire-plugin:test (default-test): m\enforcer-api\target\surefire-reports\*.xml
[withMaven] junitPublisher - Archive test results for Maven artifact org.apache.maven.enforcer:enforcer-rules:jar:3.0.0-SNAPSHOT
generated by maven-surefire-plugin:test (default-test): m\enforcer-rules\target\surefire-reports\*.xml
[withMaven] junitPublisher - Archive test results for Maven artifact org.apache.maven.plugins:maven-enforcer-plugin:maven-plugin:3.0.0-SNAPSHOT
generated by maven-surefire-plugin:test (default-test): m\maven-enforcer-plugin\target\surefire-reports\*.xml
Recording test results
[withMaven] Publishers: Pipeline Graph Publisher: 4 ms, Invoker Publisher: 20984 ms, Junit
Publisher: 1560 ms, Dependencies Fingerprint Publisher: 99 ms
[Pipeline] // withMaven
[Pipeline] cleanWs
[WS-CLEANUP] Deleting project workspace...
[WS-CLEANUP] Deferred wipeout is used...
[WS-CLEANUP] done
[Pipeline] }
[Pipeline] // stage
[Pipeline] }
[Pipeline] // node
[Pipeline] }
[Pipeline] // parallel
[Pipeline] echo
[FAILURE-003] AbortException hudson.AbortException: script returned exit code 1
[Pipeline] stage
[Pipeline] { (Notifications)
[Pipeline] echo
Build result: FAILURE
[Pipeline] jiraIssueSelector
[Pipeline] jiraComment
[Pipeline] emailext
Mime
  • Unnamed multipart/mixed (inline, None, 0 bytes)
View raw message