maven-notifications mailing list archives

Site index · List index
Message view « Date » · « Thread »
Top « Date » · « Thread »
From Apache Jenkins Server <jenk...@builds.apache.org>
Subject Build failed in Jenkins: Maven TLP » maven-resolver » master #19
Date Mon, 03 Jun 2019 21:32:59 GMT
See https://builds.apache.org/job/maven-box/job/maven-resolver/job/master/19/

No changes.

All tests passed

Build log:
[...truncated 25886 lines...]
[INFO] Downloaded from central: https://repo.maven.apache.org/maven2/commons-codec/commons-codec/1.6/commons-codec-1.6.pom
(11 kB at 219 kB/s)
[INFO] Downloading from central: https://repo.maven.apache.org/maven2/org/slf4j/slf4j-api/1.7.5/slf4j-api-1.7.5.pom
[INFO] Downloaded from central: https://repo.maven.apache.org/maven2/org/slf4j/slf4j-api/1.7.5/slf4j-api-1.7.5.pom
(2.7 kB at 54 kB/s)
[INFO] Downloading from central: https://repo.maven.apache.org/maven2/org/slf4j/slf4j-parent/1.7.5/slf4j-parent-1.7.5.pom
[INFO] Downloaded from central: https://repo.maven.apache.org/maven2/org/slf4j/slf4j-parent/1.7.5/slf4j-parent-1.7.5.pom
(12 kB at 236 kB/s)
[INFO] Downloading from central: https://repo.maven.apache.org/maven2/org/apache/maven/doxia/doxia-sink-api/1.7/doxia-sink-api-1.7.pom
[INFO] Downloaded from central: https://repo.maven.apache.org/maven2/org/apache/maven/doxia/doxia-sink-api/1.7/doxia-sink-api-1.7.pom
(1.5 kB at 31 kB/s)
[INFO] Downloading from central: https://repo.maven.apache.org/maven2/org/apache/maven/doxia/doxia/1.7/doxia-1.7.pom
[INFO] Downloaded from central: https://repo.maven.apache.org/maven2/org/apache/maven/doxia/doxia/1.7/doxia-1.7.pom
(15 kB at 305 kB/s)
[INFO] Downloading from central: https://repo.maven.apache.org/maven2/org/apache/maven/doxia/doxia-logging-api/1.7/doxia-logging-api-1.7.pom
[INFO] Downloaded from central: https://repo.maven.apache.org/maven2/org/apache/maven/doxia/doxia-logging-api/1.7/doxia-logging-api-1.7.pom
(1.5 kB at 31 kB/s)
[INFO] Downloading from central: https://repo.maven.apache.org/maven2/org/apache/maven/doxia/doxia-site-renderer/1.7.4/doxia-site-renderer-1.7.4.pom
[INFO] Downloaded from central: https://repo.maven.apache.org/maven2/org/apache/maven/doxia/doxia-site-renderer/1.7.4/doxia-site-renderer-1.7.4.pom
(6.7 kB at 134 kB/s)
[INFO] Downloading from central: https://repo.maven.apache.org/maven2/org/apache/maven/doxia/doxia-sitetools/1.7.4/doxia-sitetools-1.7.4.pom
[INFO] Downloaded from central: https://repo.maven.apache.org/maven2/org/apache/maven/doxia/doxia-sitetools/1.7.4/doxia-sitetools-1.7.4.pom
(14 kB at 290 kB/s)
[INFO] Downloading from central: https://repo.maven.apache.org/maven2/org/apache/maven/doxia/doxia-core/1.7/doxia-core-1.7.pom
[INFO] Downloaded from central: https://repo.maven.apache.org/maven2/org/apache/maven/doxia/doxia-core/1.7/doxia-core-1.7.pom
(4.1 kB at 80 kB/s)
[INFO] Downloading from central: https://repo.maven.apache.org/maven2/org/apache/maven/doxia/doxia-decoration-model/1.7.4/doxia-decoration-model-1.7.4.pom
[INFO] Downloaded from central: https://repo.maven.apache.org/maven2/org/apache/maven/doxia/doxia-decoration-model/1.7.4/doxia-decoration-model-1.7.4.pom
(3.4 kB at 67 kB/s)
[INFO] Downloading from central: https://repo.maven.apache.org/maven2/org/apache/maven/doxia/doxia-skin-model/1.7.4/doxia-skin-model-1.7.4.pom
[INFO] Downloaded from central: https://repo.maven.apache.org/maven2/org/apache/maven/doxia/doxia-skin-model/1.7.4/doxia-skin-model-1.7.4.pom
(3.0 kB at 61 kB/s)
[INFO] Downloading from central: https://repo.maven.apache.org/maven2/org/apache/maven/doxia/doxia-module-xhtml/1.7/doxia-module-xhtml-1.7.pom
[INFO] Downloaded from central: https://repo.maven.apache.org/maven2/org/apache/maven/doxia/doxia-module-xhtml/1.7/doxia-module-xhtml-1.7.pom
(1.6 kB at 33 kB/s)
[INFO] Downloading from central: https://repo.maven.apache.org/maven2/org/apache/maven/doxia/doxia-modules/1.7/doxia-modules-1.7.pom
[INFO] Downloaded from central: https://repo.maven.apache.org/maven2/org/apache/maven/doxia/doxia-modules/1.7/doxia-modules-1.7.pom
(2.6 kB at 54 kB/s)
[INFO] Downloading from central: https://repo.maven.apache.org/maven2/org/codehaus/groovy/groovy-all/2.4.8/groovy-all-2.4.8.pom
[INFO] Downloaded from central: https://repo.maven.apache.org/maven2/org/codehaus/groovy/groovy-all/2.4.8/groovy-all-2.4.8.pom
(21 kB at 419 kB/s)
[INFO] Downloading from central: https://repo.maven.apache.org/maven2/org/apache/maven/shared/maven-invoker/3.0.0/maven-invoker-3.0.0.jar
[INFO] Downloading from central: https://repo.maven.apache.org/maven2/org/apache/maven/reporting/maven-reporting-impl/2.4/maven-reporting-impl-2.4.jar
[INFO] Downloading from central: https://repo.maven.apache.org/maven2/commons-digester/commons-digester/1.8.1/commons-digester-1.8.1.jar
[INFO] Downloading from central: https://repo.maven.apache.org/maven2/commons-beanutils/commons-beanutils/1.8.3/commons-beanutils-1.8.3.jar
[INFO] Downloading from central: https://repo.maven.apache.org/maven2/commons-validator/commons-validator/1.4.1/commons-validator-1.4.1.jar
[INFO] Downloaded from central: https://repo.maven.apache.org/maven2/org/apache/maven/shared/maven-invoker/3.0.0/maven-invoker-3.0.0.jar
(33 kB at 620 kB/s)
[INFO] Downloading from central: https://repo.maven.apache.org/maven2/commons-logging/commons-logging/1.2/commons-logging-1.2.jar
[INFO] Downloaded from central: https://repo.maven.apache.org/maven2/org/apache/maven/reporting/maven-reporting-impl/2.4/maven-reporting-impl-2.4.jar
(20 kB at 362 kB/s)
[INFO] Downloading from central: https://repo.maven.apache.org/maven2/org/apache/maven/shared/maven-script-interpreter/1.2/maven-script-interpreter-1.2.jar
[INFO] Downloaded from central: https://repo.maven.apache.org/maven2/commons-digester/commons-digester/1.8.1/commons-digester-1.8.1.jar
(146 kB at 2.5 MB/s)
[INFO] Downloading from central: https://repo.maven.apache.org/maven2/org/apache/ant/ant/1.8.1/ant-1.8.1.jar
[INFO] Downloaded from central: https://repo.maven.apache.org/maven2/commons-validator/commons-validator/1.4.1/commons-validator-1.4.1.jar
(190 kB at 3.1 MB/s)
[INFO] Downloading from central: https://repo.maven.apache.org/maven2/org/apache/maven/shared/maven-artifact-transfer/0.9.1/maven-artifact-transfer-0.9.1.jar
[INFO] Downloaded from central: https://repo.maven.apache.org/maven2/commons-beanutils/commons-beanutils/1.8.3/commons-beanutils-1.8.3.jar
(232 kB at 3.7 MB/s)
[INFO] Downloading from central: https://repo.maven.apache.org/maven2/org/apache/maven/shared/maven-common-artifact-filters/3.0.1/maven-common-artifact-filters-3.0.1.jar
[INFO] Downloaded from central: https://repo.maven.apache.org/maven2/commons-logging/commons-logging/1.2/commons-logging-1.2.jar
(62 kB at 606 kB/s)
[INFO] Downloading from central: https://repo.maven.apache.org/maven2/commons-codec/commons-codec/1.6/commons-codec-1.6.jar
[INFO] Downloaded from central: https://repo.maven.apache.org/maven2/org/apache/maven/shared/maven-script-interpreter/1.2/maven-script-interpreter-1.2.jar
(22 kB at 210 kB/s)
[INFO] Downloading from central: https://repo.maven.apache.org/maven2/org/slf4j/slf4j-api/1.7.5/slf4j-api-1.7.5.jar
[INFO] Downloaded from central: https://repo.maven.apache.org/maven2/org/apache/maven/shared/maven-artifact-transfer/0.9.1/maven-artifact-transfer-0.9.1.jar
(123 kB at 1.1 MB/s)
[INFO] Downloading from central: https://repo.maven.apache.org/maven2/org/apache/maven/doxia/doxia-sink-api/1.7/doxia-sink-api-1.7.jar
[INFO] Downloaded from central: https://repo.maven.apache.org/maven2/org/apache/maven/shared/maven-common-artifact-filters/3.0.1/maven-common-artifact-filters-3.0.1.jar
(61 kB at 512 kB/s)
[INFO] Downloading from central: https://repo.maven.apache.org/maven2/org/apache/maven/doxia/doxia-logging-api/1.7/doxia-logging-api-1.7.jar
[INFO] Downloaded from central: https://repo.maven.apache.org/maven2/org/slf4j/slf4j-api/1.7.5/slf4j-api-1.7.5.jar
(26 kB at 167 kB/s)
[INFO] Downloading from central: https://repo.maven.apache.org/maven2/org/apache/maven/doxia/doxia-site-renderer/1.7.4/doxia-site-renderer-1.7.4.jar
[INFO] Downloaded from central: https://repo.maven.apache.org/maven2/commons-codec/commons-codec/1.6/commons-codec-1.6.jar
(233 kB at 1.5 MB/s)
[INFO] Downloading from central: https://repo.maven.apache.org/maven2/org/apache/maven/doxia/doxia-decoration-model/1.7.4/doxia-decoration-model-1.7.4.jar
[INFO] Downloaded from central: https://repo.maven.apache.org/maven2/org/apache/ant/ant/1.8.1/ant-1.8.1.jar
(1.5 MB at 9.4 MB/s)
[INFO] Downloading from central: https://repo.maven.apache.org/maven2/org/apache/maven/doxia/doxia-skin-model/1.7.4/doxia-skin-model-1.7.4.jar
[INFO] Downloaded from central: https://repo.maven.apache.org/maven2/org/apache/maven/doxia/doxia-sink-api/1.7/doxia-sink-api-1.7.jar
(11 kB at 68 kB/s)
[INFO] Downloading from central: https://repo.maven.apache.org/maven2/org/apache/maven/doxia/doxia-module-xhtml/1.7/doxia-module-xhtml-1.7.jar
[INFO] Downloaded from central: https://repo.maven.apache.org/maven2/org/apache/maven/doxia/doxia-logging-api/1.7/doxia-logging-api-1.7.jar
(12 kB at 68 kB/s)
[INFO] Downloading from central: https://repo.maven.apache.org/maven2/org/codehaus/groovy/groovy-all/2.4.8/groovy-all-2.4.8.jar
[INFO] Downloaded from central: https://repo.maven.apache.org/maven2/org/apache/maven/doxia/doxia-skin-model/1.7.4/doxia-skin-model-1.7.4.jar
(16 kB at 74 kB/s)
[INFO] Downloaded from central: https://repo.maven.apache.org/maven2/org/apache/maven/doxia/doxia-site-renderer/1.7.4/doxia-site-renderer-1.7.4.jar
(64 kB at 297 kB/s)
[INFO] Downloaded from central: https://repo.maven.apache.org/maven2/org/apache/maven/doxia/doxia-decoration-model/1.7.4/doxia-decoration-model-1.7.4.jar
(61 kB at 282 kB/s)
[INFO] Downloaded from central: https://repo.maven.apache.org/maven2/org/apache/maven/doxia/doxia-module-xhtml/1.7/doxia-module-xhtml-1.7.jar
(17 kB at 80 kB/s)
[INFO] Downloaded from central: https://repo.maven.apache.org/maven2/org/codehaus/groovy/groovy-all/2.4.8/groovy-all-2.4.8.jar
(7.0 MB at 18 MB/s)
[INFO] Installing /home/jenkins/jenkins-slave/workspace/maven-box_maven-resolver_master/m/pom.xml
to /home/jenkins/jenkins-slave/workspace/maven-box_maven-resolver_master/m/maven-resolver-demos/maven-resolver-demo-maven-plugin/target/local-repo/org/apache/maven/resolver/maven-resolver/1.4.0-SNAPSHOT/maven-resolver-1.4.0-SNAPSHOT.pom
[INFO] Installing /home/jenkins/jenkins-slave/workspace/maven-box_maven-resolver_master/m/target/maven-resolver-1.4.0-SNAPSHOT-site.xml
to /home/jenkins/jenkins-slave/workspace/maven-box_maven-resolver_master/m/maven-resolver-demos/maven-resolver-demo-maven-plugin/target/local-repo/org/apache/maven/resolver/maven-resolver/1.4.0-SNAPSHOT/maven-resolver-1.4.0-SNAPSHOT-site.xml
[INFO] Installing /home/jenkins/jenkins-slave/workspace/maven-box_maven-resolver_master/m/maven-resolver-api/pom.xml
to /home/jenkins/jenkins-slave/workspace/maven-box_maven-resolver_master/m/maven-resolver-demos/maven-resolver-demo-maven-plugin/target/local-repo/org/apache/maven/resolver/maven-resolver-api/1.4.0-SNAPSHOT/maven-resolver-api-1.4.0-SNAPSHOT.pom
[INFO] Installing /home/jenkins/jenkins-slave/workspace/maven-box_maven-resolver_master/m/maven-resolver-api/target/maven-resolver-api-1.4.0-SNAPSHOT.jar
to /home/jenkins/jenkins-slave/workspace/maven-box_maven-resolver_master/m/maven-resolver-demos/maven-resolver-demo-maven-plugin/target/local-repo/org/apache/maven/resolver/maven-resolver-api/1.4.0-SNAPSHOT/maven-resolver-api-1.4.0-SNAPSHOT.jar
[INFO] Installing /home/jenkins/jenkins-slave/workspace/maven-box_maven-resolver_master/m/maven-resolver-spi/pom.xml
to /home/jenkins/jenkins-slave/workspace/maven-box_maven-resolver_master/m/maven-resolver-demos/maven-resolver-demo-maven-plugin/target/local-repo/org/apache/maven/resolver/maven-resolver-spi/1.4.0-SNAPSHOT/maven-resolver-spi-1.4.0-SNAPSHOT.pom
[INFO] Installing /home/jenkins/jenkins-slave/workspace/maven-box_maven-resolver_master/m/maven-resolver-spi/target/maven-resolver-spi-1.4.0-SNAPSHOT.jar
to /home/jenkins/jenkins-slave/workspace/maven-box_maven-resolver_master/m/maven-resolver-demos/maven-resolver-demo-maven-plugin/target/local-repo/org/apache/maven/resolver/maven-resolver-spi/1.4.0-SNAPSHOT/maven-resolver-spi-1.4.0-SNAPSHOT.jar
[INFO] Installing /home/jenkins/jenkins-slave/workspace/maven-box_maven-resolver_master/m/maven-resolver-test-util/pom.xml
to /home/jenkins/jenkins-slave/workspace/maven-box_maven-resolver_master/m/maven-resolver-demos/maven-resolver-demo-maven-plugin/target/local-repo/org/apache/maven/resolver/maven-resolver-test-util/1.4.0-SNAPSHOT/maven-resolver-test-util-1.4.0-SNAPSHOT.pom
[INFO] Installing /home/jenkins/jenkins-slave/workspace/maven-box_maven-resolver_master/m/maven-resolver-test-util/target/maven-resolver-test-util-1.4.0-SNAPSHOT.jar
to /home/jenkins/jenkins-slave/workspace/maven-box_maven-resolver_master/m/maven-resolver-demos/maven-resolver-demo-maven-plugin/target/local-repo/org/apache/maven/resolver/maven-resolver-test-util/1.4.0-SNAPSHOT/maven-resolver-test-util-1.4.0-SNAPSHOT.jar
[INFO] Installing /home/jenkins/jenkins-slave/workspace/maven-box_maven-resolver_master/m/maven-resolver-util/pom.xml
to /home/jenkins/jenkins-slave/workspace/maven-box_maven-resolver_master/m/maven-resolver-demos/maven-resolver-demo-maven-plugin/target/local-repo/org/apache/maven/resolver/maven-resolver-util/1.4.0-SNAPSHOT/maven-resolver-util-1.4.0-SNAPSHOT.pom
[INFO] Installing /home/jenkins/jenkins-slave/workspace/maven-box_maven-resolver_master/m/maven-resolver-util/target/maven-resolver-util-1.4.0-SNAPSHOT.jar
to /home/jenkins/jenkins-slave/workspace/maven-box_maven-resolver_master/m/maven-resolver-demos/maven-resolver-demo-maven-plugin/target/local-repo/org/apache/maven/resolver/maven-resolver-util/1.4.0-SNAPSHOT/maven-resolver-util-1.4.0-SNAPSHOT.jar
[INFO] Installing /home/jenkins/jenkins-slave/workspace/maven-box_maven-resolver_master/m/maven-resolver-impl/pom.xml
to /home/jenkins/jenkins-slave/workspace/maven-box_maven-resolver_master/m/maven-resolver-demos/maven-resolver-demo-maven-plugin/target/local-repo/org/apache/maven/resolver/maven-resolver-impl/1.4.0-SNAPSHOT/maven-resolver-impl-1.4.0-SNAPSHOT.pom
[INFO] Installing /home/jenkins/jenkins-slave/workspace/maven-box_maven-resolver_master/m/maven-resolver-impl/target/maven-resolver-impl-1.4.0-SNAPSHOT.jar
to /home/jenkins/jenkins-slave/workspace/maven-box_maven-resolver_master/m/maven-resolver-demos/maven-resolver-demo-maven-plugin/target/local-repo/org/apache/maven/resolver/maven-resolver-impl/1.4.0-SNAPSHOT/maven-resolver-impl-1.4.0-SNAPSHOT.jar
[INFO] Installing /home/jenkins/jenkins-slave/workspace/maven-box_maven-resolver_master/m/maven-resolver-connector-basic/pom.xml
to /home/jenkins/jenkins-slave/workspace/maven-box_maven-resolver_master/m/maven-resolver-demos/maven-resolver-demo-maven-plugin/target/local-repo/org/apache/maven/resolver/maven-resolver-connector-basic/1.4.0-SNAPSHOT/maven-resolver-connector-basic-1.4.0-SNAPSHOT.pom
[INFO] Installing /home/jenkins/jenkins-slave/workspace/maven-box_maven-resolver_master/m/maven-resolver-connector-basic/target/maven-resolver-connector-basic-1.4.0-SNAPSHOT.jar
to /home/jenkins/jenkins-slave/workspace/maven-box_maven-resolver_master/m/maven-resolver-demos/maven-resolver-demo-maven-plugin/target/local-repo/org/apache/maven/resolver/maven-resolver-connector-basic/1.4.0-SNAPSHOT/maven-resolver-connector-basic-1.4.0-SNAPSHOT.jar
[INFO] Installing /home/jenkins/jenkins-slave/workspace/maven-box_maven-resolver_master/m/maven-resolver-transport-classpath/pom.xml
to /home/jenkins/jenkins-slave/workspace/maven-box_maven-resolver_master/m/maven-resolver-demos/maven-resolver-demo-maven-plugin/target/local-repo/org/apache/maven/resolver/maven-resolver-transport-classpath/1.4.0-SNAPSHOT/maven-resolver-transport-classpath-1.4.0-SNAPSHOT.pom
[INFO] Installing /home/jenkins/jenkins-slave/workspace/maven-box_maven-resolver_master/m/maven-resolver-transport-classpath/target/maven-resolver-transport-classpath-1.4.0-SNAPSHOT.jar
to /home/jenkins/jenkins-slave/workspace/maven-box_maven-resolver_master/m/maven-resolver-demos/maven-resolver-demo-maven-plugin/target/local-repo/org/apache/maven/resolver/maven-resolver-transport-classpath/1.4.0-SNAPSHOT/maven-resolver-transport-classpath-1.4.0-SNAPSHOT.jar
[INFO] Installing /home/jenkins/jenkins-slave/workspace/maven-box_maven-resolver_master/m/maven-resolver-transport-file/pom.xml
to /home/jenkins/jenkins-slave/workspace/maven-box_maven-resolver_master/m/maven-resolver-demos/maven-resolver-demo-maven-plugin/target/local-repo/org/apache/maven/resolver/maven-resolver-transport-file/1.4.0-SNAPSHOT/maven-resolver-transport-file-1.4.0-SNAPSHOT.pom
[INFO] Installing /home/jenkins/jenkins-slave/workspace/maven-box_maven-resolver_master/m/maven-resolver-transport-file/target/maven-resolver-transport-file-1.4.0-SNAPSHOT.jar
to /home/jenkins/jenkins-slave/workspace/maven-box_maven-resolver_master/m/maven-resolver-demos/maven-resolver-demo-maven-plugin/target/local-repo/org/apache/maven/resolver/maven-resolver-transport-file/1.4.0-SNAPSHOT/maven-resolver-transport-file-1.4.0-SNAPSHOT.jar
[INFO] Installing /home/jenkins/jenkins-slave/workspace/maven-box_maven-resolver_master/m/maven-resolver-transport-http/pom.xml
to /home/jenkins/jenkins-slave/workspace/maven-box_maven-resolver_master/m/maven-resolver-demos/maven-resolver-demo-maven-plugin/target/local-repo/org/apache/maven/resolver/maven-resolver-transport-http/1.4.0-SNAPSHOT/maven-resolver-transport-http-1.4.0-SNAPSHOT.pom
[INFO] Installing /home/jenkins/jenkins-slave/workspace/maven-box_maven-resolver_master/m/maven-resolver-transport-http/target/maven-resolver-transport-http-1.4.0-SNAPSHOT.jar
to /home/jenkins/jenkins-slave/workspace/maven-box_maven-resolver_master/m/maven-resolver-demos/maven-resolver-demo-maven-plugin/target/local-repo/org/apache/maven/resolver/maven-resolver-transport-http/1.4.0-SNAPSHOT/maven-resolver-transport-http-1.4.0-SNAPSHOT.jar
[INFO] Installing /home/jenkins/jenkins-slave/workspace/maven-box_maven-resolver_master/m/maven-resolver-transport-wagon/pom.xml
to /home/jenkins/jenkins-slave/workspace/maven-box_maven-resolver_master/m/maven-resolver-demos/maven-resolver-demo-maven-plugin/target/local-repo/org/apache/maven/resolver/maven-resolver-transport-wagon/1.4.0-SNAPSHOT/maven-resolver-transport-wagon-1.4.0-SNAPSHOT.pom
[INFO] Installing /home/jenkins/jenkins-slave/workspace/maven-box_maven-resolver_master/m/maven-resolver-transport-wagon/target/maven-resolver-transport-wagon-1.4.0-SNAPSHOT.jar
to /home/jenkins/jenkins-slave/workspace/maven-box_maven-resolver_master/m/maven-resolver-demos/maven-resolver-demo-maven-plugin/target/local-repo/org/apache/maven/resolver/maven-resolver-transport-wagon/1.4.0-SNAPSHOT/maven-resolver-transport-wagon-1.4.0-SNAPSHOT.jar
[INFO] Installing /home/jenkins/jenkins-slave/workspace/maven-box_maven-resolver_master/m/maven-resolver-demos/pom.xml
to /home/jenkins/jenkins-slave/workspace/maven-box_maven-resolver_master/m/maven-resolver-demos/maven-resolver-demo-maven-plugin/target/local-repo/org/apache/maven/resolver/maven-resolver-demos/1.4.0-SNAPSHOT/maven-resolver-demos-1.4.0-SNAPSHOT.pom
[INFO] Installing /home/jenkins/jenkins-slave/workspace/maven-box_maven-resolver_master/m/maven-resolver-demos/target/maven-resolver-demos-1.4.0-SNAPSHOT-site.xml
to /home/jenkins/jenkins-slave/workspace/maven-box_maven-resolver_master/m/maven-resolver-demos/maven-resolver-demo-maven-plugin/target/local-repo/org/apache/maven/resolver/maven-resolver-demos/1.4.0-SNAPSHOT/maven-resolver-demos-1.4.0-SNAPSHOT-site.xml
[INFO] Installing /home/jenkins/jenkins-slave/workspace/maven-box_maven-resolver_master/m/maven-resolver-demos/maven-resolver-demo-snippets/pom.xml
to /home/jenkins/jenkins-slave/workspace/maven-box_maven-resolver_master/m/maven-resolver-demos/maven-resolver-demo-maven-plugin/target/local-repo/org/apache/maven/resolver/maven-resolver-demo-snippets/1.4.0-SNAPSHOT/maven-resolver-demo-snippets-1.4.0-SNAPSHOT.pom
[INFO] Installing /home/jenkins/jenkins-slave/workspace/maven-box_maven-resolver_master/m/maven-resolver-demos/maven-resolver-demo-snippets/target/maven-resolver-demo-snippets-1.4.0-SNAPSHOT.jar
to /home/jenkins/jenkins-slave/workspace/maven-box_maven-resolver_master/m/maven-resolver-demos/maven-resolver-demo-maven-plugin/target/local-repo/org/apache/maven/resolver/maven-resolver-demo-snippets/1.4.0-SNAPSHOT/maven-resolver-demo-snippets-1.4.0-SNAPSHOT.jar
[INFO] Installing /home/jenkins/jenkins-slave/workspace/maven-box_maven-resolver_master/m/maven-resolver-demos/maven-resolver-demo-maven-plugin/pom.xml
to /home/jenkins/jenkins-slave/workspace/maven-box_maven-resolver_master/m/maven-resolver-demos/maven-resolver-demo-maven-plugin/target/local-repo/org/apache/maven/resolver/maven-resolver-demo-maven-plugin/1.4.0-SNAPSHOT/maven-resolver-demo-maven-plugin-1.4.0-SNAPSHOT.pom
[INFO] Installing /home/jenkins/jenkins-slave/workspace/maven-box_maven-resolver_master/m/maven-resolver-demos/maven-resolver-demo-maven-plugin/target/maven-resolver-demo-maven-plugin-1.4.0-SNAPSHOT.jar
to /home/jenkins/jenkins-slave/workspace/maven-box_maven-resolver_master/m/maven-resolver-demos/maven-resolver-demo-maven-plugin/target/local-repo/org/apache/maven/resolver/maven-resolver-demo-maven-plugin/1.4.0-SNAPSHOT/maven-resolver-demo-maven-plugin-1.4.0-SNAPSHOT.jar
[INFO] 
[INFO] --- maven-invoker-plugin:3.0.1:run (integration-test) @ maven-resolver-demo-maven-plugin
---
[INFO] Running Setup Jobs
[INFO] Building: resolve-artifact/pom.xml
[INFO]           resolve-artifact/pom.xml ......................... SUCCESS (3.5 s)
[INFO] -------------------------------------------------
[INFO] Build Summary:
[INFO]   Passed: 1, Failed: 0, Errors: 0, Skipped: 0
[INFO] -------------------------------------------------
[INFO] 
[INFO] --- maven-checkstyle-plugin:3.0.0:check (checkstyle-check) @ maven-resolver-demo-maven-plugin
---
[INFO] ------------------------------------------------------------------------
[INFO] Reactor Summary for Maven Artifact Resolver 1.4.0-SNAPSHOT:
[INFO] 
[INFO] Maven Artifact Resolver ............................ SUCCESS [ 36.336 s]
[INFO] Maven Artifact Resolver API ........................ SUCCESS [ 16.627 s]
[INFO] Maven Artifact Resolver SPI ........................ SUCCESS [  2.156 s]
[INFO] Maven Artifact Resolver Test Utilities ............. SUCCESS [  2.376 s]
[INFO] Maven Artifact Resolver Utilities .................. SUCCESS [  6.265 s]
[INFO] Maven Artifact Resolver Implementation ............. SUCCESS [  8.951 s]
[INFO] Maven Artifact Resolver Connector Basic ............ SUCCESS [  7.410 s]
[INFO] Maven Artifact Resolver Transport Classpath ........ SUCCESS [  1.843 s]
[INFO] Maven Artifact Resolver Transport File ............. SUCCESS [  1.775 s]
[INFO] Maven Artifact Resolver Transport HTTP ............. SUCCESS [  7.259 s]
[INFO] Maven Artifact Resolver Transport Wagon ............ SUCCESS [  3.962 s]
[INFO] Maven Artifact Resolver Demos ...................... SUCCESS [  0.323 s]
[INFO] Maven Artifact Resolver Demo Snippets .............. SUCCESS [  2.444 s]
[INFO] Maven Artifact Resolver Demo Maven Plugin .......... SUCCESS [  8.707 s]
[INFO] ------------------------------------------------------------------------
[INFO] BUILD SUCCESS
[INFO] ------------------------------------------------------------------------
[INFO] Total time:  01:48 min
[INFO] Finished at: 2019-06-03T20:46:22Z
[INFO] ------------------------------------------------------------------------
[INFO] [jenkins-event-spy] Generated /home/jenkins/jenkins-slave/workspace/maven-box_maven-resolver_master@tmp/withMaven343789e1/maven-spy-20190603-204434-26514329916819723578804.log
[Pipeline] }
[Pipeline] // dir
[Pipeline] }
[withMaven] invokerPublisher - Archive invoker results for Maven artifact MavenArtifact{org.apache.maven.resolver:maven-resolver-demo-maven-plugin:maven-plugin:1.4.0-SNAPSHOT(version:
1.4.0-SNAPSHOT, snapshot:false) } generated by PluginInvocation{org.apache.maven.plugins:maven-invoker-plugin:3.0.1@run
 integration-test}: m/maven-resolver-demos/maven-resolver-demo-maven-plugin/target/invoker-reports/*.xml
[withMaven] junitPublisher - Archive test results for Maven artifact org.apache.maven.resolver:maven-resolver-api:jar:1.4.0-SNAPSHOT
generated by maven-surefire-plugin:test (default-test): m/maven-resolver-api/target/surefire-reports/*.xml
[withMaven] junitPublisher - Archive test results for Maven artifact org.apache.maven.resolver:maven-resolver-spi:jar:1.4.0-SNAPSHOT
generated by maven-surefire-plugin:test (default-test): m/maven-resolver-spi/target/surefire-reports/*.xml
[withMaven] junitPublisher - Archive test results for Maven artifact org.apache.maven.resolver:maven-resolver-test-util:jar:1.4.0-SNAPSHOT
generated by maven-surefire-plugin:test (default-test): m/maven-resolver-test-util/target/surefire-reports/*.xml
[withMaven] junitPublisher - Archive test results for Maven artifact org.apache.maven.resolver:maven-resolver-util:jar:1.4.0-SNAPSHOT
generated by maven-surefire-plugin:test (default-test): m/maven-resolver-util/target/surefire-reports/*.xml
[withMaven] junitPublisher - Archive test results for Maven artifact org.apache.maven.resolver:maven-resolver-impl:jar:1.4.0-SNAPSHOT
generated by maven-surefire-plugin:test (default-test): m/maven-resolver-impl/target/surefire-reports/*.xml
[withMaven] junitPublisher - Archive test results for Maven artifact org.apache.maven.resolver:maven-resolver-connector-basic:jar:1.4.0-SNAPSHOT
generated by maven-surefire-plugin:test (default-test): m/maven-resolver-connector-basic/target/surefire-reports/*.xml
[withMaven] junitPublisher - Archive test results for Maven artifact org.apache.maven.resolver:maven-resolver-transport-classpath:jar:1.4.0-SNAPSHOT
generated by maven-surefire-plugin:test (default-test): m/maven-resolver-transport-classpath/target/surefire-reports/*.xml
[withMaven] junitPublisher - Archive test results for Maven artifact org.apache.maven.resolver:maven-resolver-transport-file:jar:1.4.0-SNAPSHOT
generated by maven-surefire-plugin:test (default-test): m/maven-resolver-transport-file/target/surefire-reports/*.xml
[withMaven] junitPublisher - Archive test results for Maven artifact org.apache.maven.resolver:maven-resolver-transport-http:jar:1.4.0-SNAPSHOT
generated by maven-surefire-plugin:test (default-test): m/maven-resolver-transport-http/target/surefire-reports/*.xml
[withMaven] junitPublisher - Archive test results for Maven artifact org.apache.maven.resolver:maven-resolver-transport-wagon:jar:1.4.0-SNAPSHOT
generated by maven-surefire-plugin:test (default-test): m/maven-resolver-transport-wagon/target/surefire-reports/*.xml
[withMaven] junitPublisher - Archive test results for Maven artifact org.apache.maven.resolver:maven-resolver-demo-snippets:jar:1.4.0-SNAPSHOT
generated by maven-surefire-plugin:test (default-test): m/maven-resolver-demos/maven-resolver-demo-snippets/target/surefire-reports/*.xml
[withMaven] junitPublisher - Archive test results for Maven artifact org.apache.maven.resolver:maven-resolver-demo-maven-plugin:maven-plugin:1.4.0-SNAPSHOT
generated by maven-surefire-plugin:test (default-test): m/maven-resolver-demos/maven-resolver-demo-maven-plugin/target/surefire-reports/*.xml
Recording test results
[withMaven] Publishers: Pipeline Graph Publisher: 12 ms, Invoker Publisher: 1173 ms, Junit
Publisher: 47283 ms, Dependencies Fingerprint Publisher: 8936 ms
[Pipeline] // withMaven
[Pipeline] cleanWs
[WS-CLEANUP] Deleting project workspace...
[WS-CLEANUP] Deferred wipeout is used...
[WS-CLEANUP] done
[Pipeline] }
[Pipeline] // stage
[Pipeline] }
[Pipeline] // node
[Pipeline] }
Aborted by rfscholte
Sending interrupt signal to process
Click here to forcibly terminate running steps
[INFO] 
[INFO] Results:
[INFO] 
[INFO] Tests run: 1, Failures: 0, Errors: 0, Skipped: 0
[INFO] 
[ERROR] There are test failures.

Please refer to /home/jenkins/jenkins-slave/workspace/maven-box_maven-resolver_master/m/maven-resolver-impl/target/surefire-reports
for the individual test results.
Please refer to dump files (if any exist) [date]-jvmRun[N].dump, [date].dumpstream and [date]-jvmRun[N].dumpstream.
The forked VM terminated without properly saying goodbye. VM crash or System.exit called?
Command was /bin/sh -c cd /home/jenkins/jenkins-slave/workspace/maven-box_maven-resolver_master/m/maven-resolver-impl
&& /usr/local/asfpackages/java/jdk1.7.0_80/jre/bin/java -Xmx128m -jar /home/jenkins/jenkins-slave/workspace/maven-box_maven-resolver_master/m/maven-resolver-impl/target/surefire/surefirebooter860389336436451719.jar
/home/jenkins/jenkins-slave/workspace/maven-box_maven-resolver_master/m/maven-resolver-impl/target/surefire
2019-06-03T20-37-28_361-jvmRun1 surefire3985028528607712324tmp surefire_47251329132333127218tmp
Error occurred in starting fork, check output in log
Process Exit Code: 143
Crashed tests:
org.eclipse.aether.internal.impl.collect.DefaultDependencyCollectorTest
org.apache.maven.surefire.booter.SurefireBooterForkException: The forked VM terminated without
properly saying goodbye. VM crash or System.exit called?
Command was /bin/sh -c cd /home/jenkins/jenkins-slave/workspace/maven-box_maven-resolver_master/m/maven-resolver-impl
&& /usr/local/asfpackages/java/jdk1.7.0_80/jre/bin/java -Xmx128m -jar /home/jenkins/jenkins-slave/workspace/maven-box_maven-resolver_master/m/maven-resolver-impl/target/surefire/surefirebooter860389336436451719.jar
/home/jenkins/jenkins-slave/workspace/maven-box_maven-resolver_master/m/maven-resolver-impl/target/surefire
2019-06-03T20-37-28_361-jvmRun1 surefire3985028528607712324tmp surefire_47251329132333127218tmp
Error occurred in starting fork, check output in log
Process Exit Code: 143
Crashed tests:
org.eclipse.aether.internal.impl.collect.DefaultDependencyCollectorTest
	at org.apache.maven.plugin.surefire.booterclient.ForkStarter.fork(ForkStarter.java:671)
	at org.apache.maven.plugin.surefire.booterclient.ForkStarter.fork(ForkStarter.java:533)
	at org.apache.maven.plugin.surefire.booterclient.ForkStarter.run(ForkStarter.java:278)
	at org.apache.maven.plugin.surefire.booterclient.ForkStarter.run(ForkStarter.java:244)
	at org.apache.maven.plugin.surefire.AbstractSurefireMojo.executeProvider(AbstractSurefireMojo.java:1194)
	at org.apache.maven.plugin.surefire.AbstractSurefireMojo.executeAfterPreconditionsChecked(AbstractSurefireMojo.java:1022)
	at org.apache.maven.plugin.surefire.AbstractSurefireMojo.execute(AbstractSurefireMojo.java:868)
	at org.apache.maven.plugin.DefaultBuildPluginManager.executeMojo(DefaultBuildPluginManager.java:137)
	at org.apache.maven.lifecycle.internal.MojoExecutor.execute(MojoExecutor.java:210)
	at org.apache.maven.lifecycle.internal.MojoExecutor.execute(MojoExecutor.java:156)
	at org.apache.maven.lifecycle.internal.MojoExecutor.execute(MojoExecutor.java:148)
	at org.apache.maven.lifecycle.internal.LifecycleModuleBuilder.buildProject(LifecycleModuleBuilder.java:117)
	at org.apache.maven.lifecycle.internal.LifecycleModuleBuilder.buildProject(LifecycleModuleBuilder.java:81)
	at org.apache.maven.lifecycle.internal.builder.singlethreaded.SingleThreadedBuilder.build(SingleThreadedBuilder.java:56)
	at org.apache.maven.lifecycle.internal.LifecycleStarter.execute(LifecycleStarter.java:128)
	at org.apache.maven.DefaultMaven.doExecute(DefaultMaven.java:305)
	at org.apache.maven.DefaultMaven.doExecute(DefaultMaven.java:192)
	at org.apache.maven.DefaultMaven.execute(DefaultMaven.java:105)
	at org.apache.maven.cli.MavenCli.execute(MavenCli.java:956)
	at org.apache.maven.cli.MavenCli.doMain(MavenCli.java:288)
	at org.apache.maven.cli.MavenCli.main(MavenCli.java:192)
	at sun.reflect.NativeMethodAccessorImpl.invoke0(Native Method)
	at sun.reflect.NativeMethodAccessorImpl.invoke(NativeMethodAccessorImpl.java:57)
	at sun.reflect.DelegatingMethodAccessorImpl.invoke(DelegatingMethodAccessorImpl.java:43)
	at java.lang.reflect.Method.invoke(Method.java:606)
	at org.codehaus.plexus.classworlds.launcher.Launcher.launchEnhanced(Launcher.java:289)
	at org.codehaus.plexus.classworlds.launcher.Launcher.launch(Launcher.java:229)
	at org.codehaus.plexus.classworlds.launcher.Launcher.mainWithExitCode(Launcher.java:415)
	at org.codehaus.plexus.classworlds.launcher.Launcher.main(Launcher.java:356)

[INFO] 
[INFO] --- maven-jar-plugin:3.1.0:jar (default-jar) @ maven-resolver-impl ---
[INFO] Building jar: /home/jenkins/jenkins-slave/workspace/maven-box_maven-resolver_master/m/maven-resolver-impl/target/maven-resolver-impl-1.4.0-SNAPSHOT.jar
[INFO] 
[INFO] --- maven-site-plugin:3.7.1:attach-descriptor (attach-descriptor) @ maven-resolver-impl
---
[INFO] Skipping because packaging 'jar' is not pom.
[INFO] 
[INFO] --- maven-checkstyle-plugin:3.0.0:check (checkstyle-check) @ maven-resolver-impl ---
script returned exit code 143
[Pipeline] }
[Pipeline] // dir
[Pipeline] }
[withMaven] One or multiple Maven executions have been ignored by the Jenkins Pipeline Maven
Plugin because they have been interrupted before completion (1). See Pipeline Maven Plugin
FAQ for more details.
[Pipeline] // withMaven
[Pipeline] echo
[FAILURE-004] org.jenkinsci.plugins.workflow.steps.FlowInterruptedException
[Pipeline] cleanWs
[WS-CLEANUP] Deleting project workspace...
[WS-CLEANUP] Deferred wipeout is used...
[WS-CLEANUP] done
[Pipeline] cleanWs
[WS-CLEANUP] Deleting project workspace...
[WS-CLEANUP] Deferred wipeout is used...
[WS-CLEANUP] done
[Pipeline] }
[Pipeline] // stage
[Pipeline] }
[Pipeline] // node
[Pipeline] }
Failed in branch linux-jdk7
[Pipeline] // parallel
[Pipeline] echo
[FAILURE-002] FlowInterruptedException org.jenkinsci.plugins.workflow.steps.FlowInterruptedException
[Pipeline] stage
[Pipeline] { (Notifications)
[Pipeline] echo
Build result: FAILURE
[Pipeline] jiraIssueSelector
[Pipeline] emailext
Mime
  • Unnamed multipart/mixed (inline, None, 0 bytes)
View raw message