maven-notifications mailing list archives

Site index · List index
Message view « Date » · « Thread »
Top « Date » · « Thread »
From Apache Jenkins Server <jenk...@builds.apache.org>
Subject Build failed in Jenkins: Maven TLP » maven-dependency-plugin » MDEP-617 #5
Date Tue, 04 Jun 2019 11:15:16 GMT
See https://builds.apache.org/job/maven-box/job/maven-dependency-plugin/job/MDEP-617/5/

Changes:

* [MNG-6573] Use Maven 3.6.0 as default
* H39 has weird issues, exclude it for now
* Fix no access to currentBuild.rawBuild
* fixed typo
* Include more recent JDKs

All tests passed

Build log:
[...truncated 14965 lines...]
[INFO] Building: resolve-plugins\pom.xml
[INFO]           resolve-plugins\pom.xml .......................... SUCCESS (7.6 s)
[INFO] Building: resolve-plugins-exclude-reactor\pom.xml
[INFO] run post-build script verify.groovy
[INFO]           resolve-plugins-exclude-reactor\pom.xml .......... SUCCESS (9.5 s)
[INFO] Building: resolve-plugins-with-exclude\pom.xml
[INFO] run post-build script verify.groovy
[INFO]           resolve-plugins-with-exclude\pom.xml ............. SUCCESS (7.1 s)
[INFO] Building: sources\pom.xml
[INFO]           sources\pom.xml .................................. SUCCESS (7.0 s)
[INFO] Building: tree\pom.xml
[INFO]           tree\pom.xml ..................................... SKIPPED due to Maven version
[INFO] Building: tree-includes\pom.xml
[INFO] run post-build script verify.bsh
[INFO]           tree-includes\pom.xml ............................ SUCCESS (6.6 s)
[INFO] Building: tree-multimodule\pom.xml
[INFO] run post-build script verify.bsh
[INFO]           tree-multimodule\pom.xml ......................... SUCCESS (7.2 s)
[INFO] Building: unpack\pom.xml
[INFO] run post-build script verify.bsh
[INFO]           unpack\pom.xml ................................... SUCCESS (9.3 s)
[INFO] Building: unpack-cli\pom.xml
[INFO] run post-build script verify.bsh
[INFO]           unpack-cli\pom.xml ............................... SUCCESS (6.9 s)
[INFO] Building: unpack-custom-ear\pom.xml
[INFO] run post-build script verify.groovy
[INFO]           unpack-custom-ear\pom.xml ........................ SUCCESS (7.1 s)
[INFO] Building: unpack-dependencies\pom.xml
[INFO] run post-build script verify.groovy
[INFO]           unpack-dependencies\pom.xml ...................... SUCCESS (11.3 s)
[INFO] Building: unpack-from-remote-repository\pom.xml
[INFO] run pre-build script setup.bsh
[INFO] run post-build script verify.bsh
[INFO]           unpack-from-remote-repository\pom.xml ............ SUCCESS (7.5 s)
[INFO] Building: used-dependencies\pom.xml
[INFO]           used-dependencies\pom.xml ........................ SUCCESS (8.6 s)
[INFO] Building: purge-local-repository-without-pom
[INFO] run pre-build script setup.bsh
[INFO] run post-build script verify.bsh
[INFO]           purge-local-repository-without-pom ............... SUCCESS (5.3 s)
[INFO] 
[INFO] --- mrm-maven-plugin:1.0.0:stop (default) @ maven-dependency-plugin ---
[INFO] Stopping Mock Repository Manager on http://localhost:56596
[INFO] Mock Repository Manager http://localhost:56596 is stopped.
[INFO] 
[INFO] --- maven-checkstyle-plugin:3.0.0:check (checkstyle-check) @ maven-dependency-plugin
---
[INFO] There is 1 error reported by Checkstyle 6.18 with config/maven_checks.xml ruleset.
[INFO] Ignored 1 error, 0 violation remaining.
[INFO] 
[INFO] --- maven-invoker-plugin:3.1.0:verify (integration-test) @ maven-dependency-plugin
---
[INFO] -------------------------------------------------
[INFO] Build Summary:
[INFO]   Passed: 56, Failed: 1, Errors: 0, Skipped: 1
[INFO] -------------------------------------------------
[ERROR] The following builds failed:
[ERROR] *  mdep-580_display-manifest-automodules\pom.xml
[INFO] -------------------------------------------------
[INFO] ------------------------------------------------------------------------
[INFO] BUILD FAILURE
[INFO] ------------------------------------------------------------------------
[INFO] Total time:  09:28 min
[INFO] Finished at: 2019-06-04T04:03:45-07:00
[INFO] ------------------------------------------------------------------------
[INFO] [jenkins-event-spy] Generated F:\jenkins\jenkins-slave\workspace\maven-dependency-plugin_MDEP-617@2@tmp\withMaven46de61e5\maven-spy-20190604-035415-98810213490775839763311.log
[ERROR] Failed to execute goal org.apache.maven.plugins:maven-invoker-plugin:3.1.0:verify
(integration-test) on project maven-dependency-plugin: 1 build failed. See console output
above for details. -> [Help 1]
org.apache.maven.lifecycle.LifecycleExecutionException: Failed to execute goal org.apache.maven.plugins:maven-invoker-plugin:3.1.0:verify
(integration-test) on project maven-dependency-plugin: 1 build failed. See console output
above for details.
    at org.apache.maven.lifecycle.internal.MojoExecutor.execute (MojoExecutor.java:215)
    at org.apache.maven.lifecycle.internal.MojoExecutor.execute (MojoExecutor.java:156)
    at org.apache.maven.lifecycle.internal.MojoExecutor.execute (MojoExecutor.java:148)
    at org.apache.maven.lifecycle.internal.LifecycleModuleBuilder.buildProject (LifecycleModuleBuilder.java:117)
    at org.apache.maven.lifecycle.internal.LifecycleModuleBuilder.buildProject (LifecycleModuleBuilder.java:81)
    at org.apache.maven.lifecycle.internal.builder.singlethreaded.SingleThreadedBuilder.build
(SingleThreadedBuilder.java:56)
    at org.apache.maven.lifecycle.internal.LifecycleStarter.execute (LifecycleStarter.java:128)
    at org.apache.maven.DefaultMaven.doExecute (DefaultMaven.java:305)
    at org.apache.maven.DefaultMaven.doExecute (DefaultMaven.java:192)
    at org.apache.maven.DefaultMaven.execute (DefaultMaven.java:105)
    at org.apache.maven.cli.MavenCli.execute (MavenCli.java:956)
    at org.apache.maven.cli.MavenCli.doMain (MavenCli.java:288)
    at org.apache.maven.cli.MavenCli.main (MavenCli.java:192)
    at jdk.internal.reflect.NativeMethodAccessorImpl.invoke0 (Native Method)
    at jdk.internal.reflect.NativeMethodAccessorImpl.invoke (NativeMethodAccessorImpl.java:62)
    at jdk.internal.reflect.DelegatingMethodAccessorImpl.invoke (DelegatingMethodAccessorImpl.java:43)
    at java.lang.reflect.Method.invoke (Method.java:567)
    at org.codehaus.plexus.classworlds.launcher.Launcher.launchEnhanced (Launcher.java:289)
    at org.codehaus.plexus.classworlds.launcher.Launcher.launch (Launcher.java:229)
    at org.codehaus.plexus.classworlds.launcher.Launcher.mainWithExitCode (Launcher.java:415)
    at org.codehaus.plexus.classworlds.launcher.Launcher.main (Launcher.java:356)
Caused by: org.apache.maven.plugin.MojoFailureException: 1 build failed. See console output
above for details.
    at org.apache.maven.plugins.invoker.InvokerSession.handleFailures (InvokerSession.java:260)
    at org.apache.maven.plugins.invoker.VerifyMojo.execute (VerifyMojo.java:137)
    at org.apache.maven.plugin.DefaultBuildPluginManager.executeMojo (DefaultBuildPluginManager.java:137)
    at org.apache.maven.lifecycle.internal.MojoExecutor.execute (MojoExecutor.java:210)
    at org.apache.maven.lifecycle.internal.MojoExecutor.execute (MojoExecutor.java:156)
    at org.apache.maven.lifecycle.internal.MojoExecutor.execute (MojoExecutor.java:148)
    at org.apache.maven.lifecycle.internal.LifecycleModuleBuilder.buildProject (LifecycleModuleBuilder.java:117)
    at org.apache.maven.lifecycle.internal.LifecycleModuleBuilder.buildProject (LifecycleModuleBuilder.java:81)
    at org.apache.maven.lifecycle.internal.builder.singlethreaded.SingleThreadedBuilder.build
(SingleThreadedBuilder.java:56)
    at org.apache.maven.lifecycle.internal.LifecycleStarter.execute (LifecycleStarter.java:128)
    at org.apache.maven.DefaultMaven.doExecute (DefaultMaven.java:305)
    at org.apache.maven.DefaultMaven.doExecute (DefaultMaven.java:192)
    at org.apache.maven.DefaultMaven.execute (DefaultMaven.java:105)
    at org.apache.maven.cli.MavenCli.execute (MavenCli.java:956)
    at org.apache.maven.cli.MavenCli.doMain (MavenCli.java:288)
    at org.apache.maven.cli.MavenCli.main (MavenCli.java:192)
    at jdk.internal.reflect.NativeMethodAccessorImpl.invoke0 (Native Method)
    at jdk.internal.reflect.NativeMethodAccessorImpl.invoke (NativeMethodAccessorImpl.java:62)
    at jdk.internal.reflect.DelegatingMethodAccessorImpl.invoke (DelegatingMethodAccessorImpl.java:43)
    at java.lang.reflect.Method.invoke (Method.java:567)
    at org.codehaus.plexus.classworlds.launcher.Launcher.launchEnhanced (Launcher.java:289)
    at org.codehaus.plexus.classworlds.launcher.Launcher.launch (Launcher.java:229)
    at org.codehaus.plexus.classworlds.launcher.Launcher.mainWithExitCode (Launcher.java:415)
    at org.codehaus.plexus.classworlds.launcher.Launcher.main (Launcher.java:356)
[ERROR] 
[ERROR] Re-run Maven using the -X switch to enable full debug logging.
[ERROR] 
[ERROR] For more information about the errors and possible solutions, please read the following
articles:
[ERROR] [Help 1] http://cwiki.apache.org/confluence/display/MAVEN/MojoFailureException
[Pipeline] }
[Pipeline] // dir
[Pipeline] }
[Fast Archiver] No prior successful build to compare, so performing full copy of artifacts
[withMaven] junitPublisher - Archive test results for Maven artifact org.apache.maven.plugins:maven-dependency-plugin:maven-plugin:3.1.2-SNAPSHOT
generated by maven-surefire-plugin:test (default-test): windows-jdk13-m3.6.x_build\target\surefire-reports\*.xml
Recording test results
[withMaven] openTasksPublisher - Scan Tasks for Maven artifact org.apache.maven.plugins:maven-dependency-plugin:maven-plugin:3.1.2-SNAPSHOT
in source directory windows-jdk13-m3.6.x_build\src\main\java
[TASKS] Scanning folder 'f:\jenkins\jenkins-slave\workspace\maven-dependency-plugin_MDEP-617@2'
for files matching the pattern 'windows-jdk13-m3.6.x_build\src\main\java\**\*' - excludes:
null
[TASKS] Found 48 files to scan for tasks
[TASKS] Found 4 open tasks.
Skipping warnings blame since pipelines do not have an SCM link.%n
[withMaven] invokerPublisher - Archive invoker results for Maven artifact MavenArtifact{org.apache.maven.plugins:maven-dependency-plugin:maven-plugin:3.1.2-SNAPSHOT(version:
3.1.2-SNAPSHOT, snapshot:false) } generated by PluginInvocation{org.apache.maven.plugins:maven-invoker-plugin:3.1.0@integration-test
 integration-test}: windows-jdk13-m3.6.x_build\target\invoker-reports\*.xml
[withMaven] Publishers: Generated Artifacts Publisher: 24 ms, Junit Publisher: 1419 ms, Open
Task Scanner Publisher: 147 ms, Invoker Publisher: 18237 ms
[Pipeline] // withMaven
[Pipeline] cleanWs
[WS-CLEANUP] Deleting project workspace...
[WS-CLEANUP] Deferred wipeout is used...
[WS-CLEANUP] done
[Pipeline] cleanWs
[WS-CLEANUP] Deleting project workspace...
[WS-CLEANUP] Deferred wipeout is used...
[WS-CLEANUP] done
[Pipeline] }
[Pipeline] // stage
[Pipeline] }
[Pipeline] // ws
[Pipeline] }
[Pipeline] // node
[Pipeline] }
Failed in branch windows-jdk13-m3.6.x_build
[INFO] run post-build script verify.bsh
[INFO]           purge-local-repository-version-range\pom.xml ..... SUCCESS (909.6 s)
[INFO] Building: resolve\pom.xml
[INFO]           resolve\pom.xml .................................. SUCCESS (8.3 s)
[INFO] Building: resolve-plugins\pom.xml
[INFO]           resolve-plugins\pom.xml .......................... SUCCESS (9.3 s)
[INFO] Building: resolve-plugins-exclude-reactor\pom.xml
[INFO] run post-build script verify.groovy
[INFO]           resolve-plugins-exclude-reactor\pom.xml .......... SUCCESS (11.6 s)
[INFO] Building: resolve-plugins-with-exclude\pom.xml
[INFO] run post-build script verify.groovy
[INFO]           resolve-plugins-with-exclude\pom.xml ............. SUCCESS (9.8 s)
[INFO] Building: sources\pom.xml
[INFO]           sources\pom.xml .................................. SUCCESS (8.8 s)
[INFO] Building: tree\pom.xml
[INFO]           tree\pom.xml ..................................... SKIPPED due to Maven version
[INFO] Building: tree-includes\pom.xml
[INFO] run post-build script verify.bsh
[INFO]           tree-includes\pom.xml ............................ SUCCESS (8.5 s)
[INFO] Building: tree-multimodule\pom.xml
[INFO] run post-build script verify.bsh
[INFO]           tree-multimodule\pom.xml ......................... SUCCESS (9.3 s)
[INFO] Building: unpack\pom.xml
[INFO] run post-build script verify.bsh
[INFO]           unpack\pom.xml ................................... SUCCESS (10.2 s)
[INFO] Building: unpack-cli\pom.xml
[INFO] run post-build script verify.bsh
[INFO]           unpack-cli\pom.xml ............................... SUCCESS (8.4 s)
[INFO] Building: unpack-custom-ear\pom.xml
[INFO] run post-build script verify.groovy
[INFO]           unpack-custom-ear\pom.xml ........................ SUCCESS (9.6 s)
[INFO] Building: unpack-dependencies\pom.xml
[INFO] run post-build script verify.groovy
[INFO]           unpack-dependencies\pom.xml ...................... SUCCESS (10.1 s)
[INFO] Building: unpack-from-remote-repository\pom.xml
[INFO] run pre-build script setup.bsh
[INFO] run post-build script verify.bsh
[INFO]           unpack-from-remote-repository\pom.xml ............ SUCCESS (9.7 s)
[INFO] Building: used-dependencies\pom.xml
[INFO]           used-dependencies\pom.xml ........................ SUCCESS (9.5 s)
[INFO] Building: purge-local-repository-without-pom
[INFO] run pre-build script setup.bsh
[INFO] run post-build script verify.bsh
[INFO]           purge-local-repository-without-pom ............... SUCCESS (7.6 s)
[INFO] 
[INFO] --- mrm-maven-plugin:1.0.0:stop (default) @ maven-dependency-plugin ---
[INFO] Stopping Mock Repository Manager on http://localhost:54512
[INFO] Mock Repository Manager http://localhost:54512 is stopped.
[INFO] 
[INFO] --- maven-checkstyle-plugin:3.0.0:check (checkstyle-check) @ maven-dependency-plugin
---
[INFO] There is 1 error reported by Checkstyle 6.18 with config/maven_checks.xml ruleset.
[INFO] Ignored 1 error, 0 violation remaining.
[INFO] 
[INFO] --- maven-invoker-plugin:3.1.0:verify (integration-test) @ maven-dependency-plugin
---
[INFO] -------------------------------------------------
[INFO] Build Summary:
[INFO]   Passed: 52, Failed: 0, Errors: 0, Skipped: 6
[INFO] -------------------------------------------------
[INFO] ------------------------------------------------------------------------
[INFO] BUILD SUCCESS
[INFO] ------------------------------------------------------------------------
[INFO] Total time: 25:35 min
[INFO] Finished at: 2019-06-04T11:14:53Z
[INFO] Final Memory: 66M/1103M
[INFO] ------------------------------------------------------------------------
[INFO] [jenkins-event-spy] Generated F:\jenkins\jenkins-slave\workspace\maven-dependency-plugin_MDEP-617@2@tmp\withMaven8386e57a\maven-spy-20190604-104917-1785540315024426779700.log
Picked up JAVA_TOOL_OPTIONS: -Dmaven.ext.class.path="f:\jenkins\jenkins-slave\workspace\maven-dependency-plugin_MDEP-617@2@tmp\withMaven8386e57a\pipeline-maven-spy.jar"
-Dorg.jenkinsci.plugins.pipeline.maven.reportsFolder="f:\jenkins\jenkins-slave\workspace\maven-dependency-plugin_MDEP-617@2@tmp\withMaven8386e57a"

[Pipeline] }
[Pipeline] // dir
[Pipeline] }
[withMaven] artifactsPublisher - Archive artifact windows-jdk7-m3.5.x_build\pom.xml under
org\apache\maven\plugins\maven-dependency-plugin\3.1.2-SNAPSHOT\maven-dependency-plugin-3.1.2-SNAPSHOT.pom
[withMaven] artifactsPublisher - Archive artifact windows-jdk7-m3.5.x_build\target\maven-dependency-plugin-3.1.2-SNAPSHOT.jar
under org\apache\maven\plugins\maven-dependency-plugin\3.1.2-SNAPSHOT\maven-dependency-plugin-3.1.2-SNAPSHOT.jar
[Fast Archiver] No prior successful build to compare, so performing full copy of artifacts
[withMaven] junitPublisher - Archive test results for Maven artifact org.apache.maven.plugins:maven-dependency-plugin:maven-plugin:3.1.2-SNAPSHOT
generated by maven-surefire-plugin:test (default-test): windows-jdk7-m3.5.x_build\target\surefire-reports\*.xml
Recording test results
[withMaven] openTasksPublisher - Scan Tasks for Maven artifact org.apache.maven.plugins:maven-dependency-plugin:maven-plugin:3.1.2-SNAPSHOT
in source directory windows-jdk7-m3.5.x_build\src\main\java
[TASKS] Scanning folder 'f:\jenkins\jenkins-slave\workspace\maven-dependency-plugin_MDEP-617@2'
for files matching the pattern 'windows-jdk7-m3.5.x_build\src\main\java\**\*' - excludes:
null
[TASKS] Found 48 files to scan for tasks
[TASKS] Found 4 open tasks.
Skipping warnings blame since pipelines do not have an SCM link.%n
[withMaven] invokerPublisher - Archive invoker results for Maven artifact MavenArtifact{org.apache.maven.plugins:maven-dependency-plugin:maven-plugin:3.1.2-SNAPSHOT(version:
3.1.2-SNAPSHOT, snapshot:false) } generated by PluginInvocation{org.apache.maven.plugins:maven-invoker-plugin:3.1.0@integration-test
 integration-test}: windows-jdk7-m3.5.x_build\target\invoker-reports\*.xml
[withMaven] Publishers: Generated Artifacts Publisher: 187 ms, Junit Publisher: 1506 ms, Open
Task Scanner Publisher: 147 ms, Dependencies Fingerprint Publisher: 8 ms, Invoker Publisher:
15401 ms, Pipeline Graph Publisher: 1 ms
[Pipeline] // withMaven
[Pipeline] cleanWs
[WS-CLEANUP] Deleting project workspace...
[WS-CLEANUP] Deferred wipeout is used...
[WS-CLEANUP] done
[Pipeline] }
[Pipeline] // stage
[Pipeline] }
[Pipeline] // ws
[Pipeline] }
[Pipeline] // node
[Pipeline] }
[Pipeline] // parallel
[Pipeline] stage
[Pipeline] { (Notifications)
[Pipeline] echo
Build result: FAILURE
[Pipeline] jiraIssueSelector
[Pipeline] jiraComment
[Pipeline] emailext
Mime
  • Unnamed multipart/mixed (inline, None, 0 bytes)
View raw message