maven-notifications mailing list archives

Site index · List index
Message view « Date » · « Thread »
Top « Date » · « Thread »
From Apache Jenkins Server <jenk...@builds.apache.org>
Subject Build failed in Jenkins: Maven TLP » maven-dependency-analyzer » MSHARED-674_Detect_Java_8_type_annotations #5
Date Sun, 02 Jun 2019 19:17:37 GMT
See https://builds.apache.org/job/maven-box/job/maven-dependency-analyzer/job/MSHARED-674_Detect_Java_8_type_annotations/5/

Changes:

* [MNG-6573] Use Maven 3.6.0 as default
* H39 has weird issues, exclude it for now
* Fix no access to currentBuild.rawBuild
* fixed typo
* Include more recent JDKs

34 tests failed.
FAILED:  org.apache.maven.shared.dependency.analyzer.DefaultProjectDependencyAnalyzerTest.linux-jdk7 / Build linux-jdk7 / testJarWithXmlTransitiveDependency

Error Message:
Error compiling test project expected:<0> but was:<1>

Stack Trace:
junit.framework.AssertionFailedError: Error compiling test project expected:<0> but was:<1>
	at junit.framework.Assert.fail(Assert.java:57)
	at junit.framework.Assert.failNotEquals(Assert.java:329)
	at junit.framework.Assert.assertEquals(Assert.java:78)
	at junit.framework.Assert.assertEquals(Assert.java:234)
	at junit.framework.TestCase.assertEquals(TestCase.java:401)
	at org.apache.maven.shared.dependency.analyzer.DefaultProjectDependencyAnalyzerTest.compileProject(DefaultProjectDependencyAnalyzerTest.java:358)
	at org.apache.maven.shared.dependency.analyzer.DefaultProjectDependencyAnalyzerTest.compileProject(DefaultProjectDependencyAnalyzerTest.java:337)
	at org.apache.maven.shared.dependency.analyzer.DefaultProjectDependencyAnalyzerTest.testJarWithXmlTransitiveDependency(DefaultProjectDependencyAnalyzerTest.java:262)


FAILED:  org.apache.maven.shared.dependency.analyzer.DefaultProjectDependencyAnalyzerTest.linux-jdk7 / Build linux-jdk7 / testJarWithNoDependencies

Error Message:
Error compiling test project expected:<0> but was:<1>

Stack Trace:
junit.framework.AssertionFailedError: Error compiling test project expected:<0> but was:<1>
	at junit.framework.Assert.fail(Assert.java:57)
	at junit.framework.Assert.failNotEquals(Assert.java:329)
	at junit.framework.Assert.assertEquals(Assert.java:78)
	at junit.framework.Assert.assertEquals(Assert.java:234)
	at junit.framework.TestCase.assertEquals(TestCase.java:401)
	at org.apache.maven.shared.dependency.analyzer.DefaultProjectDependencyAnalyzerTest.compileProject(DefaultProjectDependencyAnalyzerTest.java:358)
	at org.apache.maven.shared.dependency.analyzer.DefaultProjectDependencyAnalyzerTest.compileProject(DefaultProjectDependencyAnalyzerTest.java:337)
	at org.apache.maven.shared.dependency.analyzer.DefaultProjectDependencyAnalyzerTest.testJarWithNoDependencies(DefaultProjectDependencyAnalyzerTest.java:111)


FAILED:  org.apache.maven.shared.dependency.analyzer.DefaultProjectDependencyAnalyzerTest.linux-jdk7 / Build linux-jdk7 / testPom

Error Message:
Error compiling test project expected:<0> but was:<1>

Stack Trace:
junit.framework.AssertionFailedError: Error compiling test project expected:<0> but was:<1>
	at junit.framework.Assert.fail(Assert.java:57)
	at junit.framework.Assert.failNotEquals(Assert.java:329)
	at junit.framework.Assert.assertEquals(Assert.java:78)
	at junit.framework.Assert.assertEquals(Assert.java:234)
	at junit.framework.TestCase.assertEquals(TestCase.java:401)
	at org.apache.maven.shared.dependency.analyzer.DefaultProjectDependencyAnalyzerTest.compileProject(DefaultProjectDependencyAnalyzerTest.java:358)
	at org.apache.maven.shared.dependency.analyzer.DefaultProjectDependencyAnalyzerTest.compileProject(DefaultProjectDependencyAnalyzerTest.java:337)
	at org.apache.maven.shared.dependency.analyzer.DefaultProjectDependencyAnalyzerTest.testPom(DefaultProjectDependencyAnalyzerTest.java:97)


FAILED:  org.apache.maven.shared.dependency.analyzer.DefaultProjectDependencyAnalyzerTest.linux-jdk7 / Build linux-jdk7 / testForceDeclaredDependenciesUsage

Error Message:
Error compiling test project expected:<0> but was:<1>

Stack Trace:
junit.framework.AssertionFailedError: Error compiling test project expected:<0> but was:<1>
	at junit.framework.Assert.fail(Assert.java:57)
	at junit.framework.Assert.failNotEquals(Assert.java:329)
	at junit.framework.Assert.assertEquals(Assert.java:78)
	at junit.framework.Assert.assertEquals(Assert.java:234)
	at junit.framework.TestCase.assertEquals(TestCase.java:401)
	at org.apache.maven.shared.dependency.analyzer.DefaultProjectDependencyAnalyzerTest.compileProject(DefaultProjectDependencyAnalyzerTest.java:358)
	at org.apache.maven.shared.dependency.analyzer.DefaultProjectDependencyAnalyzerTest.compileProject(DefaultProjectDependencyAnalyzerTest.java:337)
	at org.apache.maven.shared.dependency.analyzer.DefaultProjectDependencyAnalyzerTest.testForceDeclaredDependenciesUsage(DefaultProjectDependencyAnalyzerTest.java:198)


FAILED:  org.apache.maven.shared.dependency.analyzer.DefaultProjectDependencyAnalyzerTest.linux-jdk7 / Build linux-jdk7 / testJarWithTestDependency

Error Message:
Error compiling test project expected:<0> but was:<1>

Stack Trace:
junit.framework.AssertionFailedError: Error compiling test project expected:<0> but was:<1>
	at junit.framework.Assert.fail(Assert.java:57)
	at junit.framework.Assert.failNotEquals(Assert.java:329)
	at junit.framework.Assert.assertEquals(Assert.java:78)
	at junit.framework.Assert.assertEquals(Assert.java:234)
	at junit.framework.TestCase.assertEquals(TestCase.java:401)
	at org.apache.maven.shared.dependency.analyzer.DefaultProjectDependencyAnalyzerTest.compileProject(DefaultProjectDependencyAnalyzerTest.java:358)
	at org.apache.maven.shared.dependency.analyzer.DefaultProjectDependencyAnalyzerTest.compileProject(DefaultProjectDependencyAnalyzerTest.java:337)
	at org.apache.maven.shared.dependency.analyzer.DefaultProjectDependencyAnalyzerTest.testJarWithTestDependency(DefaultProjectDependencyAnalyzerTest.java:232)


FAILED:  org.apache.maven.shared.dependency.analyzer.DefaultProjectDependencyAnalyzerTest.linux-jdk7 / Build linux-jdk7 / testJarWithCompileDependency

Error Message:
Error compiling test project expected:<0> but was:<1>

Stack Trace:
junit.framework.AssertionFailedError: Error compiling test project expected:<0> but was:<1>
	at junit.framework.Assert.fail(Assert.java:57)
	at junit.framework.Assert.failNotEquals(Assert.java:329)
	at junit.framework.Assert.assertEquals(Assert.java:78)
	at junit.framework.Assert.assertEquals(Assert.java:234)
	at junit.framework.TestCase.assertEquals(TestCase.java:401)
	at org.apache.maven.shared.dependency.analyzer.DefaultProjectDependencyAnalyzerTest.compileProject(DefaultProjectDependencyAnalyzerTest.java:358)
	at org.apache.maven.shared.dependency.analyzer.DefaultProjectDependencyAnalyzerTest.compileProject(DefaultProjectDependencyAnalyzerTest.java:337)
	at org.apache.maven.shared.dependency.analyzer.DefaultProjectDependencyAnalyzerTest.testJarWithCompileDependency(DefaultProjectDependencyAnalyzerTest.java:174)


FAILED:  org.apache.maven.shared.dependency.analyzer.DefaultProjectDependencyAnalyzerTest.linux-jdk7 / Build linux-jdk7 / testMultimoduleProject

Error Message:
Error compiling test project expected:<0> but was:<1>

Stack Trace:
junit.framework.AssertionFailedError: Error compiling test project expected:<0> but was:<1>
	at junit.framework.Assert.fail(Assert.java:57)
	at junit.framework.Assert.failNotEquals(Assert.java:329)
	at junit.framework.Assert.assertEquals(Assert.java:78)
	at junit.framework.Assert.assertEquals(Assert.java:234)
	at junit.framework.TestCase.assertEquals(TestCase.java:401)
	at org.apache.maven.shared.dependency.analyzer.DefaultProjectDependencyAnalyzerTest.compileProject(DefaultProjectDependencyAnalyzerTest.java:358)
	at org.apache.maven.shared.dependency.analyzer.DefaultProjectDependencyAnalyzerTest.compileProject(DefaultProjectDependencyAnalyzerTest.java:337)
	at org.apache.maven.shared.dependency.analyzer.DefaultProjectDependencyAnalyzerTest.testMultimoduleProject(DefaultProjectDependencyAnalyzerTest.java:280)


FAILED:  org.apache.maven.shared.dependency.analyzer.DefaultProjectDependencyAnalyzerTest.linux-jdk11 / Build linux-jdk11 / testJarWithXmlTransitiveDependency

Error Message:
null

Stack Trace:
java.lang.NullPointerException: null
	at org.apache.commons.lang3.SystemUtils.isJavaVersionAtLeast(SystemUtils.java:1626)
	at org.apache.maven.shared.dependency.analyzer.DefaultProjectDependencyAnalyzerTest.compileProject(DefaultProjectDependencyAnalyzerTest.java:342)
	at org.apache.maven.shared.dependency.analyzer.DefaultProjectDependencyAnalyzerTest.compileProject(DefaultProjectDependencyAnalyzerTest.java:337)
	at org.apache.maven.shared.dependency.analyzer.DefaultProjectDependencyAnalyzerTest.testJarWithXmlTransitiveDependency(DefaultProjectDependencyAnalyzerTest.java:262)


FAILED:  org.apache.maven.shared.dependency.analyzer.DefaultProjectDependencyAnalyzerTest.linux-jdk11 / Build linux-jdk11 / testJarWithNoDependencies

Error Message:
null

Stack Trace:
java.lang.NullPointerException: null
	at org.apache.commons.lang3.SystemUtils.isJavaVersionAtLeast(SystemUtils.java:1626)
	at org.apache.maven.shared.dependency.analyzer.DefaultProjectDependencyAnalyzerTest.compileProject(DefaultProjectDependencyAnalyzerTest.java:342)
	at org.apache.maven.shared.dependency.analyzer.DefaultProjectDependencyAnalyzerTest.compileProject(DefaultProjectDependencyAnalyzerTest.java:337)
	at org.apache.maven.shared.dependency.analyzer.DefaultProjectDependencyAnalyzerTest.testJarWithNoDependencies(DefaultProjectDependencyAnalyzerTest.java:111)


FAILED:  org.apache.maven.shared.dependency.analyzer.DefaultProjectDependencyAnalyzerTest.linux-jdk11 / Build linux-jdk11 / testPom

Error Message:
null

Stack Trace:
java.lang.NullPointerException: null
	at org.apache.commons.lang3.SystemUtils.isJavaVersionAtLeast(SystemUtils.java:1626)
	at org.apache.maven.shared.dependency.analyzer.DefaultProjectDependencyAnalyzerTest.compileProject(DefaultProjectDependencyAnalyzerTest.java:342)
	at org.apache.maven.shared.dependency.analyzer.DefaultProjectDependencyAnalyzerTest.compileProject(DefaultProjectDependencyAnalyzerTest.java:337)
	at org.apache.maven.shared.dependency.analyzer.DefaultProjectDependencyAnalyzerTest.testPom(DefaultProjectDependencyAnalyzerTest.java:97)


FAILED:  org.apache.maven.shared.dependency.analyzer.DefaultProjectDependencyAnalyzerTest.linux-jdk11 / Build linux-jdk11 / testForceDeclaredDependenciesUsage

Error Message:
null

Stack Trace:
java.lang.NullPointerException: null
	at org.apache.commons.lang3.SystemUtils.isJavaVersionAtLeast(SystemUtils.java:1626)
	at org.apache.maven.shared.dependency.analyzer.DefaultProjectDependencyAnalyzerTest.compileProject(DefaultProjectDependencyAnalyzerTest.java:342)
	at org.apache.maven.shared.dependency.analyzer.DefaultProjectDependencyAnalyzerTest.compileProject(DefaultProjectDependencyAnalyzerTest.java:337)
	at org.apache.maven.shared.dependency.analyzer.DefaultProjectDependencyAnalyzerTest.testForceDeclaredDependenciesUsage(DefaultProjectDependencyAnalyzerTest.java:198)


FAILED:  org.apache.maven.shared.dependency.analyzer.DefaultProjectDependencyAnalyzerTest.linux-jdk11 / Build linux-jdk11 / testJarWithTestDependency

Error Message:
null

Stack Trace:
java.lang.NullPointerException: null
	at org.apache.commons.lang3.SystemUtils.isJavaVersionAtLeast(SystemUtils.java:1626)
	at org.apache.maven.shared.dependency.analyzer.DefaultProjectDependencyAnalyzerTest.compileProject(DefaultProjectDependencyAnalyzerTest.java:342)
	at org.apache.maven.shared.dependency.analyzer.DefaultProjectDependencyAnalyzerTest.compileProject(DefaultProjectDependencyAnalyzerTest.java:337)
	at org.apache.maven.shared.dependency.analyzer.DefaultProjectDependencyAnalyzerTest.testJarWithTestDependency(DefaultProjectDependencyAnalyzerTest.java:232)


FAILED:  org.apache.maven.shared.dependency.analyzer.DefaultProjectDependencyAnalyzerTest.linux-jdk11 / Build linux-jdk11 / testJarWithCompileDependency

Error Message:
null

Stack Trace:
java.lang.NullPointerException: null
	at org.apache.commons.lang3.SystemUtils.isJavaVersionAtLeast(SystemUtils.java:1626)
	at org.apache.maven.shared.dependency.analyzer.DefaultProjectDependencyAnalyzerTest.compileProject(DefaultProjectDependencyAnalyzerTest.java:342)
	at org.apache.maven.shared.dependency.analyzer.DefaultProjectDependencyAnalyzerTest.compileProject(DefaultProjectDependencyAnalyzerTest.java:337)
	at org.apache.maven.shared.dependency.analyzer.DefaultProjectDependencyAnalyzerTest.testJarWithCompileDependency(DefaultProjectDependencyAnalyzerTest.java:174)


FAILED:  org.apache.maven.shared.dependency.analyzer.DefaultProjectDependencyAnalyzerTest.linux-jdk11 / Build linux-jdk11 / testJava8methodRefs

Error Message:
null

Stack Trace:
java.lang.NullPointerException: null
	at org.apache.commons.lang3.SystemUtils.isJavaVersionAtLeast(SystemUtils.java:1626)
	at org.apache.maven.shared.dependency.analyzer.DefaultProjectDependencyAnalyzerTest.testJava8methodRefs(DefaultProjectDependencyAnalyzerTest.java:125)


FAILED:  org.apache.maven.shared.dependency.analyzer.DefaultProjectDependencyAnalyzerTest.linux-jdk11 / Build linux-jdk11 / testInlinedStaticReference

Error Message:
null

Stack Trace:
java.lang.NullPointerException: null
	at org.apache.commons.lang3.SystemUtils.isJavaVersionAtLeast(SystemUtils.java:1626)
	at org.apache.maven.shared.dependency.analyzer.DefaultProjectDependencyAnalyzerTest.testInlinedStaticReference(DefaultProjectDependencyAnalyzerTest.java:150)


FAILED:  org.apache.maven.shared.dependency.analyzer.DefaultProjectDependencyAnalyzerTest.linux-jdk11 / Build linux-jdk11 / testTypeUseAnnotationDependency

Error Message:
null

Stack Trace:
java.lang.NullPointerException: null
	at org.apache.commons.lang3.SystemUtils.isJavaVersionAtLeast(SystemUtils.java:1626)
	at org.apache.maven.shared.dependency.analyzer.DefaultProjectDependencyAnalyzerTest.testTypeUseAnnotationDependency(DefaultProjectDependencyAnalyzerTest.java:310)


FAILED:  org.apache.maven.shared.dependency.analyzer.DefaultProjectDependencyAnalyzerTest.linux-jdk11 / Build linux-jdk11 / testMultimoduleProject

Error Message:
null

Stack Trace:
java.lang.NullPointerException: null
	at org.apache.commons.lang3.SystemUtils.isJavaVersionAtLeast(SystemUtils.java:1626)
	at org.apache.maven.shared.dependency.analyzer.DefaultProjectDependencyAnalyzerTest.compileProject(DefaultProjectDependencyAnalyzerTest.java:342)
	at org.apache.maven.shared.dependency.analyzer.DefaultProjectDependencyAnalyzerTest.compileProject(DefaultProjectDependencyAnalyzerTest.java:337)
	at org.apache.maven.shared.dependency.analyzer.DefaultProjectDependencyAnalyzerTest.testMultimoduleProject(DefaultProjectDependencyAnalyzerTest.java:280)


FAILED:  org.apache.maven.shared.dependency.analyzer.DefaultProjectDependencyAnalyzerTest.windows-jdk7 / Build windows-jdk7 / testJarWithXmlTransitiveDependency

Error Message:
Error compiling test project expected:<0> but was:<1>

Stack Trace:
junit.framework.AssertionFailedError: Error compiling test project expected:<0> but was:<1>
	at junit.framework.Assert.fail(Assert.java:57)
	at junit.framework.Assert.failNotEquals(Assert.java:329)
	at junit.framework.Assert.assertEquals(Assert.java:78)
	at junit.framework.Assert.assertEquals(Assert.java:234)
	at junit.framework.TestCase.assertEquals(TestCase.java:401)
	at org.apache.maven.shared.dependency.analyzer.DefaultProjectDependencyAnalyzerTest.compileProject(DefaultProjectDependencyAnalyzerTest.java:358)
	at org.apache.maven.shared.dependency.analyzer.DefaultProjectDependencyAnalyzerTest.compileProject(DefaultProjectDependencyAnalyzerTest.java:337)
	at org.apache.maven.shared.dependency.analyzer.DefaultProjectDependencyAnalyzerTest.testJarWithXmlTransitiveDependency(DefaultProjectDependencyAnalyzerTest.java:262)


FAILED:  org.apache.maven.shared.dependency.analyzer.DefaultProjectDependencyAnalyzerTest.windows-jdk7 / Build windows-jdk7 / testJarWithNoDependencies

Error Message:
Error compiling test project expected:<0> but was:<1>

Stack Trace:
junit.framework.AssertionFailedError: Error compiling test project expected:<0> but was:<1>
	at junit.framework.Assert.fail(Assert.java:57)
	at junit.framework.Assert.failNotEquals(Assert.java:329)
	at junit.framework.Assert.assertEquals(Assert.java:78)
	at junit.framework.Assert.assertEquals(Assert.java:234)
	at junit.framework.TestCase.assertEquals(TestCase.java:401)
	at org.apache.maven.shared.dependency.analyzer.DefaultProjectDependencyAnalyzerTest.compileProject(DefaultProjectDependencyAnalyzerTest.java:358)
	at org.apache.maven.shared.dependency.analyzer.DefaultProjectDependencyAnalyzerTest.compileProject(DefaultProjectDependencyAnalyzerTest.java:337)
	at org.apache.maven.shared.dependency.analyzer.DefaultProjectDependencyAnalyzerTest.testJarWithNoDependencies(DefaultProjectDependencyAnalyzerTest.java:111)


FAILED:  org.apache.maven.shared.dependency.analyzer.DefaultProjectDependencyAnalyzerTest.windows-jdk7 / Build windows-jdk7 / testPom

Error Message:
Error compiling test project expected:<0> but was:<1>

Stack Trace:
junit.framework.AssertionFailedError: Error compiling test project expected:<0> but was:<1>
	at junit.framework.Assert.fail(Assert.java:57)
	at junit.framework.Assert.failNotEquals(Assert.java:329)
	at junit.framework.Assert.assertEquals(Assert.java:78)
	at junit.framework.Assert.assertEquals(Assert.java:234)
	at junit.framework.TestCase.assertEquals(TestCase.java:401)
	at org.apache.maven.shared.dependency.analyzer.DefaultProjectDependencyAnalyzerTest.compileProject(DefaultProjectDependencyAnalyzerTest.java:358)
	at org.apache.maven.shared.dependency.analyzer.DefaultProjectDependencyAnalyzerTest.compileProject(DefaultProjectDependencyAnalyzerTest.java:337)
	at org.apache.maven.shared.dependency.analyzer.DefaultProjectDependencyAnalyzerTest.testPom(DefaultProjectDependencyAnalyzerTest.java:97)


FAILED:  org.apache.maven.shared.dependency.analyzer.DefaultProjectDependencyAnalyzerTest.windows-jdk7 / Build windows-jdk7 / testForceDeclaredDependenciesUsage

Error Message:
Error compiling test project expected:<0> but was:<1>

Stack Trace:
junit.framework.AssertionFailedError: Error compiling test project expected:<0> but was:<1>
	at junit.framework.Assert.fail(Assert.java:57)
	at junit.framework.Assert.failNotEquals(Assert.java:329)
	at junit.framework.Assert.assertEquals(Assert.java:78)
	at junit.framework.Assert.assertEquals(Assert.java:234)
	at junit.framework.TestCase.assertEquals(TestCase.java:401)
	at org.apache.maven.shared.dependency.analyzer.DefaultProjectDependencyAnalyzerTest.compileProject(DefaultProjectDependencyAnalyzerTest.java:358)
	at org.apache.maven.shared.dependency.analyzer.DefaultProjectDependencyAnalyzerTest.compileProject(DefaultProjectDependencyAnalyzerTest.java:337)
	at org.apache.maven.shared.dependency.analyzer.DefaultProjectDependencyAnalyzerTest.testForceDeclaredDependenciesUsage(DefaultProjectDependencyAnalyzerTest.java:198)


FAILED:  org.apache.maven.shared.dependency.analyzer.DefaultProjectDependencyAnalyzerTest.windows-jdk7 / Build windows-jdk7 / testJarWithTestDependency

Error Message:
Error compiling test project expected:<0> but was:<1>

Stack Trace:
junit.framework.AssertionFailedError: Error compiling test project expected:<0> but was:<1>
	at junit.framework.Assert.fail(Assert.java:57)
	at junit.framework.Assert.failNotEquals(Assert.java:329)
	at junit.framework.Assert.assertEquals(Assert.java:78)
	at junit.framework.Assert.assertEquals(Assert.java:234)
	at junit.framework.TestCase.assertEquals(TestCase.java:401)
	at org.apache.maven.shared.dependency.analyzer.DefaultProjectDependencyAnalyzerTest.compileProject(DefaultProjectDependencyAnalyzerTest.java:358)
	at org.apache.maven.shared.dependency.analyzer.DefaultProjectDependencyAnalyzerTest.compileProject(DefaultProjectDependencyAnalyzerTest.java:337)
	at org.apache.maven.shared.dependency.analyzer.DefaultProjectDependencyAnalyzerTest.testJarWithTestDependency(DefaultProjectDependencyAnalyzerTest.java:232)


FAILED:  org.apache.maven.shared.dependency.analyzer.DefaultProjectDependencyAnalyzerTest.windows-jdk7 / Build windows-jdk7 / testJarWithCompileDependency

Error Message:
Error compiling test project expected:<0> but was:<1>

Stack Trace:
junit.framework.AssertionFailedError: Error compiling test project expected:<0> but was:<1>
	at junit.framework.Assert.fail(Assert.java:57)
	at junit.framework.Assert.failNotEquals(Assert.java:329)
	at junit.framework.Assert.assertEquals(Assert.java:78)
	at junit.framework.Assert.assertEquals(Assert.java:234)
	at junit.framework.TestCase.assertEquals(TestCase.java:401)
	at org.apache.maven.shared.dependency.analyzer.DefaultProjectDependencyAnalyzerTest.compileProject(DefaultProjectDependencyAnalyzerTest.java:358)
	at org.apache.maven.shared.dependency.analyzer.DefaultProjectDependencyAnalyzerTest.compileProject(DefaultProjectDependencyAnalyzerTest.java:337)
	at org.apache.maven.shared.dependency.analyzer.DefaultProjectDependencyAnalyzerTest.testJarWithCompileDependency(DefaultProjectDependencyAnalyzerTest.java:174)


FAILED:  org.apache.maven.shared.dependency.analyzer.DefaultProjectDependencyAnalyzerTest.windows-jdk7 / Build windows-jdk7 / testMultimoduleProject

Error Message:
Error compiling test project expected:<0> but was:<1>

Stack Trace:
junit.framework.AssertionFailedError: Error compiling test project expected:<0> but was:<1>
	at junit.framework.Assert.fail(Assert.java:57)
	at junit.framework.Assert.failNotEquals(Assert.java:329)
	at junit.framework.Assert.assertEquals(Assert.java:78)
	at junit.framework.Assert.assertEquals(Assert.java:234)
	at junit.framework.TestCase.assertEquals(TestCase.java:401)
	at org.apache.maven.shared.dependency.analyzer.DefaultProjectDependencyAnalyzerTest.compileProject(DefaultProjectDependencyAnalyzerTest.java:358)
	at org.apache.maven.shared.dependency.analyzer.DefaultProjectDependencyAnalyzerTest.compileProject(DefaultProjectDependencyAnalyzerTest.java:337)
	at org.apache.maven.shared.dependency.analyzer.DefaultProjectDependencyAnalyzerTest.testMultimoduleProject(DefaultProjectDependencyAnalyzerTest.java:280)


FAILED:  org.apache.maven.shared.dependency.analyzer.DefaultProjectDependencyAnalyzerTest.windows-jdk11 / Build windows-jdk11 / testJarWithXmlTransitiveDependency

Error Message:
null

Stack Trace:
java.lang.NullPointerException: null
	at org.apache.commons.lang3.SystemUtils.isJavaVersionAtLeast(SystemUtils.java:1626)
	at org.apache.maven.shared.dependency.analyzer.DefaultProjectDependencyAnalyzerTest.compileProject(DefaultProjectDependencyAnalyzerTest.java:342)
	at org.apache.maven.shared.dependency.analyzer.DefaultProjectDependencyAnalyzerTest.compileProject(DefaultProjectDependencyAnalyzerTest.java:337)
	at org.apache.maven.shared.dependency.analyzer.DefaultProjectDependencyAnalyzerTest.testJarWithXmlTransitiveDependency(DefaultProjectDependencyAnalyzerTest.java:262)


FAILED:  org.apache.maven.shared.dependency.analyzer.DefaultProjectDependencyAnalyzerTest.windows-jdk11 / Build windows-jdk11 / testJarWithNoDependencies

Error Message:
null

Stack Trace:
java.lang.NullPointerException: null
	at org.apache.commons.lang3.SystemUtils.isJavaVersionAtLeast(SystemUtils.java:1626)
	at org.apache.maven.shared.dependency.analyzer.DefaultProjectDependencyAnalyzerTest.compileProject(DefaultProjectDependencyAnalyzerTest.java:342)
	at org.apache.maven.shared.dependency.analyzer.DefaultProjectDependencyAnalyzerTest.compileProject(DefaultProjectDependencyAnalyzerTest.java:337)
	at org.apache.maven.shared.dependency.analyzer.DefaultProjectDependencyAnalyzerTest.testJarWithNoDependencies(DefaultProjectDependencyAnalyzerTest.java:111)


FAILED:  org.apache.maven.shared.dependency.analyzer.DefaultProjectDependencyAnalyzerTest.windows-jdk11 / Build windows-jdk11 / testPom

Error Message:
null

Stack Trace:
java.lang.NullPointerException: null
	at org.apache.commons.lang3.SystemUtils.isJavaVersionAtLeast(SystemUtils.java:1626)
	at org.apache.maven.shared.dependency.analyzer.DefaultProjectDependencyAnalyzerTest.compileProject(DefaultProjectDependencyAnalyzerTest.java:342)
	at org.apache.maven.shared.dependency.analyzer.DefaultProjectDependencyAnalyzerTest.compileProject(DefaultProjectDependencyAnalyzerTest.java:337)
	at org.apache.maven.shared.dependency.analyzer.DefaultProjectDependencyAnalyzerTest.testPom(DefaultProjectDependencyAnalyzerTest.java:97)


FAILED:  org.apache.maven.shared.dependency.analyzer.DefaultProjectDependencyAnalyzerTest.windows-jdk11 / Build windows-jdk11 / testForceDeclaredDependenciesUsage

Error Message:
null

Stack Trace:
java.lang.NullPointerException: null
	at org.apache.commons.lang3.SystemUtils.isJavaVersionAtLeast(SystemUtils.java:1626)
	at org.apache.maven.shared.dependency.analyzer.DefaultProjectDependencyAnalyzerTest.compileProject(DefaultProjectDependencyAnalyzerTest.java:342)
	at org.apache.maven.shared.dependency.analyzer.DefaultProjectDependencyAnalyzerTest.compileProject(DefaultProjectDependencyAnalyzerTest.java:337)
	at org.apache.maven.shared.dependency.analyzer.DefaultProjectDependencyAnalyzerTest.testForceDeclaredDependenciesUsage(DefaultProjectDependencyAnalyzerTest.java:198)


FAILED:  org.apache.maven.shared.dependency.analyzer.DefaultProjectDependencyAnalyzerTest.windows-jdk11 / Build windows-jdk11 / testJarWithTestDependency

Error Message:
null

Stack Trace:
java.lang.NullPointerException: null
	at org.apache.commons.lang3.SystemUtils.isJavaVersionAtLeast(SystemUtils.java:1626)
	at org.apache.maven.shared.dependency.analyzer.DefaultProjectDependencyAnalyzerTest.compileProject(DefaultProjectDependencyAnalyzerTest.java:342)
	at org.apache.maven.shared.dependency.analyzer.DefaultProjectDependencyAnalyzerTest.compileProject(DefaultProjectDependencyAnalyzerTest.java:337)
	at org.apache.maven.shared.dependency.analyzer.DefaultProjectDependencyAnalyzerTest.testJarWithTestDependency(DefaultProjectDependencyAnalyzerTest.java:232)


FAILED:  org.apache.maven.shared.dependency.analyzer.DefaultProjectDependencyAnalyzerTest.windows-jdk11 / Build windows-jdk11 / testJarWithCompileDependency

Error Message:
null

Stack Trace:
java.lang.NullPointerException: null
	at org.apache.commons.lang3.SystemUtils.isJavaVersionAtLeast(SystemUtils.java:1626)
	at org.apache.maven.shared.dependency.analyzer.DefaultProjectDependencyAnalyzerTest.compileProject(DefaultProjectDependencyAnalyzerTest.java:342)
	at org.apache.maven.shared.dependency.analyzer.DefaultProjectDependencyAnalyzerTest.compileProject(DefaultProjectDependencyAnalyzerTest.java:337)
	at org.apache.maven.shared.dependency.analyzer.DefaultProjectDependencyAnalyzerTest.testJarWithCompileDependency(DefaultProjectDependencyAnalyzerTest.java:174)


FAILED:  org.apache.maven.shared.dependency.analyzer.DefaultProjectDependencyAnalyzerTest.windows-jdk11 / Build windows-jdk11 / testJava8methodRefs

Error Message:
null

Stack Trace:
java.lang.NullPointerException: null
	at org.apache.commons.lang3.SystemUtils.isJavaVersionAtLeast(SystemUtils.java:1626)
	at org.apache.maven.shared.dependency.analyzer.DefaultProjectDependencyAnalyzerTest.testJava8methodRefs(DefaultProjectDependencyAnalyzerTest.java:125)


FAILED:  org.apache.maven.shared.dependency.analyzer.DefaultProjectDependencyAnalyzerTest.windows-jdk11 / Build windows-jdk11 / testInlinedStaticReference

Error Message:
null

Stack Trace:
java.lang.NullPointerException: null
	at org.apache.commons.lang3.SystemUtils.isJavaVersionAtLeast(SystemUtils.java:1626)
	at org.apache.maven.shared.dependency.analyzer.DefaultProjectDependencyAnalyzerTest.testInlinedStaticReference(DefaultProjectDependencyAnalyzerTest.java:150)


FAILED:  org.apache.maven.shared.dependency.analyzer.DefaultProjectDependencyAnalyzerTest.windows-jdk11 / Build windows-jdk11 / testTypeUseAnnotationDependency

Error Message:
null

Stack Trace:
java.lang.NullPointerException: null
	at org.apache.commons.lang3.SystemUtils.isJavaVersionAtLeast(SystemUtils.java:1626)
	at org.apache.maven.shared.dependency.analyzer.DefaultProjectDependencyAnalyzerTest.testTypeUseAnnotationDependency(DefaultProjectDependencyAnalyzerTest.java:310)


FAILED:  org.apache.maven.shared.dependency.analyzer.DefaultProjectDependencyAnalyzerTest.windows-jdk11 / Build windows-jdk11 / testMultimoduleProject

Error Message:
null

Stack Trace:
java.lang.NullPointerException: null
	at org.apache.commons.lang3.SystemUtils.isJavaVersionAtLeast(SystemUtils.java:1626)
	at org.apache.maven.shared.dependency.analyzer.DefaultProjectDependencyAnalyzerTest.compileProject(DefaultProjectDependencyAnalyzerTest.java:342)
	at org.apache.maven.shared.dependency.analyzer.DefaultProjectDependencyAnalyzerTest.compileProject(DefaultProjectDependencyAnalyzerTest.java:337)
	at org.apache.maven.shared.dependency.analyzer.DefaultProjectDependencyAnalyzerTest.testMultimoduleProject(DefaultProjectDependencyAnalyzerTest.java:280)




Build log:
[...truncated 12530 lines...]
[INFO] Downloading from central: https://repo.maven.apache.org/maven2/org/sonatype/forge/forge-parent/5/forge-parent-5.pom
[INFO] Downloaded from central: https://repo.maven.apache.org/maven2/org/sonatype/forge/forge-parent/5/forge-parent-5.pom (8.4 kB at 1.4 MB/s)
[INFO] Downloading from central: https://repo.maven.apache.org/maven2/org/apache/maven/shared/maven-filtering/1.1/maven-filtering-1.1.pom
[INFO] Downloaded from central: https://repo.maven.apache.org/maven2/org/apache/maven/shared/maven-filtering/1.1/maven-filtering-1.1.pom (5.8 kB at 827 kB/s)
[INFO] Downloading from central: https://repo.maven.apache.org/maven2/org/apache/maven/maven-project/2.0.6/maven-project-2.0.6.pom
[INFO] Downloaded from central: https://repo.maven.apache.org/maven2/org/apache/maven/maven-project/2.0.6/maven-project-2.0.6.pom (2.6 kB at 440 kB/s)
[INFO] Downloading from central: https://repo.maven.apache.org/maven2/org/apache/maven/maven/2.0.6/maven-2.0.6.pom
[INFO] Downloaded from central: https://repo.maven.apache.org/maven2/org/apache/maven/maven/2.0.6/maven-2.0.6.pom (9.0 kB at 754 kB/s)
[INFO] Downloading from central: https://repo.maven.apache.org/maven2/org/apache/maven/maven-settings/2.0.6/maven-settings-2.0.6.pom
[INFO] Downloaded from central: https://repo.maven.apache.org/maven2/org/apache/maven/maven-settings/2.0.6/maven-settings-2.0.6.pom (2.0 kB at 334 kB/s)
[INFO] Downloading from central: https://repo.maven.apache.org/maven2/org/apache/maven/maven-model/2.0.6/maven-model-2.0.6.pom
[INFO] Downloaded from central: https://repo.maven.apache.org/maven2/org/apache/maven/maven-model/2.0.6/maven-model-2.0.6.pom (3.0 kB at 508 kB/s)
[INFO] Downloading from central: https://repo.maven.apache.org/maven2/org/apache/maven/maven-profile/2.0.6/maven-profile-2.0.6.pom
[INFO] Downloaded from central: https://repo.maven.apache.org/maven2/org/apache/maven/maven-profile/2.0.6/maven-profile-2.0.6.pom (2.0 kB at 396 kB/s)
[INFO] Downloading from central: https://repo.maven.apache.org/maven2/org/apache/maven/maven-artifact-manager/2.0.6/maven-artifact-manager-2.0.6.pom
[INFO] Downloaded from central: https://repo.maven.apache.org/maven2/org/apache/maven/maven-artifact-manager/2.0.6/maven-artifact-manager-2.0.6.pom (2.6 kB at 375 kB/s)
[INFO] Downloading from central: https://repo.maven.apache.org/maven2/org/apache/maven/maven-repository-metadata/2.0.6/maven-repository-metadata-2.0.6.pom
[INFO] Downloaded from central: https://repo.maven.apache.org/maven2/org/apache/maven/maven-repository-metadata/2.0.6/maven-repository-metadata-2.0.6.pom (1.9 kB at 308 kB/s)
[INFO] Downloading from central: https://repo.maven.apache.org/maven2/org/apache/maven/maven-artifact/2.0.6/maven-artifact-2.0.6.pom
[INFO] Downloaded from central: https://repo.maven.apache.org/maven2/org/apache/maven/maven-artifact/2.0.6/maven-artifact-2.0.6.pom (1.6 kB at 315 kB/s)
[INFO] Downloading from central: https://repo.maven.apache.org/maven2/org/apache/maven/maven-plugin-registry/2.0.6/maven-plugin-registry-2.0.6.pom
[INFO] Downloaded from central: https://repo.maven.apache.org/maven2/org/apache/maven/maven-plugin-registry/2.0.6/maven-plugin-registry-2.0.6.pom (1.9 kB at 65 kB/s)
[INFO] Downloading from central: https://repo.maven.apache.org/maven2/org/apache/maven/maven-core/2.0.6/maven-core-2.0.6.pom
[INFO] Downloaded from central: https://repo.maven.apache.org/maven2/org/apache/maven/maven-core/2.0.6/maven-core-2.0.6.pom (6.7 kB at 959 kB/s)
[INFO] Downloading from central: https://repo.maven.apache.org/maven2/org/apache/maven/maven-plugin-parameter-documenter/2.0.6/maven-plugin-parameter-documenter-2.0.6.pom
[INFO] Downloaded from central: https://repo.maven.apache.org/maven2/org/apache/maven/maven-plugin-parameter-documenter/2.0.6/maven-plugin-parameter-documenter-2.0.6.pom (1.9 kB at 318 kB/s)
[INFO] Downloading from central: https://repo.maven.apache.org/maven2/org/apache/maven/reporting/maven-reporting-api/2.0.6/maven-reporting-api-2.0.6.pom
[INFO] Downloaded from central: https://repo.maven.apache.org/maven2/org/apache/maven/reporting/maven-reporting-api/2.0.6/maven-reporting-api-2.0.6.pom (1.8 kB at 292 kB/s)
[INFO] Downloading from central: https://repo.maven.apache.org/maven2/org/apache/maven/reporting/maven-reporting/2.0.6/maven-reporting-2.0.6.pom
[INFO] Downloaded from central: https://repo.maven.apache.org/maven2/org/apache/maven/reporting/maven-reporting/2.0.6/maven-reporting-2.0.6.pom (1.4 kB at 240 kB/s)
[INFO] Downloading from central: https://repo.maven.apache.org/maven2/org/apache/maven/doxia/doxia-sink-api/1.0-alpha-7/doxia-sink-api-1.0-alpha-7.pom
[INFO] Downloaded from central: https://repo.maven.apache.org/maven2/org/apache/maven/doxia/doxia-sink-api/1.0-alpha-7/doxia-sink-api-1.0-alpha-7.pom (424 B at 71 kB/s)
[INFO] Downloading from central: https://repo.maven.apache.org/maven2/org/apache/maven/doxia/doxia/1.0-alpha-7/doxia-1.0-alpha-7.pom
[INFO] Downloaded from central: https://repo.maven.apache.org/maven2/org/apache/maven/doxia/doxia/1.0-alpha-7/doxia-1.0-alpha-7.pom (3.9 kB at 783 kB/s)
[INFO] Downloading from central: https://repo.maven.apache.org/maven2/org/apache/maven/maven-error-diagnostics/2.0.6/maven-error-diagnostics-2.0.6.pom
[INFO] Downloaded from central: https://repo.maven.apache.org/maven2/org/apache/maven/maven-error-diagnostics/2.0.6/maven-error-diagnostics-2.0.6.pom (1.7 kB at 341 kB/s)
[INFO] Downloading from central: https://repo.maven.apache.org/maven2/commons-cli/commons-cli/1.0/commons-cli-1.0.pom
[INFO] Downloaded from central: https://repo.maven.apache.org/maven2/commons-cli/commons-cli/1.0/commons-cli-1.0.pom (2.1 kB at 421 kB/s)
[INFO] Downloading from central: https://repo.maven.apache.org/maven2/org/apache/maven/maven-plugin-api/2.0.6/maven-plugin-api-2.0.6.pom
[INFO] Downloaded from central: https://repo.maven.apache.org/maven2/org/apache/maven/maven-plugin-api/2.0.6/maven-plugin-api-2.0.6.pom (1.5 kB at 146 kB/s)
[INFO] Downloading from central: https://repo.maven.apache.org/maven2/org/apache/maven/maven-plugin-descriptor/2.0.6/maven-plugin-descriptor-2.0.6.pom
[INFO] Downloaded from central: https://repo.maven.apache.org/maven2/org/apache/maven/maven-plugin-descriptor/2.0.6/maven-plugin-descriptor-2.0.6.pom (2.0 kB at 404 kB/s)
[INFO] Downloading from central: https://repo.maven.apache.org/maven2/org/apache/maven/maven-monitor/2.0.6/maven-monitor-2.0.6.pom
[INFO] Downloaded from central: https://repo.maven.apache.org/maven2/org/apache/maven/maven-monitor/2.0.6/maven-monitor-2.0.6.pom (1.3 kB at 209 kB/s)
[INFO] Downloading from central: https://repo.maven.apache.org/maven2/org/codehaus/plexus/plexus-interpolation/1.12/plexus-interpolation-1.12.pom
[INFO] Downloaded from central: https://repo.maven.apache.org/maven2/org/codehaus/plexus/plexus-interpolation/1.12/plexus-interpolation-1.12.pom (889 B at 148 kB/s)
[INFO] Downloading from central: https://repo.maven.apache.org/maven2/org/sonatype/plexus/plexus-build-api/0.0.4/plexus-build-api-0.0.4.pom
[INFO] Downloaded from central: https://repo.maven.apache.org/maven2/org/sonatype/plexus/plexus-build-api/0.0.4/plexus-build-api-0.0.4.pom (2.9 kB at 477 kB/s)
[INFO] Downloading from central: https://repo.maven.apache.org/maven2/org/sonatype/spice/spice-parent/10/spice-parent-10.pom
[INFO] Downloaded from central: https://repo.maven.apache.org/maven2/org/sonatype/spice/spice-parent/10/spice-parent-10.pom (3.0 kB at 502 kB/s)
[INFO] Downloading from central: https://repo.maven.apache.org/maven2/org/sonatype/forge/forge-parent/3/forge-parent-3.pom
[INFO] Downloaded from central: https://repo.maven.apache.org/maven2/org/sonatype/forge/forge-parent/3/forge-parent-3.pom (5.0 kB at 839 kB/s)
[INFO] Downloading from central: https://repo.maven.apache.org/maven2/org/codehaus/plexus/plexus-utils/1.5.8/plexus-utils-1.5.8.pom
[INFO] Downloaded from central: https://repo.maven.apache.org/maven2/org/codehaus/plexus/plexus-utils/1.5.8/plexus-utils-1.5.8.pom (8.1 kB at 1.3 MB/s)
[INFO] Downloading from central: https://repo.maven.apache.org/maven2/org/codehaus/plexus/plexus-resources/1.0-alpha-7/plexus-resources-1.0-alpha-7.pom
[INFO] Downloaded from central: https://repo.maven.apache.org/maven2/org/codehaus/plexus/plexus-resources/1.0-alpha-7/plexus-resources-1.0-alpha-7.pom (1.4 kB at 194 kB/s)
[INFO] Downloading from central: https://repo.maven.apache.org/maven2/org/codehaus/plexus/plexus-components/1.1.17/plexus-components-1.1.17.pom
[INFO] Downloaded from central: https://repo.maven.apache.org/maven2/org/codehaus/plexus/plexus-components/1.1.17/plexus-components-1.1.17.pom (5.2 kB at 521 kB/s)
[INFO] Downloading from central: https://repo.maven.apache.org/maven2/org/codehaus/plexus/plexus/2.0.5/plexus-2.0.5.pom
[INFO] Downloaded from central: https://repo.maven.apache.org/maven2/org/codehaus/plexus/plexus/2.0.5/plexus-2.0.5.pom (17 kB at 2.9 MB/s)
[INFO] Downloading from central: https://repo.maven.apache.org/maven2/org/apache/velocity/velocity/1.7/velocity-1.7.pom
[INFO] Downloaded from central: https://repo.maven.apache.org/maven2/org/apache/velocity/velocity/1.7/velocity-1.7.pom (11 kB at 1.8 MB/s)
[INFO] Downloading from central: https://repo.maven.apache.org/maven2/commons-lang/commons-lang/2.4/commons-lang-2.4.pom
[INFO] Downloaded from central: https://repo.maven.apache.org/maven2/commons-lang/commons-lang/2.4/commons-lang-2.4.pom (14 kB at 2.3 MB/s)
[INFO] Downloading from central: https://repo.maven.apache.org/maven2/org/codehaus/plexus/plexus-resources/1.0-alpha-7/plexus-resources-1.0-alpha-7.jar
[INFO] Downloading from central: https://repo.maven.apache.org/maven2/org/apache/maven/shared/maven-artifact-resolver/1.0/maven-artifact-resolver-1.0.jar
[INFO] Downloading from central: https://repo.maven.apache.org/maven2/org/codehaus/plexus/plexus-interpolation/1.12/plexus-interpolation-1.12.jar
[INFO] Downloaded from central: https://repo.maven.apache.org/maven2/org/codehaus/plexus/plexus-resources/1.0-alpha-7/plexus-resources-1.0-alpha-7.jar (23 kB at 72 kB/s)
[INFO] Downloading from central: https://repo.maven.apache.org/maven2/org/sonatype/plexus/plexus-build-api/0.0.4/plexus-build-api-0.0.4.jar
[INFO] Downloading from central: https://repo.maven.apache.org/maven2/org/apache/maven/shared/maven-filtering/1.1/maven-filtering-1.1.jar
[INFO] Downloading from central: https://repo.maven.apache.org/maven2/org/codehaus/plexus/plexus-utils/1.5.15/plexus-utils-1.5.15.jar
[INFO] Downloaded from central: https://repo.maven.apache.org/maven2/org/apache/maven/shared/maven-artifact-resolver/1.0/maven-artifact-resolver-1.0.jar (14 kB at 41 kB/s)
[INFO] Downloading from central: https://repo.maven.apache.org/maven2/org/apache/velocity/velocity/1.7/velocity-1.7.jar
[INFO] Downloaded from central: https://repo.maven.apache.org/maven2/org/sonatype/plexus/plexus-build-api/0.0.4/plexus-build-api-0.0.4.jar (6.8 kB at 20 kB/s)
[INFO] Downloading from central: https://repo.maven.apache.org/maven2/commons-lang/commons-lang/2.4/commons-lang-2.4.jar
[INFO] Downloaded from central: https://repo.maven.apache.org/maven2/org/codehaus/plexus/plexus-utils/1.5.15/plexus-utils-1.5.15.jar (228 kB at 671 kB/s)
[INFO] Downloaded from central: https://repo.maven.apache.org/maven2/org/codehaus/plexus/plexus-interpolation/1.12/plexus-interpolation-1.12.jar (61 kB at 175 kB/s)
[INFO] Downloaded from central: https://repo.maven.apache.org/maven2/commons-lang/commons-lang/2.4/commons-lang-2.4.jar (262 kB at 719 kB/s)
[INFO] Downloaded from central: https://repo.maven.apache.org/maven2/org/apache/maven/shared/maven-filtering/1.1/maven-filtering-1.1.jar (43 kB at 111 kB/s)
[INFO] Downloaded from central: https://repo.maven.apache.org/maven2/org/apache/velocity/velocity/1.7/velocity-1.7.jar (450 kB at 1.1 MB/s)
[INFO] Downloading from central: https://repo.maven.apache.org/maven2/org/apache/apache-jar-resource-bundle/1.4/apache-jar-resource-bundle-1.4.jar
[INFO] Downloaded from central: https://repo.maven.apache.org/maven2/org/apache/apache-jar-resource-bundle/1.4/apache-jar-resource-bundle-1.4.jar (12 kB at 725 kB/s)
[INFO] 
[INFO] --- maven-resources-plugin:2.7:resources (default-resources) @ maven-dependency-analyzer ---
[INFO] Downloading from central: https://repo.maven.apache.org/maven2/org/codehaus/plexus/plexus-utils/3.0.15/plexus-utils-3.0.15.pom
[INFO] Downloaded from central: https://repo.maven.apache.org/maven2/org/codehaus/plexus/plexus-utils/3.0.15/plexus-utils-3.0.15.pom (3.1 kB at 262 kB/s)
[INFO] Downloading from central: https://repo.maven.apache.org/maven2/org/apache/maven/shared/maven-filtering/1.2/maven-filtering-1.2.pom
[INFO] Downloaded from central: https://repo.maven.apache.org/maven2/org/apache/maven/shared/maven-filtering/1.2/maven-filtering-1.2.pom (6.5 kB at 434 kB/s)
[INFO] Downloading from central: https://repo.maven.apache.org/maven2/org/apache/maven/shared/maven-shared-components/19/maven-shared-components-19.pom
[INFO] Downloaded from central: https://repo.maven.apache.org/maven2/org/apache/maven/shared/maven-shared-components/19/maven-shared-components-19.pom (6.4 kB at 636 kB/s)
[INFO] Downloading from central: https://repo.maven.apache.org/maven2/org/apache/maven/shared/maven-shared-utils/0.3/maven-shared-utils-0.3.pom
[INFO] Downloaded from central: https://repo.maven.apache.org/maven2/org/apache/maven/shared/maven-shared-utils/0.3/maven-shared-utils-0.3.pom (4.0 kB at 674 kB/s)
[INFO] Downloading from central: https://repo.maven.apache.org/maven2/org/apache/maven/shared/maven-shared-components/18/maven-shared-components-18.pom
[INFO] Downloaded from central: https://repo.maven.apache.org/maven2/org/apache/maven/shared/maven-shared-components/18/maven-shared-components-18.pom (4.9 kB at 822 kB/s)
[INFO] Downloading from central: https://repo.maven.apache.org/maven2/org/apache/maven/maven-parent/22/maven-parent-22.pom
[INFO] Downloaded from central: https://repo.maven.apache.org/maven2/org/apache/maven/maven-parent/22/maven-parent-22.pom (30 kB at 4.2 MB/s)
[INFO] Downloading from central: https://repo.maven.apache.org/maven2/org/apache/apache/11/apache-11.pom
[INFO] Downloaded from central: https://repo.maven.apache.org/maven2/org/apache/apache/11/apache-11.pom (15 kB at 3.0 MB/s)
[INFO] Downloading from central: https://repo.maven.apache.org/maven2/org/codehaus/plexus/plexus-interpolation/1.19/plexus-interpolation-1.19.pom
[INFO] Downloaded from central: https://repo.maven.apache.org/maven2/org/codehaus/plexus/plexus-interpolation/1.19/plexus-interpolation-1.19.pom (1.0 kB at 172 kB/s)
[INFO] Downloading from central: https://repo.maven.apache.org/maven2/org/codehaus/plexus/plexus-components/1.3.1/plexus-components-1.3.1.pom
[INFO] Downloaded from central: https://repo.maven.apache.org/maven2/org/codehaus/plexus/plexus-components/1.3.1/plexus-components-1.3.1.pom (3.1 kB at 192 kB/s)
[INFO] Downloading from central: https://repo.maven.apache.org/maven2/org/codehaus/plexus/plexus-utils/3.0.15/plexus-utils-3.0.15.jar
[INFO] Downloading from central: https://repo.maven.apache.org/maven2/org/apache/maven/shared/maven-shared-utils/0.3/maven-shared-utils-0.3.jar
[INFO] Downloading from central: https://repo.maven.apache.org/maven2/org/apache/maven/shared/maven-filtering/1.2/maven-filtering-1.2.jar
[INFO] Downloading from central: https://repo.maven.apache.org/maven2/org/codehaus/plexus/plexus-interpolation/1.19/plexus-interpolation-1.19.jar
[INFO] Downloaded from central: https://repo.maven.apache.org/maven2/org/codehaus/plexus/plexus-utils/3.0.15/plexus-utils-3.0.15.jar (239 kB at 13 MB/s)
[INFO] Downloaded from central: https://repo.maven.apache.org/maven2/org/apache/maven/shared/maven-filtering/1.2/maven-filtering-1.2.jar (44 kB at 2.1 MB/s)
[INFO] Downloaded from central: https://repo.maven.apache.org/maven2/org/apache/maven/shared/maven-shared-utils/0.3/maven-shared-utils-0.3.jar (155 kB at 5.5 MB/s)
[INFO] Downloaded from central: https://repo.maven.apache.org/maven2/org/codehaus/plexus/plexus-interpolation/1.19/plexus-interpolation-1.19.jar (62 kB at 2.0 MB/s)
[INFO] Using 'UTF-8' encoding to copy filtered resources.
[INFO] skip non existing resourceDirectory f:\jenkins\jenkins-slave\workspace\4_Detect_Java_8_type_annotations\m\src\main\resources
[INFO] Copying 3 resources
[INFO] 
[INFO] --- maven-compiler-plugin:3.5.1:compile (default-compile) @ maven-dependency-analyzer ---
[INFO] Downloading from central: https://repo.maven.apache.org/maven2/org/apache/maven/maven-core/3.0/maven-core-3.0.pom
[INFO] Downloaded from central: https://repo.maven.apache.org/maven2/org/apache/maven/maven-core/3.0/maven-core-3.0.pom (6.6 kB at 51 kB/s)
[INFO] Downloading from central: https://repo.maven.apache.org/maven2/org/apache/maven/maven-settings/3.0/maven-settings-3.0.pom
[INFO] Downloaded from central: https://repo.maven.apache.org/maven2/org/apache/maven/maven-settings/3.0/maven-settings-3.0.pom (1.9 kB at 209 kB/s)
[INFO] Downloading from central: https://repo.maven.apache.org/maven2/org/apache/maven/maven-settings-builder/3.0/maven-settings-builder-3.0.pom
[INFO] Downloaded from central: https://repo.maven.apache.org/maven2/org/apache/maven/maven-settings-builder/3.0/maven-settings-builder-3.0.pom (2.2 kB at 159 kB/s)
[INFO] Downloading from central: https://repo.maven.apache.org/maven2/org/codehaus/plexus/plexus-interpolation/1.14/plexus-interpolation-1.14.pom
[INFO] Downloaded from central: https://repo.maven.apache.org/maven2/org/codehaus/plexus/plexus-interpolation/1.14/plexus-interpolation-1.14.pom (910 B at 61 kB/s)
[INFO] Downloading from central: https://repo.maven.apache.org/maven2/org/codehaus/plexus/plexus-components/1.1.18/plexus-components-1.1.18.pom
[INFO] Downloaded from central: https://repo.maven.apache.org/maven2/org/codehaus/plexus/plexus-components/1.1.18/plexus-components-1.1.18.pom (5.4 kB at 536 kB/s)
[INFO] Downloading from central: https://repo.maven.apache.org/maven2/org/apache/maven/maven-repository-metadata/3.0/maven-repository-metadata-3.0.pom
[INFO] Downloaded from central: https://repo.maven.apache.org/maven2/org/apache/maven/maven-repository-metadata/3.0/maven-repository-metadata-3.0.pom (1.9 kB at 386 kB/s)
[INFO] Downloading from central: https://repo.maven.apache.org/maven2/org/apache/maven/maven-model-builder/3.0/maven-model-builder-3.0.pom
[INFO] Downloaded from central: https://repo.maven.apache.org/maven2/org/apache/maven/maven-model-builder/3.0/maven-model-builder-3.0.pom (2.2 kB at 321 kB/s)
[INFO] Downloading from central: https://repo.maven.apache.org/maven2/org/apache/maven/maven-aether-provider/3.0/maven-aether-provider-3.0.pom
[INFO] Downloaded from central: https://repo.maven.apache.org/maven2/org/apache/maven/maven-aether-provider/3.0/maven-aether-provider-3.0.pom (2.5 kB at 16 kB/s)
[INFO] Downloading from central: https://repo.maven.apache.org/maven2/org/sonatype/aether/aether-api/1.7/aether-api-1.7.pom
[INFO] Downloaded from central: https://repo.maven.apache.org/maven2/org/sonatype/aether/aether-api/1.7/aether-api-1.7.pom (1.7 kB at 152 kB/s)
[INFO] Downloading from central: https://repo.maven.apache.org/maven2/org/sonatype/aether/aether-parent/1.7/aether-parent-1.7.pom
[INFO] Downloaded from central: https://repo.maven.apache.org/maven2/org/sonatype/aether/aether-parent/1.7/aether-parent-1.7.pom (7.7 kB at 198 kB/s)
[INFO] Downloading from central: https://repo.maven.apache.org/maven2/org/sonatype/aether/aether-util/1.7/aether-util-1.7.pom
[INFO] Downloaded from central: https://repo.maven.apache.org/maven2/org/sonatype/aether/aether-util/1.7/aether-util-1.7.pom (2.1 kB at 9.7 kB/s)
[INFO] Downloading from central: https://repo.maven.apache.org/maven2/org/sonatype/aether/aether-impl/1.7/aether-impl-1.7.pom
[INFO] Downloaded from central: https://repo.maven.apache.org/maven2/org/sonatype/aether/aether-impl/1.7/aether-impl-1.7.pom (3.7 kB at 148 kB/s)
[INFO] Downloading from central: https://repo.maven.apache.org/maven2/org/sonatype/aether/aether-spi/1.7/aether-spi-1.7.pom
[INFO] Downloaded from central: https://repo.maven.apache.org/maven2/org/sonatype/aether/aether-spi/1.7/aether-spi-1.7.pom (1.7 kB at 79 kB/s)
[INFO] Downloading from central: https://repo.maven.apache.org/maven2/org/apache/maven/maven-toolchain/2.2.1/maven-toolchain-2.2.1.pom
[INFO] Downloaded from central: https://repo.maven.apache.org/maven2/org/apache/maven/maven-toolchain/2.2.1/maven-toolchain-2.2.1.pom (3.3 kB at 124 kB/s)
[INFO] Downloading from central: https://repo.maven.apache.org/maven2/org/apache/maven/shared/maven-shared-incremental/1.1/maven-shared-incremental-1.1.pom
[INFO] Downloaded from central: https://repo.maven.apache.org/maven2/org/apache/maven/shared/maven-shared-incremental/1.1/maven-shared-incremental-1.1.pom (4.7 kB at 395 kB/s)
[INFO] Downloading from central: https://repo.maven.apache.org/maven2/org/apache/maven/shared/maven-shared-utils/0.1/maven-shared-utils-0.1.pom
[INFO] Downloaded from central: https://repo.maven.apache.org/maven2/org/apache/maven/shared/maven-shared-utils/0.1/maven-shared-utils-0.1.pom (4.0 kB at 162 kB/s)
[INFO] Downloading from central: https://repo.maven.apache.org/maven2/org/codehaus/plexus/plexus-compiler-api/2.7/plexus-compiler-api-2.7.pom
[INFO] Downloaded from central: https://repo.maven.apache.org/maven2/org/codehaus/plexus/plexus-compiler-api/2.7/plexus-compiler-api-2.7.pom (891 B at 127 kB/s)
[INFO] Downloading from central: https://repo.maven.apache.org/maven2/org/codehaus/plexus/plexus-compiler/2.7/plexus-compiler-2.7.pom
[INFO] Downloaded from central: https://repo.maven.apache.org/maven2/org/codehaus/plexus/plexus-compiler/2.7/plexus-compiler-2.7.pom (4.9 kB at 822 kB/s)
[INFO] Downloading from central: https://repo.maven.apache.org/maven2/org/codehaus/plexus/plexus-components/4.0/plexus-components-4.0.pom
[INFO] Downloaded from central: https://repo.maven.apache.org/maven2/org/codehaus/plexus/plexus-components/4.0/plexus-components-4.0.pom (2.7 kB at 531 kB/s)
[INFO] Downloading from central: https://repo.maven.apache.org/maven2/org/codehaus/plexus/plexus-compiler-manager/2.7/plexus-compiler-manager-2.7.pom
[INFO] Downloaded from central: https://repo.maven.apache.org/maven2/org/codehaus/plexus/plexus-compiler-manager/2.7/plexus-compiler-manager-2.7.pom (711 B at 118 kB/s)
[INFO] Downloading from central: https://repo.maven.apache.org/maven2/org/codehaus/plexus/plexus-compiler-javac/2.7/plexus-compiler-javac-2.7.pom
[INFO] Downloaded from central: https://repo.maven.apache.org/maven2/org/codehaus/plexus/plexus-compiler-javac/2.7/plexus-compiler-javac-2.7.pom (792 B at 38 kB/s)
[INFO] Downloading from central: https://repo.maven.apache.org/maven2/org/codehaus/plexus/plexus-compilers/2.7/plexus-compilers-2.7.pom
[INFO] Downloaded from central: https://repo.maven.apache.org/maven2/org/codehaus/plexus/plexus-compilers/2.7/plexus-compilers-2.7.pom (1.4 kB at 230 kB/s)
[INFO] Downloading from central: https://repo.maven.apache.org/maven2/org/apache/maven/maven-core/3.0/maven-core-3.0.jar
[INFO] Downloading from central: https://repo.maven.apache.org/maven2/org/apache/maven/maven-model-builder/3.0/maven-model-builder-3.0.jar
[INFO] Downloading from central: https://repo.maven.apache.org/maven2/org/apache/maven/maven-settings/3.0/maven-settings-3.0.jar
[INFO] Downloading from central: https://repo.maven.apache.org/maven2/org/apache/maven/maven-repository-metadata/3.0/maven-repository-metadata-3.0.jar
[INFO] Downloading from central: https://repo.maven.apache.org/maven2/org/apache/maven/maven-settings-builder/3.0/maven-settings-builder-3.0.jar
[INFO] Downloaded from central: https://repo.maven.apache.org/maven2/org/apache/maven/maven-core/3.0/maven-core-3.0.jar (527 kB at 7.5 MB/s)
[INFO] Downloading from central: https://repo.maven.apache.org/maven2/org/apache/maven/maven-aether-provider/3.0/maven-aether-provider-3.0.jar
[INFO] Downloaded from central: https://repo.maven.apache.org/maven2/org/apache/maven/maven-model-builder/3.0/maven-model-builder-3.0.jar (148 kB at 1.5 MB/s)
[INFO] Downloading from central: https://repo.maven.apache.org/maven2/org/sonatype/aether/aether-impl/1.7/aether-impl-1.7.jar
[INFO] Downloaded from central: https://repo.maven.apache.org/maven2/org/apache/maven/maven-settings/3.0/maven-settings-3.0.jar (47 kB at 458 kB/s)
[INFO] Downloading from central: https://repo.maven.apache.org/maven2/org/sonatype/aether/aether-spi/1.7/aether-spi-1.7.jar
[INFO] Downloaded from central: https://repo.maven.apache.org/maven2/org/apache/maven/maven-repository-metadata/3.0/maven-repository-metadata-3.0.jar (30 kB at 289 kB/s)
[INFO] Downloading from central: https://repo.maven.apache.org/maven2/org/sonatype/aether/aether-api/1.7/aether-api-1.7.jar
[INFO] Downloaded from central: https://repo.maven.apache.org/maven2/org/sonatype/aether/aether-spi/1.7/aether-spi-1.7.jar (14 kB at 125 kB/s)
[INFO] Downloading from central: https://repo.maven.apache.org/maven2/org/sonatype/aether/aether-util/1.7/aether-util-1.7.jar
[INFO] Downloaded from central: https://repo.maven.apache.org/maven2/org/apache/maven/maven-aether-provider/3.0/maven-aether-provider-3.0.jar (51 kB at 453 kB/s)
[INFO] Downloading from central: https://repo.maven.apache.org/maven2/org/codehaus/plexus/plexus-interpolation/1.14/plexus-interpolation-1.14.jar
[INFO] Downloaded from central: https://repo.maven.apache.org/maven2/org/apache/maven/maven-settings-builder/3.0/maven-settings-builder-3.0.jar (38 kB at 326 kB/s)
[INFO] Downloaded from central: https://repo.maven.apache.org/maven2/org/sonatype/aether/aether-api/1.7/aether-api-1.7.jar (74 kB at 645 kB/s)
[INFO] Downloading from central: https://repo.maven.apache.org/maven2/org/apache/maven/maven-toolchain/2.2.1/maven-toolchain-2.2.1.jar
[INFO] Downloading from central: https://repo.maven.apache.org/maven2/org/apache/maven/shared/maven-shared-incremental/1.1/maven-shared-incremental-1.1.jar
[INFO] Downloaded from central: https://repo.maven.apache.org/maven2/org/sonatype/aether/aether-util/1.7/aether-util-1.7.jar (108 kB at 915 kB/s)
[INFO] Downloading from central: https://repo.maven.apache.org/maven2/org/codehaus/plexus/plexus-compiler-api/2.7/plexus-compiler-api-2.7.jar
[INFO] Downloaded from central: https://repo.maven.apache.org/maven2/org/sonatype/aether/aether-impl/1.7/aether-impl-1.7.jar (106 kB at 886 kB/s)
[INFO] Downloading from central: https://repo.maven.apache.org/maven2/org/codehaus/plexus/plexus-compiler-manager/2.7/plexus-compiler-manager-2.7.jar
[INFO] Downloaded from central: https://repo.maven.apache.org/maven2/org/codehaus/plexus/plexus-interpolation/1.14/plexus-interpolation-1.14.jar (61 kB at 497 kB/s)
[INFO] Downloading from central: https://repo.maven.apache.org/maven2/org/codehaus/plexus/plexus-compiler-javac/2.7/plexus-compiler-javac-2.7.jar
[INFO] Downloaded from central: https://repo.maven.apache.org/maven2/org/apache/maven/maven-toolchain/2.2.1/maven-toolchain-2.2.1.jar (38 kB at 301 kB/s)
[INFO] Downloaded from central: https://repo.maven.apache.org/maven2/org/codehaus/plexus/plexus-compiler-api/2.7/plexus-compiler-api-2.7.jar (26 kB at 202 kB/s)
[INFO] Downloaded from central: https://repo.maven.apache.org/maven2/org/apache/maven/shared/maven-shared-incremental/1.1/maven-shared-incremental-1.1.jar (14 kB at 105 kB/s)
[INFO] Downloaded from central: https://repo.maven.apache.org/maven2/org/codehaus/plexus/plexus-compiler-manager/2.7/plexus-compiler-manager-2.7.jar (4.7 kB at 36 kB/s)
[INFO] Downloaded from central: https://repo.maven.apache.org/maven2/org/codehaus/plexus/plexus-compiler-javac/2.7/plexus-compiler-javac-2.7.jar (19 kB at 148 kB/s)
[INFO] Changes detected - recompiling the module!
[INFO] Compiling 19 source files to f:\jenkins\jenkins-slave\workspace\4_Detect_Java_8_type_annotations\m\target\classes
[INFO] -------------------------------------------------------------
[ERROR] COMPILATION ERROR : 
[INFO] -------------------------------------------------------------
[ERROR] Source option 6 is no longer supported. Use 7 or later.
[ERROR] Target option 6 is no longer supported. Use 7 or later.
[INFO] 2 errors 
[INFO] -------------------------------------------------------------
[INFO] ------------------------------------------------------------------------
[INFO] BUILD FAILURE
[INFO] ------------------------------------------------------------------------
[INFO] Total time:  14.043 s
[INFO] Finished at: 2019-06-02T19:17:32Z
[INFO] ------------------------------------------------------------------------
[WARNING] The requested profile "run-its" could not be activated because it does not exist.
[INFO] [jenkins-event-spy] Generated F:\jenkins\jenkins-slave\workspace\4_Detect_Java_8_type_annotations@tmp\withMaven8f6d75dd\maven-spy-20190602-191717-8522892898816145173722.log
[ERROR] Failed to execute goal org.apache.maven.plugins:maven-compiler-plugin:3.5.1:compile (default-compile) on project maven-dependency-analyzer: Compilation failure: Compilation failure: 
[ERROR] Source option 6 is no longer supported. Use 7 or later.
[ERROR] Target option 6 is no longer supported. Use 7 or later.
[ERROR] -> [Help 1]
[ERROR] 
[ERROR] To see the full stack trace of the errors, re-run Maven with the -e switch.
[ERROR] Re-run Maven using the -X switch to enable full debug logging.
[ERROR] 
[ERROR] For more information about the errors and possible solutions, please read the following articles:
[ERROR] [Help 1] http://cwiki.apache.org/confluence/display/MAVEN/MojoFailureException
[Pipeline] }
[Pipeline] // dir
[Pipeline] }
[withMaven] Publishers: 
[Pipeline] // withMaven
[Pipeline] echo
[FAILURE-004] hudson.AbortException: script returned exit code 1
[Pipeline] cleanWs
[WS-CLEANUP] Deleting project workspace...
[WS-CLEANUP] Deferred wipeout is used...
[WS-CLEANUP] done
[Pipeline] cleanWs
[WS-CLEANUP] Deleting project workspace...
[WS-CLEANUP] Deferred wipeout is used...
[WS-CLEANUP] done
[Pipeline] }
[Pipeline] // stage
[Pipeline] }
[Pipeline] // node
[Pipeline] }
Failed in branch windows-jdk12
[Pipeline] // parallel
[Pipeline] echo
[FAILURE-003] AbortException hudson.AbortException: script returned exit code 1
[Pipeline] stage
[Pipeline] { (Notifications)
[Pipeline] echo
Build result: FAILURE
[Pipeline] jiraIssueSelector
[Pipeline] jiraComment
[Pipeline] emailext
Mime
  • Unnamed multipart/mixed (inline, None, 0 bytes)
View raw message