maven-notifications mailing list archives

Site index · List index
Message view « Date » · « Thread »
Top « Date » · « Thread »
From Apache Jenkins Server <jenk...@builds.apache.org>
Subject Build failed in Jenkins: Maven TLP » maven-invoker-plugin » MINVOKER-244 #5
Date Tue, 04 Jun 2019 12:06:52 GMT
See https://builds.apache.org/job/maven-box/job/maven-invoker-plugin/job/MINVOKER-244/5/

Changes:

* [MNG-6573] Use Maven 3.6.0 as default
* H39 has weird issues, exclude it for now
* Fix no access to currentBuild.rawBuild
* fixed typo
* Include more recent JDKs

All tests passed

Build log:
[...truncated 17822 lines...]
[INFO] 
[INFO] --- maven-invoker-plugin:3.0.1:verify (integration-test) @ maven-invoker-plugin ---
[INFO] -------------------------------------------------
[INFO] Build Summary:
[INFO]   Passed: 65, Failed: 1, Errors: 0, Skipped: 2
[INFO] -------------------------------------------------
[ERROR] The following builds failed:
[ERROR] *  install-extra-artifacts\pom.xml
[INFO] -------------------------------------------------
[INFO] ------------------------------------------------------------------------
[INFO] BUILD FAILURE
[INFO] ------------------------------------------------------------------------
[INFO] Total time:  14:26 min
[INFO] Finished at: 2019-06-04T12:02:23Z
[INFO] ------------------------------------------------------------------------
[INFO] [jenkins-event-spy] Generated F:\jenkins\jenkins-slave\workspace\aven-invoker-plugin_MINVOKER-244@tmp\withMaven39f2dc61\maven-spy-20190604-114756-44016265159096245732408.log
[ERROR] Failed to execute goal org.apache.maven.plugins:maven-invoker-plugin:3.0.1:verify
(integration-test) on project maven-invoker-plugin: 1 build failed. See console output above
for details. -> [Help 1]
[ERROR] 
[ERROR] To see the full stack trace of the errors, re-run Maven with the -e switch.
[ERROR] Re-run Maven using the -X switch to enable full debug logging.
[ERROR] 
[ERROR] For more information about the errors and possible solutions, please read the following
articles:
[ERROR] [Help 1] http://cwiki.apache.org/confluence/display/MAVEN/MojoFailureException
[Pipeline] }
[Pipeline] // dir
[Pipeline] }
[withMaven] invokerPublisher - Archive invoker results for Maven artifact MavenArtifact{org.apache.maven.plugins:maven-invoker-plugin:maven-plugin:3.1.1-SNAPSHOT(version:
3.1.1-SNAPSHOT, snapshot:false) } generated by PluginInvocation{org.apache.maven.plugins:maven-invoker-plugin:3.0.1@integration-test
 integration-test}: m\target\invoker-reports\*.xml
[withMaven] junitPublisher - Archive test results for Maven artifact org.apache.maven.plugins:maven-invoker-plugin:maven-plugin:3.1.1-SNAPSHOT
generated by maven-surefire-plugin:test (default-test): m\target\surefire-reports\*.xml
Recording test results
[withMaven] Publishers: Invoker Publisher: 26208 ms, Junit Publisher: 288 ms
[Pipeline] // withMaven
[Pipeline] echo
[FAILURE-004] hudson.AbortException: script returned exit code 1
[Pipeline] cleanWs
[WS-CLEANUP] Deleting project workspace...
[WS-CLEANUP] Deferred wipeout is used...
[WS-CLEANUP] done
[Pipeline] cleanWs
[WS-CLEANUP] Deleting project workspace...
[WS-CLEANUP] Deferred wipeout is used...
[WS-CLEANUP] done
[Pipeline] }
[Pipeline] // stage
[Pipeline] }
[Pipeline] // node
[Pipeline] }
Failed in branch windows-jdk8
[INFO]           script-global-vars\pom.xml ....................... SUCCESS (14.9 s)
[INFO] Building: script-interpreter-detection\pom.xml
[INFO] run post-build script verify.bsh
[INFO]           script-interpreter-detection\pom.xml ............. SUCCESS (14.6 s)
[INFO] Building: script-verify-xml\pom.xml
[INFO] run post-build script verify.groovy
[INFO]           script-verify-xml\pom.xml ........................ SUCCESS (6.2 s)
[INFO] Building: selector-conditions\pom.xml
[INFO] run pre-build script setup.groovy
[withMaven] junitPublisher - Archive test results for Maven artifact org.apache.maven.plugins:maven-invoker-plugin:maven-plugin:3.1.1-SNAPSHOT
generated by maven-surefire-plugin:test (default-test): m\target\surefire-reports\*.xml
Recording test results
[withMaven] Publishers: Pipeline Graph Publisher: 1 ms, Invoker Publisher: 31699 ms, Junit
Publisher: 287 ms
[Pipeline] // withMaven
[Pipeline] echo
[FAILURE-004] hudson.AbortException: script returned exit code 1
[Pipeline] cleanWs
[WS-CLEANUP] Deleting project workspace...
[WS-CLEANUP] Deferred wipeout is used...
[WS-CLEANUP] done
[Pipeline] cleanWs
[WS-CLEANUP] Deleting project workspace...
[WS-CLEANUP] Deferred wipeout is used...
[WS-CLEANUP] done
[Pipeline] }
[Pipeline] // stage
[Pipeline] }
[Pipeline] // node
[Pipeline] }
Failed in branch windows-jdk11
[INFO] run post-build script verify.bsh
[INFO]           selector-conditions\pom.xml ...................... SUCCESS (17.6 s)
[INFO] Building: selector-scripts\pom.xml
[INFO] run pre-build script setup.groovy
[INFO] run post-build script verify.bsh
[INFO]           selector-scripts\pom.xml ......................... SUCCESS (13.1 s)
[INFO] Building: settings-auto-exclude\pom.xml
[INFO]           settings-auto-exclude\pom.xml .................... SUCCESS (9.4 s)
[INFO] Building: settings-inherit\pom.xml
[INFO]           settings-inherit\pom.xml ......................... SUCCESS (11.1 s)
[INFO] Building: settings-merge\pom.xml
[INFO]           settings-merge\pom.xml ........................... SKIPPED due to JRE version
[INFO] Building: settings-merge-multiexecutions\pom.xml
[INFO]           settings-merge-multiexecutions\pom.xml ........... SUCCESS (17.4 s)
[INFO] Building: settings-merge_jdk9+\pom.xml
[INFO]           settings-merge_jdk9+\pom.xml ..................... SUCCESS (17.2 s)
[INFO] Building: settings-override\pom.xml
[INFO]           settings-override\pom.xml ........................ SUCCESS (11.4 s)
[INFO] Building: skip-install\pom.xml
[INFO] run post-build script verify.bsh
[INFO]           skip-install\pom.xml ............................. SUCCESS (5.6 s)
[INFO] Building: skip-run\pom.xml
[INFO] run post-build script verify.bsh
[INFO]           skip-run\pom.xml ................................. SUCCESS (5.4 s)
[INFO] Building: spaces-should-work_non-windows\pom.xml
[INFO]           spaces-should-work_non-windows\pom.xml ........... SKIPPED due to OS
[INFO] Building: spaces-should-work_windows\pom.xml
[INFO] run pre-build script setup.groovy
[INFO]           spaces-should-work_windows\pom.xml ............... SUCCESS (11.6 s)
[INFO] Building: special-characters-should-work\pom.xml
[INFO] run pre-build script setup.groovy
[INFO]           special-characters-should-work\pom.xml ........... SUCCESS (11.8 s)
[INFO] Building: staging-dependencies\pom.xml
[INFO] run post-build script verify.bsh
[INFO]           staging-dependencies\pom.xml ..................... SUCCESS (12.0 s)
[INFO] Building: staging-pom\pom.xml
[INFO] run post-build script verify.bsh
[INFO]           staging-pom\pom.xml .............................. SUCCESS (6.5 s)
[INFO] Building: staging-reactor\pom.xml
[INFO] run post-build script verify.bsh
[INFO]           staging-reactor\pom.xml .......................... SUCCESS (9.9 s)
[INFO] Building: wrongPropertyInterpolation\pom.xml
[INFO]           wrongPropertyInterpolation\pom.xml ............... SUCCESS (31.4 s)
[INFO] 
[INFO] --- maven-checkstyle-plugin:3.0.0:check (checkstyle-check) @ maven-invoker-plugin ---
[INFO] Downloading from central: https://repo.maven.apache.org/maven2/org/apache/maven/shared/maven-shared-resources/2/maven-shared-resources-2.pom
[INFO] Downloaded from central: https://repo.maven.apache.org/maven2/org/apache/maven/shared/maven-shared-resources/2/maven-shared-resources-2.pom
(3.0 kB at 33 kB/s)
[INFO] Downloading from central: https://repo.maven.apache.org/maven2/org/codehaus/plexus/plexus-utils/3.0.10/plexus-utils-3.0.10.pom
[INFO] Downloaded from central: https://repo.maven.apache.org/maven2/org/codehaus/plexus/plexus-utils/3.0.10/plexus-utils-3.0.10.pom
(3.1 kB at 137 kB/s)
[INFO] Downloading from central: https://repo.maven.apache.org/maven2/org/codehaus/plexus/plexus/3.3/plexus-3.3.pom
[INFO] Downloaded from central: https://repo.maven.apache.org/maven2/org/codehaus/plexus/plexus/3.3/plexus-3.3.pom
(20 kB at 711 kB/s)
[INFO] Downloading from central: https://repo.maven.apache.org/maven2/org/apache/maven/doxia/doxia-integration-tools/1.6/doxia-integration-tools-1.6.pom
[INFO] Downloaded from central: https://repo.maven.apache.org/maven2/org/apache/maven/doxia/doxia-integration-tools/1.6/doxia-integration-tools-1.6.pom
(7.0 kB at 464 kB/s)
[INFO] Downloading from central: https://repo.maven.apache.org/maven2/org/apache/maven/doxia/doxia-tools/3/doxia-tools-3.pom
[INFO] Downloaded from central: https://repo.maven.apache.org/maven2/org/apache/maven/doxia/doxia-tools/3/doxia-tools-3.pom
(9.9 kB at 523 kB/s)
[INFO] Downloading from central: https://repo.maven.apache.org/maven2/org/codehaus/plexus/plexus-resources/1.1.0/plexus-resources-1.1.0.pom
[INFO] Downloaded from central: https://repo.maven.apache.org/maven2/org/codehaus/plexus/plexus-resources/1.1.0/plexus-resources-1.1.0.pom
(3.2 kB at 138 kB/s)
[INFO] Downloading from central: https://repo.maven.apache.org/maven2/com/puppycrawl/tools/checkstyle/6.18/checkstyle-6.18.pom
[INFO] Downloaded from central: https://repo.maven.apache.org/maven2/com/puppycrawl/tools/checkstyle/6.18/checkstyle-6.18.pom
(71 kB at 2.0 MB/s)
[INFO] Downloading from central: https://repo.maven.apache.org/maven2/antlr/antlr/2.7.7/antlr-2.7.7.pom
[INFO] Downloaded from central: https://repo.maven.apache.org/maven2/antlr/antlr/2.7.7/antlr-2.7.7.pom
(632 B at 33 kB/s)
[INFO] Downloading from central: https://repo.maven.apache.org/maven2/org/antlr/antlr4-runtime/4.5.3/antlr4-runtime-4.5.3.pom
[INFO] Downloaded from central: https://repo.maven.apache.org/maven2/org/antlr/antlr4-runtime/4.5.3/antlr4-runtime-4.5.3.pom
(2.3 kB at 70 kB/s)
[INFO] Downloading from central: https://repo.maven.apache.org/maven2/org/antlr/antlr4-master/4.5.3/antlr4-master-4.5.3.pom
[INFO] Downloaded from central: https://repo.maven.apache.org/maven2/org/antlr/antlr4-master/4.5.3/antlr4-master-4.5.3.pom
(3.7 kB at 147 kB/s)
[INFO] Downloading from central: https://repo.maven.apache.org/maven2/commons-beanutils/commons-beanutils/1.9.2/commons-beanutils-1.9.2.pom
[INFO] Downloaded from central: https://repo.maven.apache.org/maven2/commons-beanutils/commons-beanutils/1.9.2/commons-beanutils-1.9.2.pom
(14 kB at 447 kB/s)
[INFO] Downloading from central: https://repo.maven.apache.org/maven2/org/apache/commons/commons-parent/33/commons-parent-33.pom
[INFO] Downloaded from central: https://repo.maven.apache.org/maven2/org/apache/commons/commons-parent/33/commons-parent-33.pom
(53 kB at 1.4 MB/s)
[INFO] Downloading from central: https://repo.maven.apache.org/maven2/commons-cli/commons-cli/1.3.1/commons-cli-1.3.1.pom
[INFO] Downloaded from central: https://repo.maven.apache.org/maven2/commons-cli/commons-cli/1.3.1/commons-cli-1.3.1.pom
(10 kB at 192 kB/s)
[INFO] Downloading from central: https://repo.maven.apache.org/maven2/com/google/guava/guava/19.0/guava-19.0.pom
[INFO] Downloaded from central: https://repo.maven.apache.org/maven2/com/google/guava/guava/19.0/guava-19.0.pom
(6.8 kB at 261 kB/s)
[INFO] Downloading from central: https://repo.maven.apache.org/maven2/com/google/guava/guava-parent/19.0/guava-parent-19.0.pom
[INFO] Downloaded from central: https://repo.maven.apache.org/maven2/com/google/guava/guava-parent/19.0/guava-parent-19.0.pom
(9.9 kB at 429 kB/s)
[INFO] Downloading from central: https://repo.maven.apache.org/maven2/org/sonatype/oss/oss-parent/7/oss-parent-7.pom
[INFO] Downloaded from central: https://repo.maven.apache.org/maven2/org/sonatype/oss/oss-parent/7/oss-parent-7.pom
(4.8 kB at 210 kB/s)
[INFO] Downloading from central: https://repo.maven.apache.org/maven2/javax/xml/bind/jaxb-api/2.3.0/jaxb-api-2.3.0.pom
[INFO] Downloaded from central: https://repo.maven.apache.org/maven2/javax/xml/bind/jaxb-api/2.3.0/jaxb-api-2.3.0.pom
(23 kB at 821 kB/s)
[INFO] Downloading from central: https://repo.maven.apache.org/maven2/javax/xml/bind/jaxb-api-parent/2.3.0/jaxb-api-parent-2.3.0.pom
[INFO] Downloaded from central: https://repo.maven.apache.org/maven2/javax/xml/bind/jaxb-api-parent/2.3.0/jaxb-api-parent-2.3.0.pom
(5.6 kB at 217 kB/s)
[INFO] Downloading from central: https://repo.maven.apache.org/maven2/net/java/jvnet-parent/5/jvnet-parent-5.pom
[INFO] Downloaded from central: https://repo.maven.apache.org/maven2/net/java/jvnet-parent/5/jvnet-parent-5.pom
(8.9 kB at 261 kB/s)
[INFO] Downloading from central: https://repo.maven.apache.org/maven2/commons-digester/commons-digester/1.6/commons-digester-1.6.jar
[INFO] Downloading from central: https://repo.maven.apache.org/maven2/commons-logging/commons-logging/1.0.4/commons-logging-1.0.4.jar
[INFO] Downloading from central: https://repo.maven.apache.org/maven2/org/apache/maven/shared/maven-shared-resources/2/maven-shared-resources-2.jar
[INFO] Downloading from central: https://repo.maven.apache.org/maven2/org/apache/maven/doxia/doxia-integration-tools/1.6/doxia-integration-tools-1.6.jar
[INFO] Downloading from central: https://repo.maven.apache.org/maven2/org/apache/maven/doxia/doxia-core/1.2/doxia-core-1.2.jar
[INFO] Downloaded from central: https://repo.maven.apache.org/maven2/org/apache/maven/shared/maven-shared-resources/2/maven-shared-resources-2.jar
(13 kB at 109 kB/s)
[INFO] Downloading from central: https://repo.maven.apache.org/maven2/commons-io/commons-io/1.4/commons-io-1.4.jar
[INFO] Downloaded from central: https://repo.maven.apache.org/maven2/org/apache/maven/doxia/doxia-integration-tools/1.6/doxia-integration-tools-1.6.jar
(45 kB at 360 kB/s)
[INFO] Downloading from central: https://repo.maven.apache.org/maven2/org/codehaus/plexus/plexus-resources/1.1.0/plexus-resources-1.1.0.jar
[INFO] Downloaded from central: https://repo.maven.apache.org/maven2/org/codehaus/plexus/plexus-resources/1.1.0/plexus-resources-1.1.0.jar
(23 kB at 77 kB/s)
[INFO] Downloading from central: https://repo.maven.apache.org/maven2/com/puppycrawl/tools/checkstyle/6.18/checkstyle-6.18.jar
[INFO] Downloaded from central: https://repo.maven.apache.org/maven2/commons-digester/commons-digester/1.6/commons-digester-1.6.jar
(168 kB at 483 kB/s)
[INFO] Downloading from central: https://repo.maven.apache.org/maven2/antlr/antlr/2.7.7/antlr-2.7.7.jar
[INFO] Downloaded from central: https://repo.maven.apache.org/maven2/com/puppycrawl/tools/checkstyle/6.18/checkstyle-6.18.jar
(1.2 MB at 3.1 MB/s)
[INFO] Downloading from central: https://repo.maven.apache.org/maven2/org/antlr/antlr4-runtime/4.5.3/antlr4-runtime-4.5.3.jar
[INFO] Downloaded from central: https://repo.maven.apache.org/maven2/commons-logging/commons-logging/1.0.4/commons-logging-1.0.4.jar
(38 kB at 89 kB/s)
[INFO] Downloaded from central: https://repo.maven.apache.org/maven2/antlr/antlr/2.7.7/antlr-2.7.7.jar
(445 kB at 1.0 MB/s)
[INFO] Downloading from central: https://repo.maven.apache.org/maven2/commons-beanutils/commons-beanutils/1.9.2/commons-beanutils-1.9.2.jar
[INFO] Downloading from central: https://repo.maven.apache.org/maven2/commons-cli/commons-cli/1.3.1/commons-cli-1.3.1.jar
[INFO] Downloaded from central: https://repo.maven.apache.org/maven2/commons-cli/commons-cli/1.3.1/commons-cli-1.3.1.jar
(53 kB at 100 kB/s)
[INFO] Downloading from central: https://repo.maven.apache.org/maven2/com/google/guava/guava/19.0/guava-19.0.jar
[INFO] Downloaded from central: https://repo.maven.apache.org/maven2/org/apache/maven/doxia/doxia-core/1.2/doxia-core-1.2.jar
(154 kB at 250 kB/s)
[INFO] Downloading from central: https://repo.maven.apache.org/maven2/commons-lang/commons-lang/2.1/commons-lang-2.1.jar
[INFO] Downloaded from central: https://repo.maven.apache.org/maven2/com/google/guava/guava/19.0/guava-19.0.jar
(2.3 MB at 3.5 MB/s)
[INFO] Downloading from central: https://repo.maven.apache.org/maven2/javax/xml/bind/jaxb-api/2.3.0/jaxb-api-2.3.0.jar
[INFO] Downloaded from central: https://repo.maven.apache.org/maven2/commons-lang/commons-lang/2.1/commons-lang-2.1.jar
(208 kB at 316 kB/s)
[INFO] Downloaded from central: https://repo.maven.apache.org/maven2/commons-io/commons-io/1.4/commons-io-1.4.jar
(109 kB at 164 kB/s)
[INFO] Downloaded from central: https://repo.maven.apache.org/maven2/javax/xml/bind/jaxb-api/2.3.0/jaxb-api-2.3.0.jar
(126 kB at 146 kB/s)
[INFO] Downloaded from central: https://repo.maven.apache.org/maven2/org/antlr/antlr4-runtime/4.5.3/antlr4-runtime-4.5.3.jar
(302 kB at 316 kB/s)
[INFO] Downloaded from central: https://repo.maven.apache.org/maven2/commons-beanutils/commons-beanutils/1.9.2/commons-beanutils-1.9.2.jar
(234 kB at 222 kB/s)
[INFO] There are 2 errors reported by Checkstyle 6.18 with config/maven_checks.xml ruleset.
[INFO] Ignored 2 errors, 0 violation remaining.
[INFO] 
[INFO] --- maven-invoker-plugin:3.0.1:verify (integration-test) @ maven-invoker-plugin ---
[INFO] -------------------------------------------------
[INFO] Build Summary:
[INFO]   Passed: 64, Failed: 2, Errors: 0, Skipped: 2
[INFO] -------------------------------------------------
[ERROR] The following builds failed:
[ERROR] *  install-extra-artifacts\pom.xml
[ERROR] *  postbuild-executed-only-once\pom.xml
[INFO] -------------------------------------------------
[INFO] ------------------------------------------------------------------------
[INFO] BUILD FAILURE
[INFO] ------------------------------------------------------------------------
[INFO] Total time:  16:25 min
[INFO] Finished at: 2019-06-04T05:06:06-07:00
[INFO] ------------------------------------------------------------------------
[INFO] [jenkins-event-spy] Generated F:\jenkins\jenkins-slave\workspace\aven-invoker-plugin_MINVOKER-244@tmp\withMavenc2e92b1d\maven-spy-20190604-044940-21814356275473987298758.log
[ERROR] Failed to execute goal org.apache.maven.plugins:maven-invoker-plugin:3.0.1:verify
(integration-test) on project maven-invoker-plugin: 2 builds failed. See console output above
for details. -> [Help 1]
[ERROR] 
[ERROR] To see the full stack trace of the errors, re-run Maven with the -e switch.
[ERROR] Re-run Maven using the -X switch to enable full debug logging.
[ERROR] 
[ERROR] For more information about the errors and possible solutions, please read the following
articles:
[ERROR] [Help 1] http://cwiki.apache.org/confluence/display/MAVEN/MojoFailureException
[Pipeline] }
[Pipeline] // dir
[Pipeline] }
[withMaven] invokerPublisher - Archive invoker results for Maven artifact MavenArtifact{org.apache.maven.plugins:maven-invoker-plugin:maven-plugin:3.1.1-SNAPSHOT(version:
3.1.1-SNAPSHOT, snapshot:false) } generated by PluginInvocation{org.apache.maven.plugins:maven-invoker-plugin:3.0.1@integration-test
 integration-test}: m\target\invoker-reports\*.xml
[withMaven] junitPublisher - Archive test results for Maven artifact org.apache.maven.plugins:maven-invoker-plugin:maven-plugin:3.1.1-SNAPSHOT
generated by maven-surefire-plugin:test (default-test): m\target\surefire-reports\*.xml
Recording test results
[withMaven] Publishers: Pipeline Graph Publisher: 1 ms, Invoker Publisher: 41888 ms, Junit
Publisher: 300 ms
[Pipeline] // withMaven
[Pipeline] echo
[FAILURE-004] hudson.AbortException: script returned exit code 1
[Pipeline] cleanWs
[WS-CLEANUP] Deleting project workspace...
[WS-CLEANUP] Deferred wipeout is used...
[WS-CLEANUP] done
[Pipeline] cleanWs
[WS-CLEANUP] Deleting project workspace...
[WS-CLEANUP] Deferred wipeout is used...
[WS-CLEANUP] done
[Pipeline] }
[Pipeline] // stage
[Pipeline] }
[Pipeline] // node
[Pipeline] }
Failed in branch windows-jdk12
[Pipeline] // parallel
[Pipeline] echo
[FAILURE-003] AbortException hudson.AbortException: script returned exit code 1
[Pipeline] stage
[Pipeline] { (Notifications)
[Pipeline] echo
Build result: FAILURE
[Pipeline] jiraIssueSelector
[Pipeline] jiraComment
[Pipeline] emailext
Mime
  • Unnamed multipart/mixed (inline, None, 0 bytes)
View raw message