maven-notifications mailing list archives

Site index · List index
Message view « Date » · « Thread »
Top « Date » · « Thread »
From Apache Jenkins Server <jenk...@builds.apache.org>
Subject Build failed in Jenkins: Maven TLP » maven-surefire » maven2surefire-jvm-communication #3
Date Fri, 12 Jul 2019 03:45:37 GMT
See https://builds.apache.org/job/maven-box/job/maven-surefire/job/maven2surefire-jvm-communication/3/

Changes:

* improved poms
* fixed JaCoCo coverage in the package 'org.apache.maven.surefire.booter'
* improved poms
* fixed JaCoCo coverage in the package 'org.apache.maven.surefire.booter'
* improved poms
* fixed JaCoCo coverage in the package 'org.apache.maven.surefire.booter'
* improved poms
* fixed JaCoCo coverage in the package 'org.apache.maven.surefire.booter'

All tests passed

Build log:
[...truncated 48033 lines...]
[2019-07-12T03:33:26.748Z] [JaCoCo plugin]  - /home/jenkins/jenkins-slave/workspace/maven2surefire-jvm-communication@2/surefire-logger-api/target/classes
6 files
[2019-07-12T03:33:26.908Z] [JaCoCo plugin]  - /home/jenkins/jenkins-slave/workspace/maven2surefire-jvm-communication@2/surefire-providers/common-java5/target/classes
5 files
[2019-07-12T03:33:27.078Z] [JaCoCo plugin]  - /home/jenkins/jenkins-slave/workspace/maven2surefire-jvm-communication@2/surefire-providers/common-junit3/target/classes
2 files
[2019-07-12T03:33:27.244Z] [JaCoCo plugin]  - /home/jenkins/jenkins-slave/workspace/maven2surefire-jvm-communication@2/surefire-providers/common-junit4/target/classes
13 files
[2019-07-12T03:33:27.407Z] [JaCoCo plugin]  - /home/jenkins/jenkins-slave/workspace/maven2surefire-jvm-communication@2/surefire-providers/common-junit48/target/classes
10 files
[2019-07-12T03:33:27.567Z] [JaCoCo plugin]  - /home/jenkins/jenkins-slave/workspace/maven2surefire-jvm-communication@2/surefire-providers/surefire-junit-platform/target/classes
5 files
[2019-07-12T03:33:27.722Z] [JaCoCo plugin]  - /home/jenkins/jenkins-slave/workspace/maven2surefire-jvm-communication@2/surefire-providers/surefire-junit3/target/classes
7 files
[2019-07-12T03:33:27.903Z] [JaCoCo plugin]  - /home/jenkins/jenkins-slave/workspace/maven2surefire-jvm-communication@2/surefire-providers/surefire-junit4/target/classes
4 files
[2019-07-12T03:33:28.058Z] [JaCoCo plugin]  - /home/jenkins/jenkins-slave/workspace/maven2surefire-jvm-communication@2/surefire-providers/surefire-junit47/target/classes
53 files
[2019-07-12T03:33:28.223Z] [JaCoCo plugin]  - /home/jenkins/jenkins-slave/workspace/maven2surefire-jvm-communication@2/surefire-providers/surefire-testng-utils/target/classes
6 files
[2019-07-12T03:33:28.380Z] [JaCoCo plugin]  - /home/jenkins/jenkins-slave/workspace/maven2surefire-jvm-communication@2/surefire-providers/surefire-testng/target/classes
23 files
[2019-07-12T03:33:29.287Z] [JaCoCo plugin]  - /home/jenkins/jenkins-slave/workspace/maven2surefire-jvm-communication@2/surefire-report-parser/target/classes
4 files
[2019-07-12T03:33:29.287Z] [JaCoCo plugin] Saving matched source directories for source-pattern:
**/maven-failsafe-plugin/src/main/java,**/maven-surefire-common/src/main/java,**/maven-surefire-plugin/src/main/java,**/maven-surefire-report-plugin/src/main/java,**/surefire-api/src/main/java,**/surefire-booter/src/main/java,**/surefire-grouper/src/main/java,**/surefire-its/src/main/java,**/surefire-logger-api/src/main/java,**/surefire-providers/**/src/main/java,**/surefire-report-parser/src/main/java:

[2019-07-12T03:33:29.287Z] [JaCoCo plugin] Source Inclusions: **/*.java
[2019-07-12T03:33:29.447Z] [JaCoCo plugin] Source Exclusions: 
[2019-07-12T03:33:29.648Z] [JaCoCo plugin] - /home/jenkins/jenkins-slave/workspace/maven2surefire-jvm-communication@2/maven-failsafe-plugin/src/main/java
3 files
[2019-07-12T03:33:29.802Z] [JaCoCo plugin] - /home/jenkins/jenkins-slave/workspace/maven2surefire-jvm-communication@2/maven-surefire-common/src/main/java
90 files
[2019-07-12T03:33:29.960Z] [JaCoCo plugin] - /home/jenkins/jenkins-slave/workspace/maven2surefire-jvm-communication@2/maven-surefire-plugin/src/main/java
1 files
[2019-07-12T03:33:30.150Z] [JaCoCo plugin] - /home/jenkins/jenkins-slave/workspace/maven2surefire-jvm-communication@2/maven-surefire-report-plugin/src/main/java
7 files
[2019-07-12T03:33:30.329Z] [JaCoCo plugin] - /home/jenkins/jenkins-slave/workspace/maven2surefire-jvm-communication@2/surefire-api/src/main/java
74 files
[2019-07-12T03:33:30.483Z] [JaCoCo plugin] - /home/jenkins/jenkins-slave/workspace/maven2surefire-jvm-communication@2/surefire-booter/src/main/java
29 files
[2019-07-12T03:33:30.638Z] [JaCoCo plugin] - /home/jenkins/jenkins-slave/workspace/maven2surefire-jvm-communication@2/surefire-grouper/src/main/java
6 files
[2019-07-12T03:33:30.793Z] [JaCoCo plugin] - /home/jenkins/jenkins-slave/workspace/maven2surefire-jvm-communication@2/surefire-logger-api/src/main/java
6 files
[2019-07-12T03:33:30.947Z] [JaCoCo plugin] - /home/jenkins/jenkins-slave/workspace/maven2surefire-jvm-communication@2/surefire-providers/common-java5/src/main/java
5 files
[2019-07-12T03:33:31.104Z] [JaCoCo plugin] - /home/jenkins/jenkins-slave/workspace/maven2surefire-jvm-communication@2/surefire-providers/common-junit3/src/main/java
2 files
[2019-07-12T03:33:31.260Z] [JaCoCo plugin] - /home/jenkins/jenkins-slave/workspace/maven2surefire-jvm-communication@2/surefire-providers/common-junit4/src/main/java
10 files
[2019-07-12T03:33:31.416Z] [JaCoCo plugin] - /home/jenkins/jenkins-slave/workspace/maven2surefire-jvm-communication@2/surefire-providers/common-junit48/src/main/java
10 files
[2019-07-12T03:33:31.573Z] [JaCoCo plugin] - /home/jenkins/jenkins-slave/workspace/maven2surefire-jvm-communication@2/surefire-providers/surefire-junit-platform/src/main/java
4 files
[2019-07-12T03:33:31.727Z] [JaCoCo plugin] - /home/jenkins/jenkins-slave/workspace/maven2surefire-jvm-communication@2/surefire-providers/surefire-junit3/src/main/java
6 files
[2019-07-12T03:33:31.903Z] [JaCoCo plugin] - /home/jenkins/jenkins-slave/workspace/maven2surefire-jvm-communication@2/surefire-providers/surefire-junit4/src/main/java
2 files
[2019-07-12T03:33:32.059Z] [JaCoCo plugin] - /home/jenkins/jenkins-slave/workspace/maven2surefire-jvm-communication@2/surefire-providers/surefire-junit47/src/main/java
39 files
[2019-07-12T03:33:32.221Z] [JaCoCo plugin] - /home/jenkins/jenkins-slave/workspace/maven2surefire-jvm-communication@2/surefire-providers/surefire-testng-utils/src/main/java
6 files
[2019-07-12T03:33:32.376Z] [JaCoCo plugin] - /home/jenkins/jenkins-slave/workspace/maven2surefire-jvm-communication@2/surefire-providers/surefire-testng/src/main/java
17 files
[2019-07-12T03:33:32.376Z] [JaCoCo plugin] - /home/jenkins/jenkins-slave/workspace/maven2surefire-jvm-communication@2/surefire-report-parser/src/main/java
4 files
[2019-07-12T03:33:32.376Z] [JaCoCo plugin] Loading inclusions files..
[2019-07-12T03:33:32.376Z] [JaCoCo plugin] inclusions: []
[2019-07-12T03:33:32.376Z] [JaCoCo plugin] exclusions: []
[2019-07-12T03:33:32.455Z] [JaCoCo plugin] Thresholds: JacocoHealthReportThresholds [minClass=0,
maxClass=0, minMethod=0, maxMethod=0, minLine=0, maxLine=0, minBranch=0, maxBranch=0, minInstruction=0,
maxInstruction=0, minComplexity=0, maxComplexity=0]
[2019-07-12T03:33:32.455Z] [JaCoCo plugin] Publishing the results..
[2019-07-12T03:33:32.523Z] [JaCoCo plugin] Loading packages..
[2019-07-12T03:33:32.529Z] [JaCoCo plugin] Done.
[2019-07-12T03:33:32.529Z] [JaCoCo plugin] Overall coverage: class: 67, method: 54, line:
53, branch: 42, instruction: 53
[Pipeline] junit
[2019-07-12T03:33:32.701Z] Recording test results
[Pipeline] cleanWs
[2019-07-12T03:33:34.225Z] [WS-CLEANUP] Deleting project workspace...
[2019-07-12T03:33:34.226Z] [WS-CLEANUP] Deferred wipeout is used...
[2019-07-12T03:33:34.555Z] [WS-CLEANUP] done
[Pipeline] }
[Pipeline] // ws
[Pipeline] }
[Pipeline] // timestamps
[Pipeline] }
[Pipeline] // node
[Pipeline] }
[2019-07-12T03:33:38.586Z] [INFO] Tests run: 4, Failures: 0, Errors: 0, Skipped: 0, Time elapsed:
31.625 s - in org.apache.maven.surefire.its.jiras.Surefire141PluggableProvidersIT
[2019-07-12T03:33:38.587Z] [INFO] Running org.apache.maven.surefire.its.jiras.Surefire146ForkPerTestNoSetupIT
[2019-07-12T03:33:40.859Z] [INFO] Tests run: 1, Failures: 0, Errors: 0, Skipped: 0, Time elapsed:
5.964 s - in org.apache.maven.surefire.its.jiras.Surefire146ForkPerTestNoSetupIT
[2019-07-12T03:33:40.859Z] [INFO] Running org.apache.maven.surefire.its.jiras.Surefire1490ReportTitleDescriptionIT
[2019-07-12T03:34:10.041Z] [INFO] Tests run: 2, Failures: 0, Errors: 0, Skipped: 0, Time elapsed:
28.875 s - in org.apache.maven.surefire.its.jiras.Surefire1490ReportTitleDescriptionIT
[2019-07-12T03:34:10.041Z] [INFO] Running org.apache.maven.surefire.its.jiras.Surefire1534ReuseForksFalseWithJavaModuleIT
[2019-07-12T03:34:28.042Z] [INFO] Tests run: 3, Failures: 0, Errors: 0, Skipped: 0, Time elapsed:
18.07 s - in org.apache.maven.surefire.its.jiras.Surefire1534ReuseForksFalseWithJavaModuleIT
[2019-07-12T03:34:28.042Z] [INFO] Running org.apache.maven.surefire.its.jiras.Surefire1535TestNGParallelSuitesIT
[2019-07-12T03:34:57.090Z] [INFO] Tests run: 4, Failures: 0, Errors: 0, Skipped: 0, Time elapsed:
28.712 s - in org.apache.maven.surefire.its.jiras.Surefire1535TestNGParallelSuitesIT
[2019-07-12T03:34:57.090Z] [INFO] Running org.apache.maven.surefire.its.jiras.Surefire1585IT
[2019-07-12T03:35:10.114Z] [INFO] Tests run: 2, Failures: 0, Errors: 0, Skipped: 0, Time elapsed:
14.006 s - in org.apache.maven.surefire.its.jiras.Surefire1585IT
[2019-07-12T03:35:10.114Z] [INFO] Running org.apache.maven.surefire.its.jiras.Surefire162CharsetProviderIT
[2019-07-12T03:35:15.317Z] [INFO] Tests run: 1, Failures: 0, Errors: 0, Skipped: 0, Time elapsed:
5.289 s - in org.apache.maven.surefire.its.jiras.Surefire162CharsetProviderIT
[2019-07-12T03:35:15.317Z] [INFO] Running org.apache.maven.surefire.its.jiras.Surefire224WellFormedXmlFailuresIT
[2019-07-12T03:35:21.213Z] [INFO] Tests run: 1, Failures: 0, Errors: 0, Skipped: 0, Time elapsed:
5.33 s - in org.apache.maven.surefire.its.jiras.Surefire224WellFormedXmlFailuresIT
[2019-07-12T03:35:21.213Z] [INFO] Running org.apache.maven.surefire.its.jiras.Surefire257NotRerunningTestsIT
[2019-07-12T03:35:28.962Z] [INFO] Tests run: 1, Failures: 0, Errors: 0, Skipped: 0, Time elapsed:
7.387 s - in org.apache.maven.surefire.its.jiras.Surefire257NotRerunningTestsIT
[2019-07-12T03:35:28.962Z] [INFO] Running org.apache.maven.surefire.its.jiras.Surefire260TestWithIdenticalNamesIT
[2019-07-12T03:35:41.974Z] [INFO] Tests run: 1, Failures: 0, Errors: 0, Skipped: 0, Time elapsed:
13.181 s - in org.apache.maven.surefire.its.jiras.Surefire260TestWithIdenticalNamesIT
[2019-07-12T03:35:41.974Z] [INFO] Running org.apache.maven.surefire.its.jiras.Surefire34SecurityManagerIT
[2019-07-12T03:35:52.988Z] [INFO] Tests run: 2, Failures: 0, Errors: 0, Skipped: 0, Time elapsed:
10.993 s - in org.apache.maven.surefire.its.jiras.Surefire34SecurityManagerIT
[2019-07-12T03:35:52.988Z] [INFO] Running org.apache.maven.surefire.its.jiras.Surefire376TestNgAfterSuiteFailureIT
[2019-07-12T03:35:58.250Z] [INFO] Tests run: 1, Failures: 0, Errors: 0, Skipped: 0, Time elapsed:
5.423 s - in org.apache.maven.surefire.its.jiras.Surefire376TestNgAfterSuiteFailureIT
[2019-07-12T03:35:58.251Z] [INFO] Running org.apache.maven.surefire.its.jiras.Surefire377TestNgAndJUnitTogetherIT
[2019-07-12T03:36:09.272Z] [INFO] Tests run: 2, Failures: 0, Errors: 0, Skipped: 0, Time elapsed:
10.723 s - in org.apache.maven.surefire.its.jiras.Surefire377TestNgAndJUnitTogetherIT
[2019-07-12T03:36:09.272Z] [INFO] Running org.apache.maven.surefire.its.jiras.Surefire408ManualProviderSelectionIT
[2019-07-12T03:36:14.475Z] [INFO] Tests run: 1, Failures: 0, Errors: 0, Skipped: 0, Time elapsed:
5.73 s - in org.apache.maven.surefire.its.jiras.Surefire408ManualProviderSelectionIT
[2019-07-12T03:36:14.475Z] [INFO] Running org.apache.maven.surefire.its.jiras.Surefire42NotExtendingTestCaseIT
[2019-07-12T03:36:19.680Z] [INFO] Tests run: 1, Failures: 0, Errors: 0, Skipped: 0, Time elapsed:
5.447 s - in org.apache.maven.surefire.its.jiras.Surefire42NotExtendingTestCaseIT
[2019-07-12T03:36:19.680Z] [INFO] Running org.apache.maven.surefire.its.jiras.Surefire44InnerClassTestIT
[2019-07-12T03:36:24.888Z] [INFO] Tests run: 1, Failures: 0, Errors: 0, Skipped: 0, Time elapsed:
5.513 s - in org.apache.maven.surefire.its.jiras.Surefire44InnerClassTestIT
[2019-07-12T03:36:24.888Z] [INFO] Running org.apache.maven.surefire.its.jiras.Surefire500PuzzlingErrorIT
[2019-07-12T03:36:31.290Z] [INFO] Tests run: 1, Failures: 0, Errors: 0, Skipped: 0, Time elapsed:
5.386 s - in org.apache.maven.surefire.its.jiras.Surefire500PuzzlingErrorIT
[2019-07-12T03:36:31.290Z] [INFO] Running org.apache.maven.surefire.its.jiras.Surefire510TestClassPathForkModesIT
[2019-07-12T03:36:43.054Z] [INFO] Tests run: 2, Failures: 0, Errors: 0, Skipped: 0, Time elapsed:
10.304 s - in org.apache.maven.surefire.its.jiras.Surefire510TestClassPathForkModesIT
[2019-07-12T03:36:43.054Z] [INFO] Running org.apache.maven.surefire.its.jiras.Surefire569RunTestFromDependencyJarsIT
[2019-07-12T03:36:46.231Z] [INFO] Tests run: 1, Failures: 0, Errors: 0, Skipped: 0, Time elapsed:
4.93 s - in org.apache.maven.surefire.its.jiras.Surefire569RunTestFromDependencyJarsIT
[2019-07-12T03:36:46.231Z] [INFO] Running org.apache.maven.surefire.its.jiras.Surefire570MultipleReportDirectoriesIT
[2019-07-12T03:37:15.514Z] [INFO] Tests run: 2, Failures: 0, Errors: 0, Skipped: 0, Time elapsed:
26.875 s - in org.apache.maven.surefire.its.jiras.Surefire570MultipleReportDirectoriesIT
[2019-07-12T03:37:15.514Z] [INFO] Running org.apache.maven.surefire.its.jiras.Surefire613TestCountInParallelIT
[2019-07-12T03:37:19.643Z] [INFO] Tests run: 1, Failures: 0, Errors: 0, Skipped: 0, Time elapsed:
6.424 s - in org.apache.maven.surefire.its.jiras.Surefire613TestCountInParallelIT
[2019-07-12T03:37:19.643Z] [INFO] Running org.apache.maven.surefire.its.jiras.Surefire621TestCountingJunit3InParallelIT
[2019-07-12T03:37:53.768Z] [INFO] Tests run: 5, Failures: 0, Errors: 0, Skipped: 0, Time elapsed:
32.085 s - in org.apache.maven.surefire.its.jiras.Surefire621TestCountingJunit3InParallelIT
[2019-07-12T03:37:53.768Z] [INFO] Running org.apache.maven.surefire.its.jiras.Surefire628ConsoleOutputBeforeAndAfterClassIT
[2019-07-12T03:37:56.928Z] [INFO] Tests run: 1, Failures: 0, Errors: 0, Skipped: 0, Time elapsed:
5.881 s - in org.apache.maven.surefire.its.jiras.Surefire628ConsoleOutputBeforeAndAfterClassIT
[2019-07-12T03:37:56.928Z] [INFO] Running org.apache.maven.surefire.its.jiras.Surefire634UnsettableSystemPropertiesWarningIT
[2019-07-12T03:38:02.146Z] [INFO] Tests run: 1, Failures: 0, Errors: 0, Skipped: 0, Time elapsed:
5.016 s - in org.apache.maven.surefire.its.jiras.Surefire634UnsettableSystemPropertiesWarningIT
[2019-07-12T03:38:02.146Z] [INFO] Running org.apache.maven.surefire.its.jiras.Surefire649EmptyStringSystemPropertiesIT
[2019-07-12T03:38:11.709Z] [INFO] Tests run: 2, Failures: 0, Errors: 0, Skipped: 0, Time elapsed:
8.455 s - in org.apache.maven.surefire.its.jiras.Surefire649EmptyStringSystemPropertiesIT
[2019-07-12T03:38:11.709Z] [INFO] Running org.apache.maven.surefire.its.jiras.Surefire673MockitoIT
[2019-07-12T03:38:16.918Z] [INFO] Tests run: 1, Failures: 0, Errors: 0, Skipped: 0, Time elapsed:
6.434 s - in org.apache.maven.surefire.its.jiras.Surefire673MockitoIT
[2019-07-12T03:38:16.918Z] [INFO] Running org.apache.maven.surefire.its.jiras.Surefire674BuildFailingWhenErrorsIT
[2019-07-12T03:38:22.122Z] [INFO] Tests run: 1, Failures: 0, Errors: 0, Skipped: 0, Time elapsed:
5.114 s - in org.apache.maven.surefire.its.jiras.Surefire674BuildFailingWhenErrorsIT
[2019-07-12T03:38:22.122Z] [INFO] Running org.apache.maven.surefire.its.jiras.Surefire674BuildFailingWhenFailsafeErrorsIT
[2019-07-12T03:38:26.250Z] [INFO] Tests run: 1, Failures: 0, Errors: 0, Skipped: 0, Time elapsed:
3.994 s - in org.apache.maven.surefire.its.jiras.Surefire674BuildFailingWhenFailsafeErrorsIT
[2019-07-12T03:38:26.251Z] [INFO] Running org.apache.maven.surefire.its.jiras.Surefire685CommaSeparatedIncludesIT
[2019-07-12T03:38:31.453Z] [INFO] Tests run: 1, Failures: 0, Errors: 0, Skipped: 0, Time elapsed:
5.024 s - in org.apache.maven.surefire.its.jiras.Surefire685CommaSeparatedIncludesIT
[2019-07-12T03:38:31.453Z] [INFO] Running org.apache.maven.surefire.its.jiras.Surefire697NiceSummaryIT
[2019-07-12T03:38:36.659Z] [INFO] Tests run: 1, Failures: 0, Errors: 0, Skipped: 0, Time elapsed:
5.188 s - in org.apache.maven.surefire.its.jiras.Surefire697NiceSummaryIT
[2019-07-12T03:38:36.659Z] [INFO] Running org.apache.maven.surefire.its.jiras.Surefire705ParallelForkTimeoutIT
[2019-07-12T03:38:45.941Z] [INFO] Tests run: 1, Failures: 0, Errors: 0, Skipped: 0, Time elapsed:
8.459 s - in org.apache.maven.surefire.its.jiras.Surefire705ParallelForkTimeoutIT
[2019-07-12T03:38:45.941Z] [INFO] Running org.apache.maven.surefire.its.jiras.Surefire733AllOverrridesCapturedIT
[2019-07-12T03:38:50.072Z] [INFO] Tests run: 1, Failures: 0, Errors: 0, Skipped: 0, Time elapsed:
5.119 s - in org.apache.maven.surefire.its.jiras.Surefire733AllOverrridesCapturedIT
[2019-07-12T03:38:50.072Z] [INFO] Running org.apache.maven.surefire.its.jiras.Surefire735ForkFailWithRedirectConsoleOutputIT
[2019-07-12T03:38:59.351Z] [INFO] Tests run: 2, Failures: 0, Errors: 0, Skipped: 0, Time elapsed:
8.934 s - in org.apache.maven.surefire.its.jiras.Surefire735ForkFailWithRedirectConsoleOutputIT
[2019-07-12T03:38:59.351Z] [INFO] Running org.apache.maven.surefire.its.jiras.Surefire740TruncatedCommaIT
[2019-07-12T03:39:03.628Z] [INFO] Tests run: 1, Failures: 0, Errors: 0, Skipped: 0, Time elapsed:
4.67 s - in org.apache.maven.surefire.its.jiras.Surefire740TruncatedCommaIT
[2019-07-12T03:39:03.628Z] [INFO] Running org.apache.maven.surefire.its.jiras.Surefire747MethodParallelWithSuiteCountIT
[2019-07-12T03:39:28.400Z] [INFO] Tests run: 2, Failures: 0, Errors: 0, Skipped: 0, Time elapsed:
21.711 s - in org.apache.maven.surefire.its.jiras.Surefire747MethodParallelWithSuiteCountIT
[2019-07-12T03:39:28.400Z] [INFO] Running org.apache.maven.surefire.its.jiras.Surefire772BothReportsIT
[2019-07-12T03:39:36.164Z] [INFO] Tests run: 3, Failures: 0, Errors: 0, Skipped: 0, Time elapsed:
10.249 s - in org.apache.maven.surefire.its.jiras.Surefire772BothReportsIT
[2019-07-12T03:39:36.164Z] [INFO] Running org.apache.maven.surefire.its.jiras.Surefire772NoFailsafeReportsIT
[2019-07-12T03:39:49.179Z] [INFO] Tests run: 4, Failures: 0, Errors: 0, Skipped: 0, Time elapsed:
13.544 s - in org.apache.maven.surefire.its.jiras.Surefire772NoFailsafeReportsIT
[2019-07-12T03:39:49.179Z] [INFO] Running org.apache.maven.surefire.its.jiras.Surefire772NoSurefireReportsIT
[2019-07-12T03:40:04.626Z] [INFO] Tests run: 4, Failures: 0, Errors: 0, Skipped: 0, Time elapsed:
13.995 s - in org.apache.maven.surefire.its.jiras.Surefire772NoSurefireReportsIT
[2019-07-12T03:40:04.626Z] [INFO] Running org.apache.maven.surefire.its.jiras.Surefire772SpecifiedReportsIT
[2019-07-12T03:40:13.966Z] [INFO] Tests run: 3, Failures: 0, Errors: 0, Skipped: 0, Time elapsed:
9.948 s - in org.apache.maven.surefire.its.jiras.Surefire772SpecifiedReportsIT
[2019-07-12T03:40:13.966Z] [INFO] Running org.apache.maven.surefire.its.jiras.Surefire801ForkModeNoneClassLoaderIT
[2019-07-12T03:40:17.333Z] [INFO] Tests run: 1, Failures: 0, Errors: 0, Skipped: 0, Time elapsed:
4.421 s - in org.apache.maven.surefire.its.jiras.Surefire801ForkModeNoneClassLoaderIT
[2019-07-12T03:40:17.333Z] [INFO] Running org.apache.maven.surefire.its.jiras.Surefire803MultiFailsafeExecsIT
[2019-07-12T03:40:38.691Z] [INFO] Tests run: 2, Failures: 0, Errors: 0, Skipped: 0, Time elapsed:
19.298 s - in org.apache.maven.surefire.its.jiras.Surefire803MultiFailsafeExecsIT
[2019-07-12T03:40:38.691Z] [INFO] Running org.apache.maven.surefire.its.jiras.Surefire806SpecifiedTestControlsIT
[2019-07-12T03:40:41.869Z] [WARNING] Tests run: 3, Failures: 0, Errors: 0, Skipped: 2, Time
elapsed: 5.304 s - in org.apache.maven.surefire.its.jiras.Surefire806SpecifiedTestControlsIT
[2019-07-12T03:40:41.869Z] [INFO] Running org.apache.maven.surefire.its.jiras.Surefire809GroupExpressionsIT
[2019-07-12T03:41:16.145Z] [INFO] Tests run: 6, Failures: 0, Errors: 0, Skipped: 0, Time elapsed:
33.795 s - in org.apache.maven.surefire.its.jiras.Surefire809GroupExpressionsIT
[2019-07-12T03:41:16.145Z] [INFO] Running org.apache.maven.surefire.its.jiras.Surefire812Log4JClassLoaderIT
[2019-07-12T03:41:23.903Z] [INFO] Tests run: 1, Failures: 0, Errors: 0, Skipped: 0, Time elapsed:
7.08 s - in org.apache.maven.surefire.its.jiras.Surefire812Log4JClassLoaderIT
[2019-07-12T03:41:23.903Z] [INFO] Running org.apache.maven.surefire.its.jiras.Surefire817SystemExitIT
[2019-07-12T03:41:29.157Z] [INFO] Tests run: 1, Failures: 0, Errors: 0, Skipped: 0, Time elapsed:
6.436 s - in org.apache.maven.surefire.its.jiras.Surefire817SystemExitIT
[2019-07-12T03:41:29.157Z] [INFO] Running org.apache.maven.surefire.its.jiras.Surefire818NpeIgnoresTestsIT
[2019-07-12T03:41:35.627Z] [INFO] Tests run: 1, Failures: 0, Errors: 0, Skipped: 0, Time elapsed:
6.018 s - in org.apache.maven.surefire.its.jiras.Surefire818NpeIgnoresTestsIT
[2019-07-12T03:41:35.627Z] [INFO] Running org.apache.maven.surefire.its.jiras.Surefire828EmptyGroupExprIT
[2019-07-12T03:42:00.913Z] [INFO] Tests run: 4, Failures: 0, Errors: 0, Skipped: 0, Time elapsed:
25.351 s - in org.apache.maven.surefire.its.jiras.Surefire828EmptyGroupExprIT
[2019-07-12T03:42:00.913Z] [INFO] Running org.apache.maven.surefire.its.jiras.Surefire832ProviderSelectionIT
[2019-07-12T03:42:07.414Z] [INFO] Tests run: 1, Failures: 0, Errors: 0, Skipped: 0, Time elapsed:
6.462 s - in org.apache.maven.surefire.its.jiras.Surefire832ProviderSelectionIT
[2019-07-12T03:42:07.414Z] [INFO] Running org.apache.maven.surefire.its.jiras.Surefire839TestWithoutCategoriesIT
[2019-07-12T03:42:20.486Z] [INFO] Tests run: 2, Failures: 0, Errors: 0, Skipped: 0, Time elapsed:
13.142 s - in org.apache.maven.surefire.its.jiras.Surefire839TestWithoutCategoriesIT
[2019-07-12T03:42:20.486Z] [INFO] Running org.apache.maven.surefire.its.jiras.Surefire847AdditionalFailureIT
[2019-07-12T03:42:26.907Z] [INFO] Tests run: 1, Failures: 0, Errors: 0, Skipped: 0, Time elapsed:
6.647 s - in org.apache.maven.surefire.its.jiras.Surefire847AdditionalFailureIT
[2019-07-12T03:42:26.907Z] [INFO] Running org.apache.maven.surefire.its.jiras.Surefire855AllowFailsafeUseArtifactFileIT
[2019-07-12T03:43:14.350Z] [INFO] Tests run: 4, Failures: 0, Errors: 0, Skipped: 0, Time elapsed:
47.428 s - in org.apache.maven.surefire.its.jiras.Surefire855AllowFailsafeUseArtifactFileIT
[2019-07-12T03:43:14.350Z] [INFO] Running org.apache.maven.surefire.its.jiras.Surefire901MIssingResultfileWhenNoTestsIT
[2019-07-12T03:43:19.557Z] [INFO] Tests run: 1, Failures: 0, Errors: 0, Skipped: 0, Time elapsed:
4.409 s - in org.apache.maven.surefire.its.jiras.Surefire901MIssingResultfileWhenNoTestsIT
[2019-07-12T03:43:19.557Z] [INFO] Running org.apache.maven.surefire.its.jiras.Surefire907PerThreadWithoutThreadCountIT
[2019-07-12T03:43:22.716Z] [INFO] Tests run: 1, Failures: 0, Errors: 0, Skipped: 0, Time elapsed:
3.9 s - in org.apache.maven.surefire.its.jiras.Surefire907PerThreadWithoutThreadCountIT
[2019-07-12T03:43:22.716Z] [INFO] Running org.apache.maven.surefire.its.jiras.Surefire920TestFailureIgnoreWithTimeoutIT
[2019-07-12T03:43:38.669Z] [INFO] Tests run: 2, Failures: 0, Errors: 0, Skipped: 0, Time elapsed:
13.921 s - in org.apache.maven.surefire.its.jiras.Surefire920TestFailureIgnoreWithTimeoutIT
[2019-07-12T03:43:38.669Z] [INFO] Running org.apache.maven.surefire.its.jiras.Surefire926FailureWith2ProvidersIT
[2019-07-12T03:43:40.983Z] [INFO] Tests run: 1, Failures: 0, Errors: 0, Skipped: 0, Time elapsed:
4.19 s - in org.apache.maven.surefire.its.jiras.Surefire926FailureWith2ProvidersIT
[2019-07-12T03:43:40.983Z] [INFO] Running org.apache.maven.surefire.its.jiras.Surefire930TestNgSuiteXmlIT
[2019-07-12T03:43:47.515Z] [INFO] Tests run: 1, Failures: 0, Errors: 0, Skipped: 0, Time elapsed:
6.504 s - in org.apache.maven.surefire.its.jiras.Surefire930TestNgSuiteXmlIT
[2019-07-12T03:43:47.515Z] [INFO] Running org.apache.maven.surefire.its.jiras.Surefire943ReportContentIT
[2019-07-12T03:44:16.715Z] [INFO] Tests run: 2, Failures: 0, Errors: 0, Skipped: 0, Time elapsed:
26.526 s - in org.apache.maven.surefire.its.jiras.Surefire943ReportContentIT
[2019-07-12T03:44:16.715Z] [INFO] Running org.apache.maven.surefire.its.jiras.Surefire946KillMainProcessInReusableForkIT
[2019-07-12T03:44:37.941Z] [INFO] Tests run: 3, Failures: 0, Errors: 0, Skipped: 0, Time elapsed:
22.771 s - in org.apache.maven.surefire.its.jiras.Surefire946KillMainProcessInReusableForkIT
[2019-07-12T03:44:37.941Z] [INFO] Running org.apache.maven.surefire.its.jiras.Surefire972BizarreNoClassDefIT
[2019-07-12T03:44:45.767Z] [INFO] Tests run: 1, Failures: 0, Errors: 0, Skipped: 0, Time elapsed:
8.302 s - in org.apache.maven.surefire.its.jiras.Surefire972BizarreNoClassDefIT
[2019-07-12T03:44:45.767Z] [INFO] Running org.apache.maven.surefire.its.jiras.Surefire975DefaultVMEncodingIT
[2019-07-12T03:44:51.139Z] [INFO] Tests run: 1, Failures: 0, Errors: 0, Skipped: 0, Time elapsed:
5.707 s - in org.apache.maven.surefire.its.jiras.Surefire975DefaultVMEncodingIT
[2019-07-12T03:44:51.139Z] [INFO] Running org.apache.maven.surefire.its.jiras.Surefire979WrongClassLoaderIT
[2019-07-12T03:44:56.525Z] [INFO] Tests run: 1, Failures: 0, Errors: 0, Skipped: 0, Time elapsed:
5.722 s - in org.apache.maven.surefire.its.jiras.Surefire979WrongClassLoaderIT
[2019-07-12T03:44:56.525Z] [INFO] Running org.apache.maven.surefire.its.jiras.Surefire985ParameterizedRunnerAndCategoriesIT
[2019-07-12T03:45:01.779Z] [INFO] Tests run: 1, Failures: 0, Errors: 0, Skipped: 0, Time elapsed:
5.28 s - in org.apache.maven.surefire.its.jiras.Surefire985ParameterizedRunnerAndCategoriesIT
[2019-07-12T03:45:01.779Z] [INFO] Running org.apache.maven.surefire.its.jiras.Surefire995CategoryInheritanceIT
[2019-07-12T03:45:36.133Z] [INFO] Tests run: 5, Failures: 0, Errors: 0, Skipped: 0, Time elapsed:
30.98 s - in org.apache.maven.surefire.its.jiras.Surefire995CategoryInheritanceIT
[2019-07-12T03:45:36.133Z] [INFO] 
[2019-07-12T03:45:36.133Z] [INFO] Results:
[2019-07-12T03:45:36.133Z] [INFO] 
[2019-07-12T03:45:36.133Z] [WARNING] Tests run: 796, Failures: 0, Errors: 0, Skipped: 134
[2019-07-12T03:45:36.133Z] [INFO] 
[2019-07-12T03:45:36.133Z] [INFO] 
[2019-07-12T03:45:36.133Z] [INFO] --- maven-checkstyle-plugin:3.0.0:check (checkstyle-check)
@ surefire-its ---
[2019-07-12T03:45:36.133Z] [INFO] 
[2019-07-12T03:45:36.133Z] [INFO] --- maven-failsafe-plugin:3.0.0-M3:verify (default) @ surefire-its
---
[2019-07-12T03:45:36.133Z] [INFO] Failsafe report directory: /home/jenkins/jenkins-slave/workspace/maven2surefire-jvm-communication@2/surefire-its/target/failsafe-reports
[2019-07-12T03:45:36.133Z] [INFO] 
[2019-07-12T03:45:36.133Z] [INFO] --- maven-install-plugin:2.5.2:install (default-install)
@ surefire-its ---
[2019-07-12T03:45:36.133Z] [INFO] Skipping artifact installation
[2019-07-12T03:45:36.133Z] [INFO] ------------------------------------------------------------------------
[2019-07-12T03:45:36.133Z] [INFO] Reactor Summary for Apache Maven Surefire 3.0.0-SNAPSHOT:
[2019-07-12T03:45:36.133Z] [INFO] 
[2019-07-12T03:45:36.133Z] [INFO] Apache Maven Surefire .............................. SUCCESS
[ 17.654 s]
[2019-07-12T03:45:36.133Z] [INFO] SureFire Logger API ................................ SUCCESS
[ 11.205 s]
[2019-07-12T03:45:36.133Z] [INFO] SureFire API ....................................... SUCCESS
[ 10.247 s]
[2019-07-12T03:45:36.133Z] [INFO] Surefire Extensions API ............................ SUCCESS
[  2.255 s]
[2019-07-12T03:45:36.133Z] [INFO] Surefire Extensions SPI ............................ SUCCESS
[  2.065 s]
[2019-07-12T03:45:36.133Z] [INFO] SureFire Booter .................................... SUCCESS
[ 13.982 s]
[2019-07-12T03:45:36.133Z] [INFO] Maven Surefire Test-Grouping Support ............... SUCCESS
[  5.746 s]
[2019-07-12T03:45:36.133Z] [INFO] SureFire Providers ................................. SUCCESS
[  1.040 s]
[2019-07-12T03:45:36.133Z] [INFO] Shared JUnit3 Provider Code ........................ SUCCESS
[  3.936 s]
[2019-07-12T03:45:36.133Z] [INFO] Shared Java 5 Provider Base ........................ SUCCESS
[  4.885 s]
[2019-07-12T03:45:36.133Z] [INFO] Shared JUnit4 Provider Code ........................ SUCCESS
[  4.766 s]
[2019-07-12T03:45:36.133Z] [INFO] Shared JUnit48 Provider Code ....................... SUCCESS
[  5.570 s]
[2019-07-12T03:45:36.133Z] [INFO] SureFire JUnit Runner .............................. SUCCESS
[  4.357 s]
[2019-07-12T03:45:36.133Z] [INFO] SureFire JUnit4 Runner ............................. SUCCESS
[  4.627 s]
[2019-07-12T03:45:36.133Z] [INFO] Maven Surefire Common .............................. SUCCESS
[ 42.695 s]
[2019-07-12T03:45:36.133Z] [INFO] SureFire JUnitCore Runner .......................... SUCCESS
[02:18 min]
[2019-07-12T03:45:36.133Z] [INFO] SureFire JUnit Platform Runner ..................... SUCCESS
[ 10.035 s]
[2019-07-12T03:45:36.133Z] [INFO] SureFire TestNG Utils .............................. SUCCESS
[  4.264 s]
[2019-07-12T03:45:36.133Z] [INFO] SureFire TestNG Runner ............................. SUCCESS
[  5.125 s]
[2019-07-12T03:45:36.133Z] [INFO] ShadeFire JUnit3 Provider .......................... SUCCESS
[  1.810 s]
[2019-07-12T03:45:36.133Z] [INFO] Surefire Report Parser ............................. SUCCESS
[  6.090 s]
[2019-07-12T03:45:36.133Z] [INFO] Maven Surefire Plugin .............................. SUCCESS
[ 11.115 s]
[2019-07-12T03:45:36.133Z] [INFO] Maven Failsafe Plugin .............................. SUCCESS
[01:00 min]
[2019-07-12T03:45:36.133Z] [INFO] Maven Surefire Report Plugin ....................... SUCCESS
[ 15.775 s]
[2019-07-12T03:45:36.133Z] [INFO] Maven Surefire Integration Tests ................... SUCCESS
[  01:13 h]
[2019-07-12T03:45:36.133Z] [INFO] ------------------------------------------------------------------------
[2019-07-12T03:45:36.133Z] [INFO] BUILD SUCCESS
[2019-07-12T03:45:36.133Z] [INFO] ------------------------------------------------------------------------
[2019-07-12T03:45:36.133Z] [INFO] Total time:  01:19 h
[2019-07-12T03:45:36.133Z] [INFO] Finished at: 2019-07-12T03:45:33Z
[2019-07-12T03:45:36.133Z] [INFO] ------------------------------------------------------------------------
[Pipeline] }
[Pipeline] // withEnv
[Pipeline] }
[Pipeline] // stage
[Pipeline] cleanWs
[2019-07-12T03:45:36.836Z] [WS-CLEANUP] Deleting project workspace...
[2019-07-12T03:45:36.836Z] [WS-CLEANUP] Deferred wipeout is used...
[2019-07-12T03:45:37.171Z] [WS-CLEANUP] done
[Pipeline] }
[Pipeline] // ws
[Pipeline] }
[Pipeline] // timestamps
[Pipeline] }
[Pipeline] // node
[Pipeline] }
[Pipeline] // parallel
[Pipeline] echo
hudson.AbortException: hudson.AbortException: Cannot delete workspace: Unable to delete 'C:\Users\jenkins\AppData\Local\Temp\3\jenkins-maven-box-maven-surefire-maven2surefire-jvm-communication-3\.m2\junit\junit\4.4\junit-4.4.jar'.
Tried 3 times (of a maximum of 3) waiting 0.1 sec between attempts.
[Pipeline] echo
Build result: FAILURE
[Pipeline] jiraIssueSelector
[Pipeline] emailext
Mime
  • Unnamed multipart/mixed (inline, None, 0 bytes)
View raw message