maven-notifications mailing list archives

Site index · List index
Message view « Date » · « Thread »
Top « Date » · « Thread »
From Apache Jenkins Server <jenk...@builds.apache.org>
Subject Build failed in Jenkins: Maven TLP » maven » MNG-6674 #4
Date Mon, 01 Jul 2019 19:54:28 GMT
See https://builds.apache.org/job/maven-box/job/maven/job/MNG-6674/4/

No changes.

All tests passed

Build log:
[...truncated 40822 lines...]
	at hudson.plugins.git.GitSCM.retrieveChanges(GitSCM.java:1161)
	at hudson.plugins.git.GitSCM.checkout(GitSCM.java:1192)
	at org.jenkinsci.plugins.workflow.steps.scm.SCMStep.checkout(SCMStep.java:120)
	at org.jenkinsci.plugins.workflow.steps.scm.SCMStep$StepExecutionImpl.run(SCMStep.java:90)
	at org.jenkinsci.plugins.workflow.steps.scm.SCMStep$StepExecutionImpl.run(SCMStep.java:77)
	at org.jenkinsci.plugins.workflow.steps.SynchronousNonBlockingStepExecution.lambda$start$0(SynchronousNonBlockingStepExecution.java:47)
	at java.util.concurrent.Executors$RunnableAdapter.call(Executors.java:511)
	at java.util.concurrent.FutureTask.run(FutureTask.java:266)
	at java.util.concurrent.ThreadPoolExecutor.runWorker(ThreadPoolExecutor.java:1149)
	at java.util.concurrent.ThreadPoolExecutor$Worker.run(ThreadPoolExecutor.java:624)
	at java.lang.Thread.run(Thread.java:748)
Caused by: hudson.plugins.git.GitException: Command "git fetch --no-tags --progress https://gitbox.apache.org/repos/asf/maven-integration-testing.git
+refs/heads/*:refs/remotes/origin/*" returned status code 128:
stdout: 
stderr: remote: Counting objects: 45050, done.        
remote: Compressing objects:   0% (1/14108)           
remote: Compressing objects:   1% (142/14108)           
remote: Compressing objects:   2% (283/14108)           
remote: Compressing objects:   3% (424/14108)           
remote: Compressing objects:   4% (565/14108)           
remote: Compressing objects:   5% (706/14108)           
remote: Compressing objects:   6% (847/14108)           
remote: Compressing objects:   7% (988/14108)           
remote: Compressing objects:   8% (1129/14108)           
remote: Compressing objects:   9% (1270/14108)           
remote: Compressing objects:  10% (1411/14108)           
remote: Compressing objects:  11% (1552/14108)           
remote: Compressing objects:  12% (1693/14108)           
remote: Compressing objects:  13% (1835/14108)           
remote: Compressing objects:  14% (1976/14108)           
remote: Compressing objects:  15% (2117/14108)           
remote: Compressing objects:  16% (2258/14108)           
remote: Compressing objects:  17% (2399/14108)           
remote: Compressing objects:  18% (2540/14108)           
remote: Compressing objects:  19% (2681/14108)           
remote: Compressing objects:  20% (2822/14108)           
remote: Compressing objects:  21% (2963/14108)           
remote: Compressing objects:  22% (3104/14108)           
remote: Compressing objects:  23% (3245/14108)           
remote: Compressing objects:  24% (3386/14108)           
remote: Compressing objects:  25% (3527/14108)           
remote: Compressing objects:  26% (3669/14108)           
remote: Compressing objects:  27% (3810/14108)           
remote: Compressing objects:  28% (3951/14108)           
remote: Compressing objects:  29% (4092/14108)           
remote: Compressing objects:  30% (4233/14108)           
remote: Compressing objects:  31% (4374/14108)           
remote: Compressing objects:  32% (4515/14108)           
remote: Compressing objects:  33% (4656/14108)           
remote: Compressing objects:  34% (4797/14108)           
remote: Compressing objects:  35% (4938/14108)           
remote: Compressing objects:  36% (5079/14108)           
remote: Compressing objects:  37% (5220/14108)           
remote: Compressing objects:  38% (5362/14108)           
remote: Compressing objects:  39% (5503/14108)           
remote: Compressing objects:  40% (5644/14108)           
remote: Compressing objects:  41% (5785/14108)           
remote: Compressing objects:  42% (5926/14108)           
remote: Compressing objects:  43% (6067/14108)           
remote: Compressing objects:  44% (6208/14108)           
remote: Compressing objects:  45% (6349/14108)           
remote: Compressing objects:  46% (6490/14108)           
remote: Compressing objects:  47% (6631/14108)           
remote: Compressing objects:  48% (6772/14108)           
remote: Compressing objects:  49% (6913/14108)           
remote: Compressing objects:  50% (7054/14108)           
remote: Compressing objects:  51% (7196/14108)           
remote: Compressing objects:  52% (7337/14108)           
remote: Compressing objects:  53% (7478/14108)           
remote: Compressing objects:  54% (7619/14108)           
remote: Compressing objects:  55% (7760/14108)           
remote: Compressing objects:  56% (7901/14108)           
remote: Compressing objects:  57% (8042/14108)           
remote: Compressing objects:  58% (8183/14108)           
remote: Compressing objects:  59% (8324/14108)           
remote: Compressing objects:  60% (8465/14108)           
remote: Compressing objects:  61% (8606/14108)           
remote: Compressing objects:  62% (8747/14108)           
remote: Compressing objects:  63% (8889/14108)           
remote: Compressing objects:  64% (9030/14108)           
remote: Compressing objects:  65% (9171/14108)           
remote: Compressing objects:  66% (9312/14108)           
remote: Compressing objects:  67% (9453/14108)           
remote: Compressing objects:  68% (9594/14108)           
remote: Compressing objects:  69% (9735/14108)           
remote: Compressing objects:  70% (9876/14108)           
remote: Compressing objects:  71% (10017/14108)           
remote: Compressing objects:  72% (10158/14108)           
remote: Compressing objects:  73% (10299/14108)           
remote: Compressing objects:  74% (10440/14108)           
remote: Compressing objects:  75% (10581/14108)           
remote: Compressing objects:  76% (10723/14108)           
remote: Compressing objects:  77% (10864/14108)           
remote: Compressing objects:  78% (11005/14108)           
remote: Compressing objects:  79% (11146/14108)           
remote: Compressing objects:  80% (11287/14108)           
remote: Compressing objects:  81% (11428/14108)           
remote: Compressing objects:  82% (11569/14108)           
remote: Compressing objects:  83% (11710/14108)           
remote: Compressing objects:  84% (11851/14108)           
remote: Compressing objects:  85% (11992/14108)           
remote: Compressing objects:  86% (12133/14108)           
remote: Compressing objects:  87% (12274/14108)           
remote: Compressing objects:  88% (12416/14108)           
remote: Compressing objects:  89% (12557/14108)           
remote: Compressing objects:  90% (12698/14108)           
remote: Compressing objects:  91% (12839/14108)           
remote: Compressing objects:  92% (12980/14108)           
remote: Compressing objects:  93% (13121/14108)           
remote: Compressing objects:  94% (13262/14108)           
remote: Compressing objects:  95% (13403/14108)           
remote: Compressing objects:  96% (13544/14108)           
remote: Compressing objects:  97% (13685/14108)           
remote: Compressing objects:  98% (13826/14108)           
remote: Compressing objects:  99% (13967/14108)           
remote: Compressing objects: 100% (14108/14108)           
remote: Compressing objects: 100% (14108/14108), done.        
Receiving objects:   0% (1/45050)   
fatal: write error: No space left on device
fatal: index-pack failed

	at org.jenkinsci.plugins.gitclient.CliGitAPIImpl.launchCommandIn(CliGitAPIImpl.java:2042)
	at org.jenkinsci.plugins.gitclient.CliGitAPIImpl.launchCommandWithCredentials(CliGitAPIImpl.java:1761)
	at org.jenkinsci.plugins.gitclient.CliGitAPIImpl.access$400(CliGitAPIImpl.java:72)
	at org.jenkinsci.plugins.gitclient.CliGitAPIImpl$1.execute(CliGitAPIImpl.java:442)
	at org.jenkinsci.plugins.gitclient.RemoteGitImpl$CommandInvocationHandler$1.call(RemoteGitImpl.java:153)
	at org.jenkinsci.plugins.gitclient.RemoteGitImpl$CommandInvocationHandler$1.call(RemoteGitImpl.java:146)
	at hudson.remoting.UserRequest.perform(UserRequest.java:212)
	at hudson.remoting.UserRequest.perform(UserRequest.java:54)
	at hudson.remoting.Request$2.run(Request.java:369)
	at hudson.remoting.InterceptingExecutorService$1.call(InterceptingExecutorService.java:72)
	at java.util.concurrent.FutureTask.run(Unknown Source)
	at java.util.concurrent.ThreadPoolExecutor.runWorker(Unknown Source)
	at java.util.concurrent.ThreadPoolExecutor$Worker.run(Unknown Source)
	at hudson.remoting.Engine$1.lambda$newThread$0(Engine.java:93)
	at java.lang.Thread.run(Unknown Source)
	Suppressed: hudson.remoting.Channel$CallSiteStackTrace: Remote call to JNLP4-connect connection
from ec2-34-228-168-168.compute-1.amazonaws.com/34.228.168.168:49816
		at hudson.remoting.Channel.attachCallSiteStackTrace(Channel.java:1741)
		at hudson.remoting.UserRequest$ExceptionResponse.retrieve(UserRequest.java:357)
		at hudson.remoting.Channel.call(Channel.java:955)
		at org.jenkinsci.plugins.gitclient.RemoteGitImpl$CommandInvocationHandler.execute(RemoteGitImpl.java:146)
		at sun.reflect.GeneratedMethodAccessor974.invoke(Unknown Source)
		at sun.reflect.DelegatingMethodAccessorImpl.invoke(DelegatingMethodAccessorImpl.java:43)
		at java.lang.reflect.Method.invoke(Method.java:498)
		at org.jenkinsci.plugins.gitclient.RemoteGitImpl$CommandInvocationHandler.invoke(RemoteGitImpl.java:132)
		at com.sun.proxy.$Proxy115.execute(Unknown Source)
		at hudson.plugins.git.GitSCM.fetchFrom(GitSCM.java:892)
		at hudson.plugins.git.GitSCM.retrieveChanges(GitSCM.java:1161)
		at hudson.plugins.git.GitSCM.checkout(GitSCM.java:1192)
		at org.jenkinsci.plugins.workflow.steps.scm.SCMStep.checkout(SCMStep.java:120)
		at org.jenkinsci.plugins.workflow.steps.scm.SCMStep$StepExecutionImpl.run(SCMStep.java:90)
		at org.jenkinsci.plugins.workflow.steps.scm.SCMStep$StepExecutionImpl.run(SCMStep.java:77)
		at org.jenkinsci.plugins.workflow.steps.SynchronousNonBlockingStepExecution.lambda$start$0(SynchronousNonBlockingStepExecution.java:47)
		at java.util.concurrent.Executors$RunnableAdapter.call(Executors.java:511)
		at java.util.concurrent.FutureTask.run(FutureTask.java:266)
		at java.util.concurrent.ThreadPoolExecutor.runWorker(ThreadPoolExecutor.java:1149)
		at java.util.concurrent.ThreadPoolExecutor$Worker.run(ThreadPoolExecutor.java:624)
		at java.lang.Thread.run(Thread.java:748)
[Pipeline] }
[Pipeline] // dir
[Pipeline] }
[Pipeline] // stage
[Pipeline] }
[Pipeline] // node
[Pipeline] }
Failed in branch windows-jdk12
Aborted by michaelo
mng3703ExecutionProjectWithRelativePaths(ForkFromReport)....Sending interrupt signal to process
Aborted by michaelo
Sending interrupt signal to process
[INFO] 
[INFO] Results:
[INFO] 
[INFO] Tests run: 0, Failures: 0, Errors: 0, Skipped: 0
[INFO] 
[ERROR] There are test failures.

Please refer to /home/jenkins/jenkins-slave/workspace/maven-box_maven_MNG-6674/test/core-it-suite/target/surefire-reports
for the individual test results.
Please refer to dump files (if any exist) [date]-jvmRun[N].dump, [date].dumpstream and [date]-jvmRun[N].dumpstream.
The forked VM terminated without properly saying goodbye. VM crash or System.exit called?
Command was /bin/sh -c cd /home/jenkins/jenkins-slave/workspace/maven-box_maven_MNG-6674/test/core-it-suite
&& /usr/local/asfpackages/java/jdk1.7.0_80/jre/bin/java -Xmx384m -XX:MaxPermSize=192m
-Dcom.sun.management.jmxremote=true org.apache.maven.surefire.booter.ForkedBooter /home/jenkins/jenkins-slave/workspace/maven-box_maven_MNG-6674/test/core-it-suite/target/surefire
2019-06-22T12-12-13_912-jvmRun1 surefire5249554720924865703tmp surefire_3642559413232286250tmp
Error occurred in starting fork, check output in log
Process Exit Code: 143
Crashed tests:
org.apache.maven.it.MavenITmng3703ExecutionProjectWithRelativePathsTest
org.apache.maven.surefire.booter.SurefireBooterForkException: The forked VM terminated without
properly saying goodbye. VM crash or System.exit called?
Command was /bin/sh -c cd /home/jenkins/jenkins-slave/workspace/maven-box_maven_MNG-6674/test/core-it-suite
&& /usr/local/asfpackages/java/jdk1.7.0_80/jre/bin/java -Xmx384m -XX:MaxPermSize=192m
-Dcom.sun.management.jmxremote=true org.apache.maven.surefire.booter.ForkedBooter /home/jenkins/jenkins-slave/workspace/maven-box_maven_MNG-6674/test/core-it-suite/target/surefire
2019-06-22T12-12-13_912-jvmRun1 surefire5249554720924865703tmp surefire_3642559413232286250tmp
Error occurred in starting fork, check output in log
Process Exit Code: 143
Crashed tests:
org.apache.maven.it.MavenITmng3703ExecutionProjectWithRelativePathsTest
	at org.apache.maven.plugin.surefire.booterclient.ForkStarter.fork(ForkStarter.java:671)
	at org.apache.maven.plugin.surefire.booterclient.ForkStarter.fork(ForkStarter.java:533)
	at org.apache.maven.plugin.surefire.booterclient.ForkStarter.run(ForkStarter.java:278)
	at org.apache.maven.plugin.surefire.booterclient.ForkStarter.run(ForkStarter.java:244)
	at org.apache.maven.plugin.surefire.AbstractSurefireMojo.executeProvider(AbstractSurefireMojo.java:1194)
	at org.apache.maven.plugin.surefire.AbstractSurefireMojo.executeAfterPreconditionsChecked(AbstractSurefireMojo.java:1022)
	at org.apache.maven.plugin.surefire.AbstractSurefireMojo.execute(AbstractSurefireMojo.java:868)
	at org.apache.maven.plugin.DefaultBuildPluginManager.executeMojo(DefaultBuildPluginManager.java:137)
	at org.apache.maven.lifecycle.internal.MojoExecutor.execute(MojoExecutor.java:210)
	at org.apache.maven.lifecycle.internal.MojoExecutor.execute(MojoExecutor.java:156)
	at org.apache.maven.lifecycle.internal.MojoExecutor.execute(MojoExecutor.java:148)
	at org.apache.maven.lifecycle.internal.LifecycleModuleBuilder.buildProject(LifecycleModuleBuilder.java:117)
	at org.apache.maven.lifecycle.internal.LifecycleModuleBuilder.buildProject(LifecycleModuleBuilder.java:81)
	at org.apache.maven.lifecycle.internal.builder.singlethreaded.SingleThreadedBuilder.build(SingleThreadedBuilder.java:56)
	at org.apache.maven.lifecycle.internal.LifecycleStarter.execute(LifecycleStarter.java:128)
	at org.apache.maven.DefaultMaven.doExecute(DefaultMaven.java:305)
	at org.apache.maven.DefaultMaven.doExecute(DefaultMaven.java:192)
	at org.apache.maven.DefaultMaven.execute(DefaultMaven.java:105)
	at org.apache.maven.cli.MavenCli.execute(MavenCli.java:956)
	at org.apache.maven.cli.MavenCli.doMain(MavenCli.java:288)
	at org.apache.maven.cli.MavenCli.main(MavenCli.java:192)
	at sun.reflect.NativeMethodAccessorImpl.invoke0(Native Method)
	at sun.reflect.NativeMethodAccessorImpl.invoke(NativeMethodAccessorImpl.java:57)
	at sun.reflect.DelegatingMethodAccessorImpl.invoke(DelegatingMethodAccessorImpl.java:43)
	at java.lang.reflect.Method.invoke(Method.java:606)
	at org.codehaus.plexus.classworlds.launcher.Launcher.launchEnhanced(Launcher.java:289)
	at org.codehaus.plexus.classworlds.launcher.Launcher.launch(Launcher.java:229)
	at org.codehaus.plexus.classworlds.launcher.Launcher.mainWithExitCode(Launcher.java:415)
	at org.codehaus.plexus.classworlds.launcher.Launcher.main(Launcher.java:356)

[INFO] 
[INFO] --- maven-jar-plugin:3.0.2:jar (default-jar) @ core-it-suite ---
[INFO] Building jar: /home/jenkins/jenkins-slave/workspace/maven-box_maven_MNG-6674/test/core-it-suite/target/core-it-suite-2.1-SNAPSHOT.jar
[INFO] 
[INFO] --- maven-site-plugin:3.7:attach-descriptor (attach-descriptor) @ core-it-suite ---
[INFO] Skipping because packaging 'jar' is not pom.
[INFO] 
[INFO] --- maven-jar-plugin:3.0.2:test-jar (default) @ core-it-suite ---
script returned exit code 143
[Pipeline] }
[withMaven] One or multiple Maven executions have been ignored by the Jenkins Pipeline Maven
Plugin because they have been interrupted before completion (1). See Pipeline Maven Plugin
FAQ for more details.
[Pipeline] // withMaven
[Pipeline] }
[Pipeline] // dir
[Pipeline] }
[Pipeline] // stage
[Pipeline] }
[Pipeline] // node
[Pipeline] }
Failed in branch linux-jdk7
[Pipeline] // parallel
[Pipeline] echo
[FAILURE-003] AbortException hudson.AbortException: Error fetching remote repo 'origin'
[Pipeline] stage
[Pipeline] { (Notifications)
[Pipeline] echo
Build result: FAILURE
[Pipeline] jiraIssueSelector
[Pipeline] emailext
Mime
  • Unnamed multipart/mixed (inline, None, 0 bytes)
View raw message