maven-notifications mailing list archives

Site index · List index
Message view « Date » · « Thread »
Top « Date » · « Thread »
From Apache Jenkins Server <jenk...@builds.apache.org>
Subject Build failed in Jenkins: Maven TLP » maven-surefire » junit550 #1
Date Fri, 12 Jul 2019 19:12:18 GMT
See https://builds.apache.org/job/maven-box/job/maven-surefire/job/junit550/1/

No changes.

1 tests failed.
FAILED:  org.apache.maven.surefire.its.JUnitPlatformIT.testMultipleEngines

Error Message:
Exit code was non-zero: 1; command line and log = 
/home/jenkins/tools/maven/apache-maven-3.6.0/bin/mvn -e --batch-mode -Dmaven.repo.local=/home/jenkins/jenkins-slave/workspace/aven-box_maven-surefire_junit550@2/.m2 org.apache.maven.plugins:maven-clean-plugin:clean -Dsurefire.version=3.0.0-SNAPSHOT -Djacoco.agent=-javaagent:/home/jenkins/jenkins-slave/workspace/aven-box_maven-surefire_junit550@2/.m2/org/jacoco/org.jacoco.agent/0.8.4/org.jacoco.agent-0.8.4-runtime.jar=destfile=/home/jenkins/jenkins-slave/workspace/aven-box_maven-surefire_junit550@2/surefire-its/target/jacoco-it.exec,includes=**/failsafe/*:**/failsafe/**/*:**/surefire/*:**/surefire/**/*,excludes=**/HelpMojo.class:**/shadefire/**/*:org/jacoco/**/*:com/vladium/emma/rt/* -Dhttps.protocols=TLSv1,TLSv1.1,TLSv1.2 test
[INFO] Error stacktraces are turned on.
[INFO] Scanning for projects...
[INFO] 
[INFO] --< org.apache.maven.plugins.surefire:junit-platform-multiple-engines >--
[INFO] Building Test for JUnit 5: Platform hosting multiple test engines 1.0
[INFO] --------------------------------[ jar ]---------------------------------
[INFO] Downloading from central: https://repo.maven.apache.org/maven2/org/junit/jupiter/junit-jupiter-params/5.5.0/junit-jupiter-params-5.5.0.pom
[INFO] Downloaded from central: https://repo.maven.apache.org/maven2/org/junit/jupiter/junit-jupiter-params/5.5.0/junit-jupiter-params-5.5.0.pom (2.2 kB at 7.2 kB/s)
[INFO] Downloading from central: https://repo.maven.apache.org/maven2/org/junit/jupiter/junit-jupiter-params/5.5.0/junit-jupiter-params-5.5.0.jar
[INFO] Downloaded from central: https://repo.maven.apache.org/maven2/org/junit/jupiter/junit-jupiter-params/5.5.0/junit-jupiter-params-5.5.0.jar (549 kB at 6.7 MB/s)
[INFO] 
[INFO] --- maven-clean-plugin:2.5:clean (default-cli) @ junit-platform-multiple-engines ---
[INFO] 
[INFO] --- maven-resources-plugin:2.6:resources (default-resources) @ junit-platform-multiple-engines ---
[WARNING] Using platform encoding (ISO-8859-1 actually) to copy filtered resources, i.e. build is platform dependent!
[INFO] skip non existing resourceDirectory /home/jenkins/jenkins-slave/workspace/aven-box_maven-surefire_junit550@2/surefire-its/target/JUnitPlatformIT_testMultipleEngines/src/main/resources
[INFO] 
[INFO] --- maven-compiler-plugin:3.1:compile (default-compile) @ junit-platform-multiple-engines ---
[INFO] No sources to compile
[INFO] 
[INFO] --- maven-resources-plugin:2.6:testResources (default-testResources) @ junit-platform-multiple-engines ---
[WARNING] Using platform encoding (ISO-8859-1 actually) to copy filtered resources, i.e. build is platform dependent!
[INFO] skip non existing resourceDirectory /home/jenkins/jenkins-slave/workspace/aven-box_maven-surefire_junit550@2/surefire-its/target/JUnitPlatformIT_testMultipleEngines/src/test/resources
[INFO] 
[INFO] --- maven-compiler-plugin:3.1:testCompile (default-testCompile) @ junit-platform-multiple-engines ---
[INFO] Changes detected - recompiling the module!
[WARNING] File encoding has not been set, using platform encoding ISO-8859-1, i.e. build is platform dependent!
[INFO] Compiling 3 source files to /home/jenkins/jenkins-slave/workspace/aven-box_maven-surefire_junit550@2/surefire-its/target/JUnitPlatformIT_testMultipleEngines/target/test-classes
[INFO] 
[INFO] --- maven-surefire-plugin:3.0.0-SNAPSHOT:test (default-test) @ junit-platform-multiple-engines ---
[INFO] Surefire report directory: /home/jenkins/jenkins-slave/workspace/aven-box_maven-surefire_junit550@2/surefire-its/target/JUnitPlatformIT_testMultipleEngines/target/surefire-reports
[INFO] 
[INFO] -------------------------------------------------------
[INFO]  T E S T S
[INFO] -------------------------------------------------------
[ERROR] org/junit/platform/commons/PreconditionViolationException
[INFO] 
[INFO] Results:
[INFO] 
[INFO] Tests run: 0, Failures: 0, Errors: 0, Skipped: 0
[INFO] 
[INFO] ------------------------------------------------------------------------
[INFO] BUILD FAILURE
[INFO] ------------------------------------------------------------------------
[INFO] Total time:  3.770 s
[INFO] Finished at: 2019-07-12T18:32:23Z
[INFO] ------------------------------------------------------------------------
[ERROR] Failed to execute goal org.apache.maven.plugins:maven-surefire-plugin:3.0.0-SNAPSHOT:test (default-test) on project junit-platform-multiple-engines: There are test failures.
[ERROR] 
[ERROR] Please refer to /home/jenkins/jenkins-slave/workspace/aven-box_maven-surefire_junit550@2/surefire-its/target/JUnitPlatformIT_testMultipleEngines/target/surefire-reports for the individual test results.
[ERROR] Please refer to dump files (if any exist) [date].dump, [date]-jvmRun[N].dump and [date].dumpstream.
[ERROR] There was an error in the forked processorg/junit/platform/commons/PreconditionViolationException
[ERROR] java.lang.NoClassDefFoundError: org/junit/platform/commons/PreconditionViolationException
[ERROR]  at org.apache.maven.surefire.junitplatform.TestPlanScannerFilter.accept(TestPlanScannerFilter.java:53)
[ERROR]  at org.apache.maven.surefire.util.DefaultScanResult.applyFilter(DefaultScanResult.java:102)
[ERROR]  at org.apache.maven.surefire.junitplatform.JUnitPlatformProvider.scanClasspath(JUnitPlatformProvider.java:143)
[ERROR]  at org.apache.maven.surefire.junitplatform.JUnitPlatformProvider.invoke(JUnitPlatformProvider.java:124)
[ERROR]  at org.apache.maven.surefire.booter.ForkedBooter.invokeProviderInSameClassLoader(ForkedBooter.java:359)
[ERROR]  at org.apache.maven.surefire.booter.ForkedBooter.runSuitesInProcess(ForkedBooter.java:321)
[ERROR]  at org.apache.maven.surefire.booter.ForkedBooter.execute(ForkedBooter.java:119)
[ERROR]  at org.apache.maven.surefire.booter.ForkedBooter.main(ForkedBooter.java:394)
[ERROR] Caused by: java.lang.ClassNotFoundException: org.junit.platform.commons.PreconditionViolationException
[ERROR]  at java.base/jdk.internal.loader.BuiltinClassLoader.loadClass(BuiltinClassLoader.java:583)
[ERROR]  at java.base/jdk.internal.loader.ClassLoaders$AppClassLoader.loadClass(ClassLoaders.java:178)
[ERROR]  at java.base/java.lang.ClassLoader.loadClass(ClassLoader.java:521)
[ERROR]  ... 8 more
[ERROR] 
[ERROR] org.apache.maven.surefire.booter.SurefireBooterForkException: There was an error in the forked processorg/junit/platform/commons/PreconditionViolationException
[ERROR] java.lang.NoClassDefFoundError: org/junit/platform/commons/PreconditionViolationException
[ERROR]  at org.apache.maven.surefire.junitplatform.TestPlanScannerFilter.accept(TestPlanScannerFilter.java:53)
[ERROR]  at org.apache.maven.surefire.util.DefaultScanResult.applyFilter(DefaultScanResult.java:102)
[ERROR]  at org.apache.maven.surefire.junitplatform.JUnitPlatformProvider.scanClasspath(JUnitPlatformProvider.java:143)
[ERROR]  at org.apache.maven.surefire.junitplatform.JUnitPlatformProvider.invoke(JUnitPlatformProvider.java:124)
[ERROR]  at org.apache.maven.surefire.booter.ForkedBooter.invokeProviderInSameClassLoader(ForkedBooter.java:359)
[ERROR]  at org.apache.maven.surefire.booter.ForkedBooter.runSuitesInProcess(ForkedBooter.java:321)
[ERROR]  at org.apache.maven.surefire.booter.ForkedBooter.execute(ForkedBooter.java:119)
[ERROR]  at org.apache.maven.surefire.booter.ForkedBooter.main(ForkedBooter.java:394)
[ERROR] Caused by: java.lang.ClassNotFoundException: org.junit.platform.commons.PreconditionViolationException
[ERROR]  at java.base/jdk.internal.loader.BuiltinClassLoader.loadClass(BuiltinClassLoader.java:583)
[ERROR]  at java.base/jdk.internal.loader.ClassLoaders$AppClassLoader.loadClass(ClassLoaders.java:178)
[ERROR]  at java.base/java.lang.ClassLoader.loadClass(ClassLoader.java:521)
[ERROR]  ... 8 more
[ERROR] 
[ERROR]  at org.apache.maven.plugin.surefire.booterclient.ForkStarter.fork(ForkStarter.java:675)
[ERROR]  at org.apache.maven.plugin.surefire.booterclient.ForkStarter.run(ForkStarter.java:285)
[ERROR]  at org.apache.maven.plugin.surefire.booterclient.ForkStarter.run(ForkStarter.java:248)
[ERROR]  at org.apache.maven.plugin.surefire.AbstractSurefireMojo.executeProvider(AbstractSurefireMojo.java:1208)
[ERROR]  at org.apache.maven.plugin.surefire.AbstractSurefireMojo.executeAfterPreconditionsChecked(AbstractSurefireMojo.java:1055)
[ERROR]  at org.apache.maven.plugin.surefire.AbstractSurefireMojo.execute(AbstractSurefireMojo.java:882)
[ERROR]  at org.apache.maven.plugin.DefaultBuildPluginManager.executeMojo(DefaultBuildPluginManager.java:137)
[ERROR]  at org.apache.maven.lifecycle.internal.MojoExecutor.execute(MojoExecutor.java:210)
[ERROR]  at org.apache.maven.lifecycle.internal.MojoExecutor.execute(MojoExecutor.java:156)
[ERROR]  at org.apache.maven.lifecycle.internal.MojoExecutor.execute(MojoExecutor.java:148)
[ERROR]  at org.apache.maven.lifecycle.internal.LifecycleModuleBuilder.buildProject(LifecycleModuleBuilder.java:117)
[ERROR]  at org.apache.maven.lifecycle.internal.LifecycleModuleBuilder.buildProject(LifecycleModuleBuilder.java:81)
[ERROR]  at org.apache.maven.lifecycle.internal.builder.singlethreaded.SingleThreadedBuilder.build(SingleThreadedBuilder.java:56)
[ERROR]  at org.apache.maven.lifecycle.internal.LifecycleStarter.execute(LifecycleStarter.java:128)
[ERROR]  at org.apache.maven.DefaultMaven.doExecute(DefaultMaven.java:305)
[ERROR]  at org.apache.maven.DefaultMaven.doExecute(DefaultMaven.java:192)
[ERROR]  at org.apache.maven.DefaultMaven.execute(DefaultMaven.java:105)
[ERROR]  at org.apache.maven.cli.MavenCli.execute(MavenCli.java:956)
[ERROR]  at org.apache.maven.cli.MavenCli.doMain(MavenCli.java:288)
[ERROR]  at org.apache.maven.cli.MavenCli.main(MavenCli.java:192)
[ERROR]  at java.base/jdk.internal.reflect.NativeMethodAccessorImpl.invoke0(Native Method)
[ERROR]  at java.base/jdk.internal.reflect.NativeMethodAccessorImpl.invoke(NativeMethodAccessorImpl.java:62)
[ERROR]  at java.base/jdk.internal.reflect.DelegatingMethodAccessorImpl.invoke(DelegatingMethodAccessorImpl.java:43)
[ERROR]  at java.base/java.lang.reflect.Method.invoke(Method.java:567)
[ERROR]  at org.codehaus.plexus.classworlds.launcher.Launcher.launchEnhanced(Launcher.java:289)
[ERROR]  at org.codehaus.plexus.classworlds.launcher.Launcher.launch(Launcher.java:229)
[ERROR]  at org.codehaus.plexus.classworlds.launcher.Launcher.mainWithExitCode(Launcher.java:415)
[ERROR]  at org.codehaus.plexus.classworlds.launcher.Launcher.main(Launcher.java:356)
[ERROR] -> [Help 1]
org.apache.maven.lifecycle.LifecycleExecutionException: Failed to execute goal org.apache.maven.plugins:maven-surefire-plugin:3.0.0-SNAPSHOT:test (default-test) on project junit-platform-multiple-engines: There are test failures.

Please refer to /home/jenkins/jenkins-slave/workspace/aven-box_maven-surefire_junit550@2/surefire-its/target/JUnitPlatformIT_testMultipleEngines/target/surefire-reports for the individual test results.
Please refer to dump files (if any exist) [date].dump, [date]-jvmRun[N].dump and [date].dumpstream.
There was an error in the forked processorg/junit/platform/commons/PreconditionViolationException
java.lang.NoClassDefFoundError: org/junit/platform/commons/PreconditionViolationException
 at org.apache.maven.surefire.junitplatform.TestPlanScannerFilter.accept(TestPlanScannerFilter.java:53)
 at org.apache.maven.surefire.util.DefaultScanResult.applyFilter(DefaultScanResult.java:102)
 at org.apache.maven.surefire.junitplatform.JUnitPlatformProvider.scanClasspath(JUnitPlatformProvider.java:143)
 at org.apache.maven.surefire.junitplatform.JUnitPlatformProvider.invoke(JUnitPlatformProvider.java:124)
 at org.apache.maven.surefire.booter.ForkedBooter.invokeProviderInSameClassLoader(ForkedBooter.java:359)
 at org.apache.maven.surefire.booter.ForkedBooter.runSuitesInProcess(ForkedBooter.java:321)
 at org.apache.maven.surefire.booter.ForkedBooter.execute(ForkedBooter.java:119)
 at org.apache.maven.surefire.booter.ForkedBooter.main(ForkedBooter.java:394)
Caused by: java.lang.ClassNotFoundException: org.junit.platform.commons.PreconditionViolationException
 at java.base/jdk.internal.loader.BuiltinClassLoader.loadClass(BuiltinClassLoader.java:583)
 at java.base/jdk.internal.loader.ClassLoaders$AppClassLoader.loadClass(ClassLoaders.java:178)
 at java.base/java.lang.ClassLoader.loadClass(ClassLoader.java:521)
 ... 8 more

org.apache.maven.surefire.booter.SurefireBooterForkException: There was an error in the forked processorg/junit/platform/commons/PreconditionViolationException
java.lang.NoClassDefFoundError: org/junit/platform/commons/PreconditionViolationException
 at org.apache.maven.surefire.junitplatform.TestPlanScannerFilter.accept(TestPlanScannerFilter.java:53)
 at org.apache.maven.surefire.util.DefaultScanResult.applyFilter(DefaultScanResult.java:102)
 at org.apache.maven.surefire.junitplatform.JUnitPlatformProvider.scanClasspath(JUnitPlatformProvider.java:143)
 at org.apache.maven.surefire.junitplatform.JUnitPlatformProvider.invoke(JUnitPlatformProvider.java:124)
 at org.apache.maven.surefire.booter.ForkedBooter.invokeProviderInSameClassLoader(ForkedBooter.java:359)
 at org.apache.maven.surefire.booter.ForkedBooter.runSuitesInProcess(ForkedBooter.java:321)
 at org.apache.maven.surefire.booter.ForkedBooter.execute(ForkedBooter.java:119)
 at org.apache.maven.surefire.booter.ForkedBooter.main(ForkedBooter.java:394)
Caused by: java.lang.ClassNotFoundException: org.junit.platform.commons.PreconditionViolationException
 at java.base/jdk.internal.loader.BuiltinClassLoader.loadClass(BuiltinClassLoader.java:583)
 at java.base/jdk.internal.loader.ClassLoaders$AppClassLoader.loadClass(ClassLoaders.java:178)
 at java.base/java.lang.ClassLoader.loadClass(ClassLoader.java:521)
 ... 8 more

 at org.apache.maven.plugin.surefire.booterclient.ForkStarter.fork(ForkStarter.java:675)
 at org.apache.maven.plugin.surefire.booterclient.ForkStarter.run(ForkStarter.java:285)
 at org.apache.maven.plugin.surefire.booterclient.ForkStarter.run(ForkStarter.java:248)
 at org.apache.maven.plugin.surefire.AbstractSurefireMojo.executeProvider(AbstractSurefireMojo.java:1208)
 at org.apache.maven.plugin.surefire.AbstractSurefireMojo.executeAfterPreconditionsChecked(AbstractSurefireMojo.java:1055)
 at org.apache.maven.plugin.surefire.AbstractSurefireMojo.execute(AbstractSurefireMojo.java:882)
 at org.apache.maven.plugin.DefaultBuildPluginManager.executeMojo(DefaultBuildPluginManager.java:137)
 at org.apache.maven.lifecycle.internal.MojoExecutor.execute(MojoExecutor.java:210)
 at org.apache.maven.lifecycle.internal.MojoExecutor.execute(MojoExecutor.java:156)
 at org.apache.maven.lifecycle.internal.MojoExecutor.execute(MojoExecutor.java:148)
 at org.apache.maven.lifecycle.internal.LifecycleModuleBuilder.buildProject(LifecycleModuleBuilder.java:117)
 at org.apache.maven.lifecycle.internal.LifecycleModuleBuilder.buildProject(LifecycleModuleBuilder.java:81)
 at org.apache.maven.lifecycle.internal.builder.singlethreaded.SingleThreadedBuilder.build(SingleThreadedBuilder.java:56)
 at org.apache.maven.lifecycle.internal.LifecycleStarter.execute(LifecycleStarter.java:128)
 at org.apache.maven.DefaultMaven.doExecute(DefaultMaven.java:305)
 at org.apache.maven.DefaultMaven.doExecute(DefaultMaven.java:192)
 at org.apache.maven.DefaultMaven.execute(DefaultMaven.java:105)
 at org.apache.maven.cli.MavenCli.execute(MavenCli.java:956)
 at org.apache.maven.cli.MavenCli.doMain(MavenCli.java:288)
 at org.apache.maven.cli.MavenCli.main(MavenCli.java:192)
 at java.base/jdk.internal.reflect.NativeMethodAccessorImpl.invoke0(Native Method)
 at java.base/jdk.internal.reflect.NativeMethodAccessorImpl.invoke(NativeMethodAccessorImpl.java:62)
 at java.base/jdk.internal.reflect.DelegatingMethodAccessorImpl.invoke(DelegatingMethodAccessorImpl.java:43)
 at java.base/java.lang.reflect.Method.invoke(Method.java:567)
 at org.codehaus.plexus.classworlds.launcher.Launcher.launchEnhanced(Launcher.java:289)
 at org.codehaus.plexus.classworlds.launcher.Launcher.launch(Launcher.java:229)
 at org.codehaus.plexus.classworlds.launcher.Launcher.mainWithExitCode(Launcher.java:415)
 at org.codehaus.plexus.classworlds.launcher.Launcher.main(Launcher.java:356)

    at org.apache.maven.lifecycle.internal.MojoExecutor.execute (MojoExecutor.java:215)
    at org.apache.maven.lifecycle.internal.MojoExecutor.execute (MojoExecutor.java:156)
    at org.apache.maven.lifecycle.internal.MojoExecutor.execute (MojoExecutor.java:148)
    at org.apache.maven.lifecycle.internal.LifecycleModuleBuilder.buildProject (LifecycleModuleBuilder.java:117)
    at org.apache.maven.lifecycle.internal.LifecycleModuleBuilder.buildProject (LifecycleModuleBuilder.java:81)
    at org.apache.maven.lifecycle.internal.builder.singlethreaded.SingleThreadedBuilder.build (SingleThreadedBuilder.java:56)
    at org.apache.maven.lifecycle.internal.LifecycleStarter.execute (LifecycleStarter.java:128)
    at org.apache.maven.DefaultMaven.doExecute (DefaultMaven.java:305)
    at org.apache.maven.DefaultMaven.doExecute (DefaultMaven.java:192)
    at org.apache.maven.DefaultMaven.execute (DefaultMaven.java:105)
    at org.apache.maven.cli.MavenCli.execute (MavenCli.java:956)
    at org.apache.maven.cli.MavenCli.doMain (MavenCli.java:288)
    at org.apache.maven.cli.MavenCli.main (MavenCli.java:192)
    at jdk.internal.reflect.NativeMethodAccessorImpl.invoke0 (Native Method)
    at jdk.internal.reflect.NativeMethodAccessorImpl.invoke (NativeMethodAccessorImpl.java:62)
    at jdk.internal.reflect.DelegatingMethodAccessorImpl.invoke (DelegatingMethodAccessorImpl.java:43)
    at java.lang.reflect.Method.invoke (Method.java:567)
    at org.codehaus.plexus.classworlds.launcher.Launcher.launchEnhanced (Launcher.java:289)
    at org.codehaus.plexus.classworlds.launcher.Launcher.launch (Launcher.java:229)
    at org.codehaus.plexus.classworlds.launcher.Launcher.mainWithExitCode (Launcher.java:415)
    at org.codehaus.plexus.classworlds.launcher.Launcher.main (Launcher.java:356)
Caused by: org.apache.maven.plugin.MojoExecutionException: There are test failures.

Please refer to /home/jenkins/jenkins-slave/workspace/aven-box_maven-surefire_junit550@2/surefire-its/target/JUnitPlatformIT_testMultipleEngines/target/surefire-reports for the individual test results.
Please refer to dump files (if any exist) [date].dump, [date]-jvmRun[N].dump and [date].dumpstream.
There was an error in the forked processorg/junit/platform/commons/PreconditionViolationException
java.lang.NoClassDefFoundError: org/junit/platform/commons/PreconditionViolationException
 at org.apache.maven.surefire.junitplatform.TestPlanScannerFilter.accept(TestPlanScannerFilter.java:53)
 at org.apache.maven.surefire.util.DefaultScanResult.applyFilter(DefaultScanResult.java:102)
 at org.apache.maven.surefire.junitplatform.JUnitPlatformProvider.scanClasspath(JUnitPlatformProvider.java:143)
 at org.apache.maven.surefire.junitplatform.JUnitPlatformProvider.invoke(JUnitPlatformProvider.java:124)
 at org.apache.maven.surefire.booter.ForkedBooter.invokeProviderInSameClassLoader(ForkedBooter.java:359)
 at org.apache.maven.surefire.booter.ForkedBooter.runSuitesInProcess(ForkedBooter.java:321)
 at org.apache.maven.surefire.booter.ForkedBooter.execute(ForkedBooter.java:119)
 at org.apache.maven.surefire.booter.ForkedBooter.main(ForkedBooter.java:394)
Caused by: java.lang.ClassNotFoundException: org.junit.platform.commons.PreconditionViolationException
 at java.base/jdk.internal.loader.BuiltinClassLoader.loadClass(BuiltinClassLoader.java:583)
 at java.base/jdk.internal.loader.ClassLoaders$AppClassLoader.loadClass(ClassLoaders.java:178)
 at java.base/java.lang.ClassLoader.loadClass(ClassLoader.java:521)
 ... 8 more

org.apache.maven.surefire.booter.SurefireBooterForkException: There was an error in the forked processorg/junit/platform/commons/PreconditionViolationException
java.lang.NoClassDefFoundError: org/junit/platform/commons/PreconditionViolationException
 at org.apache.maven.surefire.junitplatform.TestPlanScannerFilter.accept(TestPlanScannerFilter.java:53)
 at org.apache.maven.surefire.util.DefaultScanResult.applyFilter(DefaultScanResult.java:102)
 at org.apache.maven.surefire.junitplatform.JUnitPlatformProvider.scanClasspath(JUnitPlatformProvider.java:143)
 at org.apache.maven.surefire.junitplatform.JUnitPlatformProvider.invoke(JUnitPlatformProvider.java:124)
 at org.apache.maven.surefire.booter.ForkedBooter.invokeProviderInSameClassLoader(ForkedBooter.java:359)
 at org.apache.maven.surefire.booter.ForkedBooter.runSuitesInProcess(ForkedBooter.java:321)
 at org.apache.maven.surefire.booter.ForkedBooter.execute(ForkedBooter.java:119)
 at org.apache.maven.surefire.booter.ForkedBooter.main(ForkedBooter.java:394)
Caused by: java.lang.ClassNotFoundException: org.junit.platform.commons.PreconditionViolationException
 at java.base/jdk.internal.loader.BuiltinClassLoader.loadClass(BuiltinClassLoader.java:583)
 at java.base/jdk.internal.loader.ClassLoaders$AppClassLoader.loadClass(ClassLoaders.java:178)
 at java.base/java.lang.ClassLoader.loadClass(ClassLoader.java:521)
 ... 8 more

 at org.apache.maven.plugin.surefire.booterclient.ForkStarter.fork(ForkStarter.java:675)
 at org.apache.maven.plugin.surefire.booterclient.ForkStarter.run(ForkStarter.java:285)
 at org.apache.maven.plugin.surefire.booterclient.ForkStarter.run(ForkStarter.java:248)
 at org.apache.maven.plugin.surefire.AbstractSurefireMojo.executeProvider(AbstractSurefireMojo.java:1208)
 at org.apache.maven.plugin.surefire.AbstractSurefireMojo.executeAfterPreconditionsChecked(AbstractSurefireMojo.java:1055)
 at org.apache.maven.plugin.surefire.AbstractSurefireMojo.execute(AbstractSurefireMojo.java:882)
 at org.apache.maven.plugin.DefaultBuildPluginManager.executeMojo(DefaultBuildPluginManager.java:137)
 at org.apache.maven.lifecycle.internal.MojoExecutor.execute(MojoExecutor.java:210)
 at org.apache.maven.lifecycle.internal.MojoExecutor.execute(MojoExecutor.java:156)
 at org.apache.maven.lifecycle.internal.MojoExecutor.execute(MojoExecutor.java:148)
 at org.apache.maven.lifecycle.internal.LifecycleModuleBuilder.buildProject(LifecycleModuleBuilder.java:117)
 at org.apache.maven.lifecycle.internal.LifecycleModuleBuilder.buildProject(LifecycleModuleBuilder.java:81)
 at org.apache.maven.lifecycle.internal.builder.singlethreaded.SingleThreadedBuilder.build(SingleThreadedBuilder.java:56)
 at org.apache.maven.lifecycle.internal.LifecycleStarter.execute(LifecycleStarter.java:128)
 at org.apache.maven.DefaultMaven.doExecute(DefaultMaven.java:305)
 at org.apache.maven.DefaultMaven.doExecute(DefaultMaven.java:192)
 at org.apache.maven.DefaultMaven.execute(DefaultMaven.java:105)
 at org.apache.maven.cli.MavenCli.execute(MavenCli.java:956)
 at org.apache.maven.cli.MavenCli.doMain(MavenCli.java:288)
 at org.apache.maven.cli.MavenCli.main(MavenCli.java:192)
 at java.base/jdk.internal.reflect.NativeMethodAccessorImpl.invoke0(Native Method)
 at java.base/jdk.internal.reflect.NativeMethodAccessorImpl.invoke(NativeMethodAccessorImpl.java:62)
 at java.base/jdk.internal.reflect.DelegatingMethodAccessorImpl.invoke(DelegatingMethodAccessorImpl.java:43)
 at java.base/java.lang.reflect.Method.invoke(Method.java:567)
 at org.codehaus.plexus.classworlds.launcher.Launcher.launchEnhanced(Launcher.java:289)
 at org.codehaus.plexus.classworlds.launcher.Launcher.launch(Launcher.java:229)
 at org.codehaus.plexus.classworlds.launcher.Launcher.mainWithExitCode(Launcher.java:415)
 at org.codehaus.plexus.classworlds.launcher.Launcher.main(Launcher.java:356)

    at org.apache.maven.plugin.surefire.SurefireHelper.throwException (SurefireHelper.java:266)
    at org.apache.maven.plugin.surefire.SurefireHelper.reportExecution (SurefireHelper.java:159)
    at org.apache.maven.plugin.surefire.SurefirePlugin.handleSummary (SurefirePlugin.java:377)
    at org.apache.maven.plugin.surefire.AbstractSurefireMojo.executeAfterPreconditionsChecked (AbstractSurefireMojo.java:1071)
    at org.apache.maven.plugin.surefire.AbstractSurefireMojo.execute (AbstractSurefireMojo.java:882)
    at org.apache.maven.plugin.DefaultBuildPluginManager.executeMojo (DefaultBuildPluginManager.java:137)
    at org.apache.maven.lifecycle.internal.MojoExecutor.execute (MojoExecutor.java:210)
    at org.apache.maven.lifecycle.internal.MojoExecutor.execute (MojoExecutor.java:156)
    at org.apache.maven.lifecycle.internal.MojoExecutor.execute (MojoExecutor.java:148)
    at org.apache.maven.lifecycle.internal.LifecycleModuleBuilder.buildProject (LifecycleModuleBuilder.java:117)
    at org.apache.maven.lifecycle.internal.LifecycleModuleBuilder.buildProject (LifecycleModuleBuilder.java:81)
    at org.apache.maven.lifecycle.internal.builder.singlethreaded.SingleThreadedBuilder.build (SingleThreadedBuilder.java:56)
    at org.apache.maven.lifecycle.internal.LifecycleStarter.execute (LifecycleStarter.java:128)
    at org.apache.maven.DefaultMaven.doExecute (DefaultMaven.java:305)
    at org.apache.maven.DefaultMaven.doExecute (DefaultMaven.java:192)
    at org.apache.maven.DefaultMaven.execute (DefaultMaven.java:105)
    at org.apache.maven.cli.MavenCli.execute (MavenCli.java:956)
    at org.apache.maven.cli.MavenCli.doMain (MavenCli.java:288)
    at org.apache.maven.cli.MavenCli.main (MavenCli.java:192)
    at jdk.internal.reflect.NativeMethodAccessorImpl.invoke0 (Native Method)
    at jdk.internal.reflect.NativeMethodAccessorImpl.invoke (NativeMethodAccessorImpl.java:62)
    at jdk.internal.reflect.DelegatingMethodAccessorImpl.invoke (DelegatingMethodAccessorImpl.java:43)
    at java.lang.reflect.Method.invoke (Method.java:567)
    at org.codehaus.plexus.classworlds.launcher.Launcher.launchEnhanced (Launcher.java:289)
    at org.codehaus.plexus.classworlds.launcher.Launcher.launch (Launcher.java:229)
    at org.codehaus.plexus.classworlds.launcher.Launcher.mainWithExitCode (Launcher.java:415)
    at org.codehaus.plexus.classworlds.launcher.Launcher.main (Launcher.java:356)
Caused by: org.apache.maven.surefire.booter.SurefireBooterForkException: There was an error in the forked processorg/junit/platform/commons/PreconditionViolationException
java.lang.NoClassDefFoundError: org/junit/platform/commons/PreconditionViolationException
 at org.apache.maven.surefire.junitplatform.TestPlanScannerFilter.accept(TestPlanScannerFilter.java:53)
 at org.apache.maven.surefire.util.DefaultScanResult.applyFilter(DefaultScanResult.java:102)
 at org.apache.maven.surefire.junitplatform.JUnitPlatformProvider.scanClasspath(JUnitPlatformProvider.java:143)
 at org.apache.maven.surefire.junitplatform.JUnitPlatformProvider.invoke(JUnitPlatformProvider.java:124)
 at org.apache.maven.surefire.booter.ForkedBooter.invokeProviderInSameClassLoader(ForkedBooter.java:359)
 at org.apache.maven.surefire.booter.ForkedBooter.runSuitesInProcess(ForkedBooter.java:321)
 at org.apache.maven.surefire.booter.ForkedBooter.execute(ForkedBooter.java:119)
 at org.apache.maven.surefire.booter.ForkedBooter.main(ForkedBooter.java:394)
Caused by: java.lang.ClassNotFoundException: org.junit.platform.commons.PreconditionViolationException
 at java.base/jdk.internal.loader.BuiltinClassLoader.loadClass(BuiltinClassLoader.java:583)
 at java.base/jdk.internal.loader.ClassLoaders$AppClassLoader.loadClass(ClassLoaders.java:178)
 at java.base/java.lang.ClassLoader.loadClass(ClassLoader.java:521)
 ... 8 more

    at org.apache.maven.plugin.surefire.booterclient.ForkStarter.fork (ForkStarter.java:675)
    at org.apache.maven.plugin.surefire.booterclient.ForkStarter.run (ForkStarter.java:285)
    at org.apache.maven.plugin.surefire.booterclient.ForkStarter.run (ForkStarter.java:248)
    at org.apache.maven.plugin.surefire.AbstractSurefireMojo.executeProvider (AbstractSurefireMojo.java:1208)
    at org.apache.maven.plugin.surefire.AbstractSurefireMojo.executeAfterPreconditionsChecked (AbstractSurefireMojo.java:1055)
    at org.apache.maven.plugin.surefire.AbstractSurefireMojo.execute (AbstractSurefireMojo.java:882)
    at org.apache.maven.plugin.DefaultBuildPluginManager.executeMojo (DefaultBuildPluginManager.java:137)
    at org.apache.maven.lifecycle.internal.MojoExecutor.execute (MojoExecutor.java:210)
    at org.apache.maven.lifecycle.internal.MojoExecutor.execute (MojoExecutor.java:156)
    at org.apache.maven.lifecycle.internal.MojoExecutor.execute (MojoExecutor.java:148)
    at org.apache.maven.lifecycle.internal.LifecycleModuleBuilder.buildProject (LifecycleModuleBuilder.java:117)
    at org.apache.maven.lifecycle.internal.LifecycleModuleBuilder.buildProject (LifecycleModuleBuilder.java:81)
    at org.apache.maven.lifecycle.internal.builder.singlethreaded.SingleThreadedBuilder.build (SingleThreadedBuilder.java:56)
    at org.apache.maven.lifecycle.internal.LifecycleStarter.execute (LifecycleStarter.java:128)
    at org.apache.maven.DefaultMaven.doExecute (DefaultMaven.java:305)
    at org.apache.maven.DefaultMaven.doExecute (DefaultMaven.java:192)
    at org.apache.maven.DefaultMaven.execute (DefaultMaven.java:105)
    at org.apache.maven.cli.MavenCli.execute (MavenCli.java:956)
    at org.apache.maven.cli.MavenCli.doMain (MavenCli.java:288)
    at org.apache.maven.cli.MavenCli.main (MavenCli.java:192)
    at jdk.internal.reflect.NativeMethodAccessorImpl.invoke0 (Native Method)
    at jdk.internal.reflect.NativeMethodAccessorImpl.invoke (NativeMethodAccessorImpl.java:62)
    at jdk.internal.reflect.DelegatingMethodAccessorImpl.invoke (DelegatingMethodAccessorImpl.java:43)
    at java.lang.reflect.Method.invoke (Method.java:567)
    at org.codehaus.plexus.classworlds.launcher.Launcher.launchEnhanced (Launcher.java:289)
    at org.codehaus.plexus.classworlds.launcher.Launcher.launch (Launcher.java:229)
    at org.codehaus.plexus.classworlds.launcher.Launcher.mainWithExitCode (Launcher.java:415)
    at org.codehaus.plexus.classworlds.launcher.Launcher.main (Launcher.java:356)
[ERROR] 
[ERROR] Re-run Maven using the -X switch to enable full debug logging.
[ERROR] 
[ERROR] For more information about the errors and possible solutions, please read the following articles:
[ERROR] [Help 1] http://cwiki.apache.org/confluence/display/MAVEN/MojoExecutionException


Stack Trace:
org.apache.maven.surefire.its.fixture.SurefireVerifierException: 
Exit code was non-zero: 1; command line and log = 
/home/jenkins/tools/maven/apache-maven-3.6.0/bin/mvn -e --batch-mode -Dmaven.repo.local=/home/jenkins/jenkins-slave/workspace/aven-box_maven-surefire_junit550@2/.m2 org.apache.maven.plugins:maven-clean-plugin:clean -Dsurefire.version=3.0.0-SNAPSHOT -Djacoco.agent=-javaagent:/home/jenkins/jenkins-slave/workspace/aven-box_maven-surefire_junit550@2/.m2/org/jacoco/org.jacoco.agent/0.8.4/org.jacoco.agent-0.8.4-runtime.jar=destfile=/home/jenkins/jenkins-slave/workspace/aven-box_maven-surefire_junit550@2/surefire-its/target/jacoco-it.exec,includes=**/failsafe/*:**/failsafe/**/*:**/surefire/*:**/surefire/**/*,excludes=**/HelpMojo.class:**/shadefire/**/*:org/jacoco/**/*:com/vladium/emma/rt/* -Dhttps.protocols=TLSv1,TLSv1.1,TLSv1.2 test
[INFO] Error stacktraces are turned on.
[INFO] Scanning for projects...
[INFO] 
[INFO] --< org.apache.maven.plugins.surefire:junit-platform-multiple-engines >--
[INFO] Building Test for JUnit 5: Platform hosting multiple test engines 1.0
[INFO] --------------------------------[ jar ]---------------------------------
[INFO] Downloading from central: https://repo.maven.apache.org/maven2/org/junit/jupiter/junit-jupiter-params/5.5.0/junit-jupiter-params-5.5.0.pom
[INFO] Downloaded from central: https://repo.maven.apache.org/maven2/org/junit/jupiter/junit-jupiter-params/5.5.0/junit-jupiter-params-5.5.0.pom (2.2 kB at 7.2 kB/s)
[INFO] Downloading from central: https://repo.maven.apache.org/maven2/org/junit/jupiter/junit-jupiter-params/5.5.0/junit-jupiter-params-5.5.0.jar
[INFO] Downloaded from central: https://repo.maven.apache.org/maven2/org/junit/jupiter/junit-jupiter-params/5.5.0/junit-jupiter-params-5.5.0.jar (549 kB at 6.7 MB/s)
[INFO] 
[INFO] --- maven-clean-plugin:2.5:clean (default-cli) @ junit-platform-multiple-engines ---
[INFO] 
[INFO] --- maven-resources-plugin:2.6:resources (default-resources) @ junit-platform-multiple-engines ---
[WARNING] Using platform encoding (ISO-8859-1 actually) to copy filtered resources, i.e. build is platform dependent!
[INFO] skip non existing resourceDirectory /home/jenkins/jenkins-slave/workspace/aven-box_maven-surefire_junit550@2/surefire-its/target/JUnitPlatformIT_testMultipleEngines/src/main/resources
[INFO] 
[INFO] --- maven-compiler-plugin:3.1:compile (default-compile) @ junit-platform-multiple-engines ---
[INFO] No sources to compile
[INFO] 
[INFO] --- maven-resources-plugin:2.6:testResources (default-testResources) @ junit-platform-multiple-engines ---
[WARNING] Using platform encoding (ISO-8859-1 actually) to copy filtered resources, i.e. build is platform dependent!
[INFO] skip non existing resourceDirectory /home/jenkins/jenkins-slave/workspace/aven-box_maven-surefire_junit550@2/surefire-its/target/JUnitPlatformIT_testMultipleEngines/src/test/resources
[INFO] 
[INFO] --- maven-compiler-plugin:3.1:testCompile (default-testCompile) @ junit-platform-multiple-engines ---
[INFO] Changes detected - recompiling the module!
[WARNING] File encoding has not been set, using platform encoding ISO-8859-1, i.e. build is platform dependent!
[INFO] Compiling 3 source files to /home/jenkins/jenkins-slave/workspace/aven-box_maven-surefire_junit550@2/surefire-its/target/JUnitPlatformIT_testMultipleEngines/target/test-classes
[INFO] 
[INFO] --- maven-surefire-plugin:3.0.0-SNAPSHOT:test (default-test) @ junit-platform-multiple-engines ---
[INFO] Surefire report directory: /home/jenkins/jenkins-slave/workspace/aven-box_maven-surefire_junit550@2/surefire-its/target/JUnitPlatformIT_testMultipleEngines/target/surefire-reports
[INFO] 
[INFO] -------------------------------------------------------
[INFO]  T E S T S
[INFO] -------------------------------------------------------
[ERROR] org/junit/platform/commons/PreconditionViolationException
[INFO] 
[INFO] Results:
[INFO] 
[INFO] Tests run: 0, Failures: 0, Errors: 0, Skipped: 0
[INFO] 
[INFO] ------------------------------------------------------------------------
[INFO] BUILD FAILURE
[INFO] ------------------------------------------------------------------------
[INFO] Total time:  3.770 s
[INFO] Finished at: 2019-07-12T18:32:23Z
[INFO] ------------------------------------------------------------------------
[ERROR] Failed to execute goal org.apache.maven.plugins:maven-surefire-plugin:3.0.0-SNAPSHOT:test (default-test) on project junit-platform-multiple-engines: There are test failures.
[ERROR] 
[ERROR] Please refer to /home/jenkins/jenkins-slave/workspace/aven-box_maven-surefire_junit550@2/surefire-its/target/JUnitPlatformIT_testMultipleEngines/target/surefire-reports for the individual test results.
[ERROR] Please refer to dump files (if any exist) [date].dump, [date]-jvmRun[N].dump and [date].dumpstream.
[ERROR] There was an error in the forked processorg/junit/platform/commons/PreconditionViolationException
[ERROR] java.lang.NoClassDefFoundError: org/junit/platform/commons/PreconditionViolationException
[ERROR] 	at org.apache.maven.surefire.junitplatform.TestPlanScannerFilter.accept(TestPlanScannerFilter.java:53)
[ERROR] 	at org.apache.maven.surefire.util.DefaultScanResult.applyFilter(DefaultScanResult.java:102)
[ERROR] 	at org.apache.maven.surefire.junitplatform.JUnitPlatformProvider.scanClasspath(JUnitPlatformProvider.java:143)
[ERROR] 	at org.apache.maven.surefire.junitplatform.JUnitPlatformProvider.invoke(JUnitPlatformProvider.java:124)
[ERROR] 	at org.apache.maven.surefire.booter.ForkedBooter.invokeProviderInSameClassLoader(ForkedBooter.java:359)
[ERROR] 	at org.apache.maven.surefire.booter.ForkedBooter.runSuitesInProcess(ForkedBooter.java:321)
[ERROR] 	at org.apache.maven.surefire.booter.ForkedBooter.execute(ForkedBooter.java:119)
[ERROR] 	at org.apache.maven.surefire.booter.ForkedBooter.main(ForkedBooter.java:394)
[ERROR] Caused by: java.lang.ClassNotFoundException: org.junit.platform.commons.PreconditionViolationException
[ERROR] 	at java.base/jdk.internal.loader.BuiltinClassLoader.loadClass(BuiltinClassLoader.java:583)
[ERROR] 	at java.base/jdk.internal.loader.ClassLoaders$AppClassLoader.loadClass(ClassLoaders.java:178)
[ERROR] 	at java.base/java.lang.ClassLoader.loadClass(ClassLoader.java:521)
[ERROR] 	... 8 more
[ERROR] 
[ERROR] org.apache.maven.surefire.booter.SurefireBooterForkException: There was an error in the forked processorg/junit/platform/commons/PreconditionViolationException
[ERROR] java.lang.NoClassDefFoundError: org/junit/platform/commons/PreconditionViolationException
[ERROR] 	at org.apache.maven.surefire.junitplatform.TestPlanScannerFilter.accept(TestPlanScannerFilter.java:53)
[ERROR] 	at org.apache.maven.surefire.util.DefaultScanResult.applyFilter(DefaultScanResult.java:102)
[ERROR] 	at org.apache.maven.surefire.junitplatform.JUnitPlatformProvider.scanClasspath(JUnitPlatformProvider.java:143)
[ERROR] 	at org.apache.maven.surefire.junitplatform.JUnitPlatformProvider.invoke(JUnitPlatformProvider.java:124)
[ERROR] 	at org.apache.maven.surefire.booter.ForkedBooter.invokeProviderInSameClassLoader(ForkedBooter.java:359)
[ERROR] 	at org.apache.maven.surefire.booter.ForkedBooter.runSuitesInProcess(ForkedBooter.java:321)
[ERROR] 	at org.apache.maven.surefire.booter.ForkedBooter.execute(ForkedBooter.java:119)
[ERROR] 	at org.apache.maven.surefire.booter.ForkedBooter.main(ForkedBooter.java:394)
[ERROR] Caused by: java.lang.ClassNotFoundException: org.junit.platform.commons.PreconditionViolationException
[ERROR] 	at java.base/jdk.internal.loader.BuiltinClassLoader.loadClass(BuiltinClassLoader.java:583)
[ERROR] 	at java.base/jdk.internal.loader.ClassLoaders$AppClassLoader.loadClass(ClassLoaders.java:178)
[ERROR] 	at java.base/java.lang.ClassLoader.loadClass(ClassLoader.java:521)
[ERROR] 	... 8 more
[ERROR] 
[ERROR] 	at org.apache.maven.plugin.surefire.booterclient.ForkStarter.fork(ForkStarter.java:675)
[ERROR] 	at org.apache.maven.plugin.surefire.booterclient.ForkStarter.run(ForkStarter.java:285)
[ERROR] 	at org.apache.maven.plugin.surefire.booterclient.ForkStarter.run(ForkStarter.java:248)
[ERROR] 	at org.apache.maven.plugin.surefire.AbstractSurefireMojo.executeProvider(AbstractSurefireMojo.java:1208)
[ERROR] 	at org.apache.maven.plugin.surefire.AbstractSurefireMojo.executeAfterPreconditionsChecked(AbstractSurefireMojo.java:1055)
[ERROR] 	at org.apache.maven.plugin.surefire.AbstractSurefireMojo.execute(AbstractSurefireMojo.java:882)
[ERROR] 	at org.apache.maven.plugin.DefaultBuildPluginManager.executeMojo(DefaultBuildPluginManager.java:137)
[ERROR] 	at org.apache.maven.lifecycle.internal.MojoExecutor.execute(MojoExecutor.java:210)
[ERROR] 	at org.apache.maven.lifecycle.internal.MojoExecutor.execute(MojoExecutor.java:156)
[ERROR] 	at org.apache.maven.lifecycle.internal.MojoExecutor.execute(MojoExecutor.java:148)
[ERROR] 	at org.apache.maven.lifecycle.internal.LifecycleModuleBuilder.buildProject(LifecycleModuleBuilder.java:117)
[ERROR] 	at org.apache.maven.lifecycle.internal.LifecycleModuleBuilder.buildProject(LifecycleModuleBuilder.java:81)
[ERROR] 	at org.apache.maven.lifecycle.internal.builder.singlethreaded.SingleThreadedBuilder.build(SingleThreadedBuilder.java:56)
[ERROR] 	at org.apache.maven.lifecycle.internal.LifecycleStarter.execute(LifecycleStarter.java:128)
[ERROR] 	at org.apache.maven.DefaultMaven.doExecute(DefaultMaven.java:305)
[ERROR] 	at org.apache.maven.DefaultMaven.doExecute(DefaultMaven.java:192)
[ERROR] 	at org.apache.maven.DefaultMaven.execute(DefaultMaven.java:105)
[ERROR] 	at org.apache.maven.cli.MavenCli.execute(MavenCli.java:956)
[ERROR] 	at org.apache.maven.cli.MavenCli.doMain(MavenCli.java:288)
[ERROR] 	at org.apache.maven.cli.MavenCli.main(MavenCli.java:192)
[ERROR] 	at java.base/jdk.internal.reflect.NativeMethodAccessorImpl.invoke0(Native Method)
[ERROR] 	at java.base/jdk.internal.reflect.NativeMethodAccessorImpl.invoke(NativeMethodAccessorImpl.java:62)
[ERROR] 	at java.base/jdk.internal.reflect.DelegatingMethodAccessorImpl.invoke(DelegatingMethodAccessorImpl.java:43)
[ERROR] 	at java.base/java.lang.reflect.Method.invoke(Method.java:567)
[ERROR] 	at org.codehaus.plexus.classworlds.launcher.Launcher.launchEnhanced(Launcher.java:289)
[ERROR] 	at org.codehaus.plexus.classworlds.launcher.Launcher.launch(Launcher.java:229)
[ERROR] 	at org.codehaus.plexus.classworlds.launcher.Launcher.mainWithExitCode(Launcher.java:415)
[ERROR] 	at org.codehaus.plexus.classworlds.launcher.Launcher.main(Launcher.java:356)
[ERROR] -> [Help 1]
org.apache.maven.lifecycle.LifecycleExecutionException: Failed to execute goal org.apache.maven.plugins:maven-surefire-plugin:3.0.0-SNAPSHOT:test (default-test) on project junit-platform-multiple-engines: There are test failures.

Please refer to /home/jenkins/jenkins-slave/workspace/aven-box_maven-surefire_junit550@2/surefire-its/target/JUnitPlatformIT_testMultipleEngines/target/surefire-reports for the individual test results.
Please refer to dump files (if any exist) [date].dump, [date]-jvmRun[N].dump and [date].dumpstream.
There was an error in the forked processorg/junit/platform/commons/PreconditionViolationException
java.lang.NoClassDefFoundError: org/junit/platform/commons/PreconditionViolationException
	at org.apache.maven.surefire.junitplatform.TestPlanScannerFilter.accept(TestPlanScannerFilter.java:53)
	at org.apache.maven.surefire.util.DefaultScanResult.applyFilter(DefaultScanResult.java:102)
	at org.apache.maven.surefire.junitplatform.JUnitPlatformProvider.scanClasspath(JUnitPlatformProvider.java:143)
	at org.apache.maven.surefire.junitplatform.JUnitPlatformProvider.invoke(JUnitPlatformProvider.java:124)
	at org.apache.maven.surefire.booter.ForkedBooter.invokeProviderInSameClassLoader(ForkedBooter.java:359)
	at org.apache.maven.surefire.booter.ForkedBooter.runSuitesInProcess(ForkedBooter.java:321)
	at org.apache.maven.surefire.booter.ForkedBooter.execute(ForkedBooter.java:119)
	at org.apache.maven.surefire.booter.ForkedBooter.main(ForkedBooter.java:394)
Caused by: java.lang.ClassNotFoundException: org.junit.platform.commons.PreconditionViolationException
	at java.base/jdk.internal.loader.BuiltinClassLoader.loadClass(BuiltinClassLoader.java:583)
	at java.base/jdk.internal.loader.ClassLoaders$AppClassLoader.loadClass(ClassLoaders.java:178)
	at java.base/java.lang.ClassLoader.loadClass(ClassLoader.java:521)
	... 8 more

org.apache.maven.surefire.booter.SurefireBooterForkException: There was an error in the forked processorg/junit/platform/commons/PreconditionViolationException
java.lang.NoClassDefFoundError: org/junit/platform/commons/PreconditionViolationException
	at org.apache.maven.surefire.junitplatform.TestPlanScannerFilter.accept(TestPlanScannerFilter.java:53)
	at org.apache.maven.surefire.util.DefaultScanResult.applyFilter(DefaultScanResult.java:102)
	at org.apache.maven.surefire.junitplatform.JUnitPlatformProvider.scanClasspath(JUnitPlatformProvider.java:143)
	at org.apache.maven.surefire.junitplatform.JUnitPlatformProvider.invoke(JUnitPlatformProvider.java:124)
	at org.apache.maven.surefire.booter.ForkedBooter.invokeProviderInSameClassLoader(ForkedBooter.java:359)
	at org.apache.maven.surefire.booter.ForkedBooter.runSuitesInProcess(ForkedBooter.java:321)
	at org.apache.maven.surefire.booter.ForkedBooter.execute(ForkedBooter.java:119)
	at org.apache.maven.surefire.booter.ForkedBooter.main(ForkedBooter.java:394)
Caused by: java.lang.ClassNotFoundException: org.junit.platform.commons.PreconditionViolationException
	at java.base/jdk.internal.loader.BuiltinClassLoader.loadClass(BuiltinClassLoader.java:583)
	at java.base/jdk.internal.loader.ClassLoaders$AppClassLoader.loadClass(ClassLoaders.java:178)
	at java.base/java.lang.ClassLoader.loadClass(ClassLoader.java:521)
	... 8 more

	at org.apache.maven.plugin.surefire.booterclient.ForkStarter.fork(ForkStarter.java:675)
	at org.apache.maven.plugin.surefire.booterclient.ForkStarter.run(ForkStarter.java:285)
	at org.apache.maven.plugin.surefire.booterclient.ForkStarter.run(ForkStarter.java:248)
	at org.apache.maven.plugin.surefire.AbstractSurefireMojo.executeProvider(AbstractSurefireMojo.java:1208)
	at org.apache.maven.plugin.surefire.AbstractSurefireMojo.executeAfterPreconditionsChecked(AbstractSurefireMojo.java:1055)
	at org.apache.maven.plugin.surefire.AbstractSurefireMojo.execute(AbstractSurefireMojo.java:882)
	at org.apache.maven.plugin.DefaultBuildPluginManager.executeMojo(DefaultBuildPluginManager.java:137)
	at org.apache.maven.lifecycle.internal.MojoExecutor.execute(MojoExecutor.java:210)
	at org.apache.maven.lifecycle.internal.MojoExecutor.execute(MojoExecutor.java:156)
	at org.apache.maven.lifecycle.internal.MojoExecutor.execute(MojoExecutor.java:148)
	at org.apache.maven.lifecycle.internal.LifecycleModuleBuilder.buildProject(LifecycleModuleBuilder.java:117)
	at org.apache.maven.lifecycle.internal.LifecycleModuleBuilder.buildProject(LifecycleModuleBuilder.java:81)
	at org.apache.maven.lifecycle.internal.builder.singlethreaded.SingleThreadedBuilder.build(SingleThreadedBuilder.java:56)
	at org.apache.maven.lifecycle.internal.LifecycleStarter.execute(LifecycleStarter.java:128)
	at org.apache.maven.DefaultMaven.doExecute(DefaultMaven.java:305)
	at org.apache.maven.DefaultMaven.doExecute(DefaultMaven.java:192)
	at org.apache.maven.DefaultMaven.execute(DefaultMaven.java:105)
	at org.apache.maven.cli.MavenCli.execute(MavenCli.java:956)
	at org.apache.maven.cli.MavenCli.doMain(MavenCli.java:288)
	at org.apache.maven.cli.MavenCli.main(MavenCli.java:192)
	at java.base/jdk.internal.reflect.NativeMethodAccessorImpl.invoke0(Native Method)
	at java.base/jdk.internal.reflect.NativeMethodAccessorImpl.invoke(NativeMethodAccessorImpl.java:62)
	at java.base/jdk.internal.reflect.DelegatingMethodAccessorImpl.invoke(DelegatingMethodAccessorImpl.java:43)
	at java.base/java.lang.reflect.Method.invoke(Method.java:567)
	at org.codehaus.plexus.classworlds.launcher.Launcher.launchEnhanced(Launcher.java:289)
	at org.codehaus.plexus.classworlds.launcher.Launcher.launch(Launcher.java:229)
	at org.codehaus.plexus.classworlds.launcher.Launcher.mainWithExitCode(Launcher.java:415)
	at org.codehaus.plexus.classworlds.launcher.Launcher.main(Launcher.java:356)

    at org.apache.maven.lifecycle.internal.MojoExecutor.execute (MojoExecutor.java:215)
    at org.apache.maven.lifecycle.internal.MojoExecutor.execute (MojoExecutor.java:156)
    at org.apache.maven.lifecycle.internal.MojoExecutor.execute (MojoExecutor.java:148)
    at org.apache.maven.lifecycle.internal.LifecycleModuleBuilder.buildProject (LifecycleModuleBuilder.java:117)
    at org.apache.maven.lifecycle.internal.LifecycleModuleBuilder.buildProject (LifecycleModuleBuilder.java:81)
    at org.apache.maven.lifecycle.internal.builder.singlethreaded.SingleThreadedBuilder.build (SingleThreadedBuilder.java:56)
    at org.apache.maven.lifecycle.internal.LifecycleStarter.execute (LifecycleStarter.java:128)
    at org.apache.maven.DefaultMaven.doExecute (DefaultMaven.java:305)
    at org.apache.maven.DefaultMaven.doExecute (DefaultMaven.java:192)
    at org.apache.maven.DefaultMaven.execute (DefaultMaven.java:105)
    at org.apache.maven.cli.MavenCli.execute (MavenCli.java:956)
    at org.apache.maven.cli.MavenCli.doMain (MavenCli.java:288)
    at org.apache.maven.cli.MavenCli.main (MavenCli.java:192)
    at jdk.internal.reflect.NativeMethodAccessorImpl.invoke0 (Native Method)
    at jdk.internal.reflect.NativeMethodAccessorImpl.invoke (NativeMethodAccessorImpl.java:62)
    at jdk.internal.reflect.DelegatingMethodAccessorImpl.invoke (DelegatingMethodAccessorImpl.java:43)
    at java.lang.reflect.Method.invoke (Method.java:567)
    at org.codehaus.plexus.classworlds.launcher.Launcher.launchEnhanced (Launcher.java:289)
    at org.codehaus.plexus.classworlds.launcher.Launcher.launch (Launcher.java:229)
    at org.codehaus.plexus.classworlds.launcher.Launcher.mainWithExitCode (Launcher.java:415)
    at org.codehaus.plexus.classworlds.launcher.Launcher.main (Launcher.java:356)
Caused by: org.apache.maven.plugin.MojoExecutionException: There are test failures.

Please refer to /home/jenkins/jenkins-slave/workspace/aven-box_maven-surefire_junit550@2/surefire-its/target/JUnitPlatformIT_testMultipleEngines/target/surefire-reports for the individual test results.
Please refer to dump files (if any exist) [date].dump, [date]-jvmRun[N].dump and [date].dumpstream.
There was an error in the forked processorg/junit/platform/commons/PreconditionViolationException
java.lang.NoClassDefFoundError: org/junit/platform/commons/PreconditionViolationException
	at org.apache.maven.surefire.junitplatform.TestPlanScannerFilter.accept(TestPlanScannerFilter.java:53)
	at org.apache.maven.surefire.util.DefaultScanResult.applyFilter(DefaultScanResult.java:102)
	at org.apache.maven.surefire.junitplatform.JUnitPlatformProvider.scanClasspath(JUnitPlatformProvider.java:143)
	at org.apache.maven.surefire.junitplatform.JUnitPlatformProvider.invoke(JUnitPlatformProvider.java:124)
	at org.apache.maven.surefire.booter.ForkedBooter.invokeProviderInSameClassLoader(ForkedBooter.java:359)
	at org.apache.maven.surefire.booter.ForkedBooter.runSuitesInProcess(ForkedBooter.java:321)
	at org.apache.maven.surefire.booter.ForkedBooter.execute(ForkedBooter.java:119)
	at org.apache.maven.surefire.booter.ForkedBooter.main(ForkedBooter.java:394)
Caused by: java.lang.ClassNotFoundException: org.junit.platform.commons.PreconditionViolationException
	at java.base/jdk.internal.loader.BuiltinClassLoader.loadClass(BuiltinClassLoader.java:583)
	at java.base/jdk.internal.loader.ClassLoaders$AppClassLoader.loadClass(ClassLoaders.java:178)
	at java.base/java.lang.ClassLoader.loadClass(ClassLoader.java:521)
	... 8 more

org.apache.maven.surefire.booter.SurefireBooterForkException: There was an error in the forked processorg/junit/platform/commons/PreconditionViolationException
java.lang.NoClassDefFoundError: org/junit/platform/commons/PreconditionViolationException
	at org.apache.maven.surefire.junitplatform.TestPlanScannerFilter.accept(TestPlanScannerFilter.java:53)
	at org.apache.maven.surefire.util.DefaultScanResult.applyFilter(DefaultScanResult.java:102)
	at org.apache.maven.surefire.junitplatform.JUnitPlatformProvider.scanClasspath(JUnitPlatformProvider.java:143)
	at org.apache.maven.surefire.junitplatform.JUnitPlatformProvider.invoke(JUnitPlatformProvider.java:124)
	at org.apache.maven.surefire.booter.ForkedBooter.invokeProviderInSameClassLoader(ForkedBooter.java:359)
	at org.apache.maven.surefire.booter.ForkedBooter.runSuitesInProcess(ForkedBooter.java:321)
	at org.apache.maven.surefire.booter.ForkedBooter.execute(ForkedBooter.java:119)
	at org.apache.maven.surefire.booter.ForkedBooter.main(ForkedBooter.java:394)
Caused by: java.lang.ClassNotFoundException: org.junit.platform.commons.PreconditionViolationException
	at java.base/jdk.internal.loader.BuiltinClassLoader.loadClass(BuiltinClassLoader.java:583)
	at java.base/jdk.internal.loader.ClassLoaders$AppClassLoader.loadClass(ClassLoaders.java:178)
	at java.base/java.lang.ClassLoader.loadClass(ClassLoader.java:521)
	... 8 more

	at org.apache.maven.plugin.surefire.booterclient.ForkStarter.fork(ForkStarter.java:675)
	at org.apache.maven.plugin.surefire.booterclient.ForkStarter.run(ForkStarter.java:285)
	at org.apache.maven.plugin.surefire.booterclient.ForkStarter.run(ForkStarter.java:248)
	at org.apache.maven.plugin.surefire.AbstractSurefireMojo.executeProvider(AbstractSurefireMojo.java:1208)
	at org.apache.maven.plugin.surefire.AbstractSurefireMojo.executeAfterPreconditionsChecked(AbstractSurefireMojo.java:1055)
	at org.apache.maven.plugin.surefire.AbstractSurefireMojo.execute(AbstractSurefireMojo.java:882)
	at org.apache.maven.plugin.DefaultBuildPluginManager.executeMojo(DefaultBuildPluginManager.java:137)
	at org.apache.maven.lifecycle.internal.MojoExecutor.execute(MojoExecutor.java:210)
	at org.apache.maven.lifecycle.internal.MojoExecutor.execute(MojoExecutor.java:156)
	at org.apache.maven.lifecycle.internal.MojoExecutor.execute(MojoExecutor.java:148)
	at org.apache.maven.lifecycle.internal.LifecycleModuleBuilder.buildProject(LifecycleModuleBuilder.java:117)
	at org.apache.maven.lifecycle.internal.LifecycleModuleBuilder.buildProject(LifecycleModuleBuilder.java:81)
	at org.apache.maven.lifecycle.internal.builder.singlethreaded.SingleThreadedBuilder.build(SingleThreadedBuilder.java:56)
	at org.apache.maven.lifecycle.internal.LifecycleStarter.execute(LifecycleStarter.java:128)
	at org.apache.maven.DefaultMaven.doExecute(DefaultMaven.java:305)
	at org.apache.maven.DefaultMaven.doExecute(DefaultMaven.java:192)
	at org.apache.maven.DefaultMaven.execute(DefaultMaven.java:105)
	at org.apache.maven.cli.MavenCli.execute(MavenCli.java:956)
	at org.apache.maven.cli.MavenCli.doMain(MavenCli.java:288)
	at org.apache.maven.cli.MavenCli.main(MavenCli.java:192)
	at java.base/jdk.internal.reflect.NativeMethodAccessorImpl.invoke0(Native Method)
	at java.base/jdk.internal.reflect.NativeMethodAccessorImpl.invoke(NativeMethodAccessorImpl.java:62)
	at java.base/jdk.internal.reflect.DelegatingMethodAccessorImpl.invoke(DelegatingMethodAccessorImpl.java:43)
	at java.base/java.lang.reflect.Method.invoke(Method.java:567)
	at org.codehaus.plexus.classworlds.launcher.Launcher.launchEnhanced(Launcher.java:289)
	at org.codehaus.plexus.classworlds.launcher.Launcher.launch(Launcher.java:229)
	at org.codehaus.plexus.classworlds.launcher.Launcher.mainWithExitCode(Launcher.java:415)
	at org.codehaus.plexus.classworlds.launcher.Launcher.main(Launcher.java:356)

    at org.apache.maven.plugin.surefire.SurefireHelper.throwException (SurefireHelper.java:266)
    at org.apache.maven.plugin.surefire.SurefireHelper.reportExecution (SurefireHelper.java:159)
    at org.apache.maven.plugin.surefire.SurefirePlugin.handleSummary (SurefirePlugin.java:377)
    at org.apache.maven.plugin.surefire.AbstractSurefireMojo.executeAfterPreconditionsChecked (AbstractSurefireMojo.java:1071)
    at org.apache.maven.plugin.surefire.AbstractSurefireMojo.execute (AbstractSurefireMojo.java:882)
    at org.apache.maven.plugin.DefaultBuildPluginManager.executeMojo (DefaultBuildPluginManager.java:137)
    at org.apache.maven.lifecycle.internal.MojoExecutor.execute (MojoExecutor.java:210)
    at org.apache.maven.lifecycle.internal.MojoExecutor.execute (MojoExecutor.java:156)
    at org.apache.maven.lifecycle.internal.MojoExecutor.execute (MojoExecutor.java:148)
    at org.apache.maven.lifecycle.internal.LifecycleModuleBuilder.buildProject (LifecycleModuleBuilder.java:117)
    at org.apache.maven.lifecycle.internal.LifecycleModuleBuilder.buildProject (LifecycleModuleBuilder.java:81)
    at org.apache.maven.lifecycle.internal.builder.singlethreaded.SingleThreadedBuilder.build (SingleThreadedBuilder.java:56)
    at org.apache.maven.lifecycle.internal.LifecycleStarter.execute (LifecycleStarter.java:128)
    at org.apache.maven.DefaultMaven.doExecute (DefaultMaven.java:305)
    at org.apache.maven.DefaultMaven.doExecute (DefaultMaven.java:192)
    at org.apache.maven.DefaultMaven.execute (DefaultMaven.java:105)
    at org.apache.maven.cli.MavenCli.execute (MavenCli.java:956)
    at org.apache.maven.cli.MavenCli.doMain (MavenCli.java:288)
    at org.apache.maven.cli.MavenCli.main (MavenCli.java:192)
    at jdk.internal.reflect.NativeMethodAccessorImpl.invoke0 (Native Method)
    at jdk.internal.reflect.NativeMethodAccessorImpl.invoke (NativeMethodAccessorImpl.java:62)
    at jdk.internal.reflect.DelegatingMethodAccessorImpl.invoke (DelegatingMethodAccessorImpl.java:43)
    at java.lang.reflect.Method.invoke (Method.java:567)
    at org.codehaus.plexus.classworlds.launcher.Launcher.launchEnhanced (Launcher.java:289)
    at org.codehaus.plexus.classworlds.launcher.Launcher.launch (Launcher.java:229)
    at org.codehaus.plexus.classworlds.launcher.Launcher.mainWithExitCode (Launcher.java:415)
    at org.codehaus.plexus.classworlds.launcher.Launcher.main (Launcher.java:356)
Caused by: org.apache.maven.surefire.booter.SurefireBooterForkException: There was an error in the forked processorg/junit/platform/commons/PreconditionViolationException
java.lang.NoClassDefFoundError: org/junit/platform/commons/PreconditionViolationException
	at org.apache.maven.surefire.junitplatform.TestPlanScannerFilter.accept(TestPlanScannerFilter.java:53)
	at org.apache.maven.surefire.util.DefaultScanResult.applyFilter(DefaultScanResult.java:102)
	at org.apache.maven.surefire.junitplatform.JUnitPlatformProvider.scanClasspath(JUnitPlatformProvider.java:143)
	at org.apache.maven.surefire.junitplatform.JUnitPlatformProvider.invoke(JUnitPlatformProvider.java:124)
	at org.apache.maven.surefire.booter.ForkedBooter.invokeProviderInSameClassLoader(ForkedBooter.java:359)
	at org.apache.maven.surefire.booter.ForkedBooter.runSuitesInProcess(ForkedBooter.java:321)
	at org.apache.maven.surefire.booter.ForkedBooter.execute(ForkedBooter.java:119)
	at org.apache.maven.surefire.booter.ForkedBooter.main(ForkedBooter.java:394)
Caused by: java.lang.ClassNotFoundException: org.junit.platform.commons.PreconditionViolationException
	at java.base/jdk.internal.loader.BuiltinClassLoader.loadClass(BuiltinClassLoader.java:583)
	at java.base/jdk.internal.loader.ClassLoaders$AppClassLoader.loadClass(ClassLoaders.java:178)
	at java.base/java.lang.ClassLoader.loadClass(ClassLoader.java:521)
	... 8 more

    at org.apache.maven.plugin.surefire.booterclient.ForkStarter.fork (ForkStarter.java:675)
    at org.apache.maven.plugin.surefire.booterclient.ForkStarter.run (ForkStarter.java:285)
    at org.apache.maven.plugin.surefire.booterclient.ForkStarter.run (ForkStarter.java:248)
    at org.apache.maven.plugin.surefire.AbstractSurefireMojo.executeProvider (AbstractSurefireMojo.java:1208)
    at org.apache.maven.plugin.surefire.AbstractSurefireMojo.executeAfterPreconditionsChecked (AbstractSurefireMojo.java:1055)
    at org.apache.maven.plugin.surefire.AbstractSurefireMojo.execute (AbstractSurefireMojo.java:882)
    at org.apache.maven.plugin.DefaultBuildPluginManager.executeMojo (DefaultBuildPluginManager.java:137)
    at org.apache.maven.lifecycle.internal.MojoExecutor.execute (MojoExecutor.java:210)
    at org.apache.maven.lifecycle.internal.MojoExecutor.execute (MojoExecutor.java:156)
    at org.apache.maven.lifecycle.internal.MojoExecutor.execute (MojoExecutor.java:148)
    at org.apache.maven.lifecycle.internal.LifecycleModuleBuilder.buildProject (LifecycleModuleBuilder.java:117)
    at org.apache.maven.lifecycle.internal.LifecycleModuleBuilder.buildProject (LifecycleModuleBuilder.java:81)
    at org.apache.maven.lifecycle.internal.builder.singlethreaded.SingleThreadedBuilder.build (SingleThreadedBuilder.java:56)
    at org.apache.maven.lifecycle.internal.LifecycleStarter.execute (LifecycleStarter.java:128)
    at org.apache.maven.DefaultMaven.doExecute (DefaultMaven.java:305)
    at org.apache.maven.DefaultMaven.doExecute (DefaultMaven.java:192)
    at org.apache.maven.DefaultMaven.execute (DefaultMaven.java:105)
    at org.apache.maven.cli.MavenCli.execute (MavenCli.java:956)
    at org.apache.maven.cli.MavenCli.doMain (MavenCli.java:288)
    at org.apache.maven.cli.MavenCli.main (MavenCli.java:192)
    at jdk.internal.reflect.NativeMethodAccessorImpl.invoke0 (Native Method)
    at jdk.internal.reflect.NativeMethodAccessorImpl.invoke (NativeMethodAccessorImpl.java:62)
    at jdk.internal.reflect.DelegatingMethodAccessorImpl.invoke (DelegatingMethodAccessorImpl.java:43)
    at java.lang.reflect.Method.invoke (Method.java:567)
    at org.codehaus.plexus.classworlds.launcher.Launcher.launchEnhanced (Launcher.java:289)
    at org.codehaus.plexus.classworlds.launcher.Launcher.launch (Launcher.java:229)
    at org.codehaus.plexus.classworlds.launcher.Launcher.mainWithExitCode (Launcher.java:415)
    at org.codehaus.plexus.classworlds.launcher.Launcher.main (Launcher.java:356)
[ERROR] 
[ERROR] Re-run Maven using the -X switch to enable full debug logging.
[ERROR] 
[ERROR] For more information about the errors and possible solutions, please read the following articles:
[ERROR] [Help 1] http://cwiki.apache.org/confluence/display/MAVEN/MojoExecutionException

	at org.apache.maven.surefire.its.JUnitPlatformIT.testMultipleEngines(JUnitPlatformIT.java:106)
Caused by: org.apache.maven.it.VerificationException: 
Exit code was non-zero: 1; command line and log = 
/home/jenkins/tools/maven/apache-maven-3.6.0/bin/mvn -e --batch-mode -Dmaven.repo.local=/home/jenkins/jenkins-slave/workspace/aven-box_maven-surefire_junit550@2/.m2 org.apache.maven.plugins:maven-clean-plugin:clean -Dsurefire.version=3.0.0-SNAPSHOT -Djacoco.agent=-javaagent:/home/jenkins/jenkins-slave/workspace/aven-box_maven-surefire_junit550@2/.m2/org/jacoco/org.jacoco.agent/0.8.4/org.jacoco.agent-0.8.4-runtime.jar=destfile=/home/jenkins/jenkins-slave/workspace/aven-box_maven-surefire_junit550@2/surefire-its/target/jacoco-it.exec,includes=**/failsafe/*:**/failsafe/**/*:**/surefire/*:**/surefire/**/*,excludes=**/HelpMojo.class:**/shadefire/**/*:org/jacoco/**/*:com/vladium/emma/rt/* -Dhttps.protocols=TLSv1,TLSv1.1,TLSv1.2 test
[INFO] Error stacktraces are turned on.
[INFO] Scanning for projects...
[INFO] 
[INFO] --< org.apache.maven.plugins.surefire:junit-platform-multiple-engines >--
[INFO] Building Test for JUnit 5: Platform hosting multiple test engines 1.0
[INFO] --------------------------------[ jar ]---------------------------------
[INFO] Downloading from central: https://repo.maven.apache.org/maven2/org/junit/jupiter/junit-jupiter-params/5.5.0/junit-jupiter-params-5.5.0.pom
[INFO] Downloaded from central: https://repo.maven.apache.org/maven2/org/junit/jupiter/junit-jupiter-params/5.5.0/junit-jupiter-params-5.5.0.pom (2.2 kB at 7.2 kB/s)
[INFO] Downloading from central: https://repo.maven.apache.org/maven2/org/junit/jupiter/junit-jupiter-params/5.5.0/junit-jupiter-params-5.5.0.jar
[INFO] Downloaded from central: https://repo.maven.apache.org/maven2/org/junit/jupiter/junit-jupiter-params/5.5.0/junit-jupiter-params-5.5.0.jar (549 kB at 6.7 MB/s)
[INFO] 
[INFO] --- maven-clean-plugin:2.5:clean (default-cli) @ junit-platform-multiple-engines ---
[INFO] 
[INFO] --- maven-resources-plugin:2.6:resources (default-resources) @ junit-platform-multiple-engines ---
[WARNING] Using platform encoding (ISO-8859-1 actually) to copy filtered resources, i.e. build is platform dependent!
[INFO] skip non existing resourceDirectory /home/jenkins/jenkins-slave/workspace/aven-box_maven-surefire_junit550@2/surefire-its/target/JUnitPlatformIT_testMultipleEngines/src/main/resources
[INFO] 
[INFO] --- maven-compiler-plugin:3.1:compile (default-compile) @ junit-platform-multiple-engines ---
[INFO] No sources to compile
[INFO] 
[INFO] --- maven-resources-plugin:2.6:testResources (default-testResources) @ junit-platform-multiple-engines ---
[WARNING] Using platform encoding (ISO-8859-1 actually) to copy filtered resources, i.e. build is platform dependent!
[INFO] skip non existing resourceDirectory /home/jenkins/jenkins-slave/workspace/aven-box_maven-surefire_junit550@2/surefire-its/target/JUnitPlatformIT_testMultipleEngines/src/test/resources
[INFO] 
[INFO] --- maven-compiler-plugin:3.1:testCompile (default-testCompile) @ junit-platform-multiple-engines ---
[INFO] Changes detected - recompiling the module!
[WARNING] File encoding has not been set, using platform encoding ISO-8859-1, i.e. build is platform dependent!
[INFO] Compiling 3 source files to /home/jenkins/jenkins-slave/workspace/aven-box_maven-surefire_junit550@2/surefire-its/target/JUnitPlatformIT_testMultipleEngines/target/test-classes
[INFO] 
[INFO] --- maven-surefire-plugin:3.0.0-SNAPSHOT:test (default-test) @ junit-platform-multiple-engines ---
[INFO] Surefire report directory: /home/jenkins/jenkins-slave/workspace/aven-box_maven-surefire_junit550@2/surefire-its/target/JUnitPlatformIT_testMultipleEngines/target/surefire-reports
[INFO] 
[INFO] -------------------------------------------------------
[INFO]  T E S T S
[INFO] -------------------------------------------------------
[ERROR] org/junit/platform/commons/PreconditionViolationException
[INFO] 
[INFO] Results:
[INFO] 
[INFO] Tests run: 0, Failures: 0, Errors: 0, Skipped: 0
[INFO] 
[INFO] ------------------------------------------------------------------------
[INFO] BUILD FAILURE
[INFO] ------------------------------------------------------------------------
[INFO] Total time:  3.770 s
[INFO] Finished at: 2019-07-12T18:32:23Z
[INFO] ------------------------------------------------------------------------
[ERROR] Failed to execute goal org.apache.maven.plugins:maven-surefire-plugin:3.0.0-SNAPSHOT:test (default-test) on project junit-platform-multiple-engines: There are test failures.
[ERROR] 
[ERROR] Please refer to /home/jenkins/jenkins-slave/workspace/aven-box_maven-surefire_junit550@2/surefire-its/target/JUnitPlatformIT_testMultipleEngines/target/surefire-reports for the individual test results.
[ERROR] Please refer to dump files (if any exist) [date].dump, [date]-jvmRun[N].dump and [date].dumpstream.
[ERROR] There was an error in the forked processorg/junit/platform/commons/PreconditionViolationException
[ERROR] java.lang.NoClassDefFoundError: org/junit/platform/commons/PreconditionViolationException
[ERROR] 	at org.apache.maven.surefire.junitplatform.TestPlanScannerFilter.accept(TestPlanScannerFilter.java:53)
[ERROR] 	at org.apache.maven.surefire.util.DefaultScanResult.applyFilter(DefaultScanResult.java:102)
[ERROR] 	at org.apache.maven.surefire.junitplatform.JUnitPlatformProvider.scanClasspath(JUnitPlatformProvider.java:143)
[ERROR] 	at org.apache.maven.surefire.junitplatform.JUnitPlatformProvider.invoke(JUnitPlatformProvider.java:124)
[ERROR] 	at org.apache.maven.surefire.booter.ForkedBooter.invokeProviderInSameClassLoader(ForkedBooter.java:359)
[ERROR] 	at org.apache.maven.surefire.booter.ForkedBooter.runSuitesInProcess(ForkedBooter.java:321)
[ERROR] 	at org.apache.maven.surefire.booter.ForkedBooter.execute(ForkedBooter.java:119)
[ERROR] 	at org.apache.maven.surefire.booter.ForkedBooter.main(ForkedBooter.java:394)
[ERROR] Caused by: java.lang.ClassNotFoundException: org.junit.platform.commons.PreconditionViolationException
[ERROR] 	at java.base/jdk.internal.loader.BuiltinClassLoader.loadClass(BuiltinClassLoader.java:583)
[ERROR] 	at java.base/jdk.internal.loader.ClassLoaders$AppClassLoader.loadClass(ClassLoaders.java:178)
[ERROR] 	at java.base/java.lang.ClassLoader.loadClass(ClassLoader.java:521)
[ERROR] 	... 8 more
[ERROR] 
[ERROR] org.apache.maven.surefire.booter.SurefireBooterForkException: There was an error in the forked processorg/junit/platform/commons/PreconditionViolationException
[ERROR] java.lang.NoClassDefFoundError: org/junit/platform/commons/PreconditionViolationException
[ERROR] 	at org.apache.maven.surefire.junitplatform.TestPlanScannerFilter.accept(TestPlanScannerFilter.java:53)
[ERROR] 	at org.apache.maven.surefire.util.DefaultScanResult.applyFilter(DefaultScanResult.java:102)
[ERROR] 	at org.apache.maven.surefire.junitplatform.JUnitPlatformProvider.scanClasspath(JUnitPlatformProvider.java:143)
[ERROR] 	at org.apache.maven.surefire.junitplatform.JUnitPlatformProvider.invoke(JUnitPlatformProvider.java:124)
[ERROR] 	at org.apache.maven.surefire.booter.ForkedBooter.invokeProviderInSameClassLoader(ForkedBooter.java:359)
[ERROR] 	at org.apache.maven.surefire.booter.ForkedBooter.runSuitesInProcess(ForkedBooter.java:321)
[ERROR] 	at org.apache.maven.surefire.booter.ForkedBooter.execute(ForkedBooter.java:119)
[ERROR] 	at org.apache.maven.surefire.booter.ForkedBooter.main(ForkedBooter.java:394)
[ERROR] Caused by: java.lang.ClassNotFoundException: org.junit.platform.commons.PreconditionViolationException
[ERROR] 	at java.base/jdk.internal.loader.BuiltinClassLoader.loadClass(BuiltinClassLoader.java:583)
[ERROR] 	at java.base/jdk.internal.loader.ClassLoaders$AppClassLoader.loadClass(ClassLoaders.java:178)
[ERROR] 	at java.base/java.lang.ClassLoader.loadClass(ClassLoader.java:521)
[ERROR] 	... 8 more
[ERROR] 
[ERROR] 	at org.apache.maven.plugin.surefire.booterclient.ForkStarter.fork(ForkStarter.java:675)
[ERROR] 	at org.apache.maven.plugin.surefire.booterclient.ForkStarter.run(ForkStarter.java:285)
[ERROR] 	at org.apache.maven.plugin.surefire.booterclient.ForkStarter.run(ForkStarter.java:248)
[ERROR] 	at org.apache.maven.plugin.surefire.AbstractSurefireMojo.executeProvider(AbstractSurefireMojo.java:1208)
[ERROR] 	at org.apache.maven.plugin.surefire.AbstractSurefireMojo.executeAfterPreconditionsChecked(AbstractSurefireMojo.java:1055)
[ERROR] 	at org.apache.maven.plugin.surefire.AbstractSurefireMojo.execute(AbstractSurefireMojo.java:882)
[ERROR] 	at org.apache.maven.plugin.DefaultBuildPluginManager.executeMojo(DefaultBuildPluginManager.java:137)
[ERROR] 	at org.apache.maven.lifecycle.internal.MojoExecutor.execute(MojoExecutor.java:210)
[ERROR] 	at org.apache.maven.lifecycle.internal.MojoExecutor.execute(MojoExecutor.java:156)
[ERROR] 	at org.apache.maven.lifecycle.internal.MojoExecutor.execute(MojoExecutor.java:148)
[ERROR] 	at org.apache.maven.lifecycle.internal.LifecycleModuleBuilder.buildProject(LifecycleModuleBuilder.java:117)
[ERROR] 	at org.apache.maven.lifecycle.internal.LifecycleModuleBuilder.buildProject(LifecycleModuleBuilder.java:81)
[ERROR] 	at org.apache.maven.lifecycle.internal.builder.singlethreaded.SingleThreadedBuilder.build(SingleThreadedBuilder.java:56)
[ERROR] 	at org.apache.maven.lifecycle.internal.LifecycleStarter.execute(LifecycleStarter.java:128)
[ERROR] 	at org.apache.maven.DefaultMaven.doExecute(DefaultMaven.java:305)
[ERROR] 	at org.apache.maven.DefaultMaven.doExecute(DefaultMaven.java:192)
[ERROR] 	at org.apache.maven.DefaultMaven.execute(DefaultMaven.java:105)
[ERROR] 	at org.apache.maven.cli.MavenCli.execute(MavenCli.java:956)
[ERROR] 	at org.apache.maven.cli.MavenCli.doMain(MavenCli.java:288)
[ERROR] 	at org.apache.maven.cli.MavenCli.main(MavenCli.java:192)
[ERROR] 	at java.base/jdk.internal.reflect.NativeMethodAccessorImpl.invoke0(Native Method)
[ERROR] 	at java.base/jdk.internal.reflect.NativeMethodAccessorImpl.invoke(NativeMethodAccessorImpl.java:62)
[ERROR] 	at java.base/jdk.internal.reflect.DelegatingMethodAccessorImpl.invoke(DelegatingMethodAccessorImpl.java:43)
[ERROR] 	at java.base/java.lang.reflect.Method.invoke(Method.java:567)
[ERROR] 	at org.codehaus.plexus.classworlds.launcher.Launcher.launchEnhanced(Launcher.java:289)
[ERROR] 	at org.codehaus.plexus.classworlds.launcher.Launcher.launch(Launcher.java:229)
[ERROR] 	at org.codehaus.plexus.classworlds.launcher.Launcher.mainWithExitCode(Launcher.java:415)
[ERROR] 	at org.codehaus.plexus.classworlds.launcher.Launcher.main(Launcher.java:356)
[ERROR] -> [Help 1]
org.apache.maven.lifecycle.LifecycleExecutionException: Failed to execute goal org.apache.maven.plugins:maven-surefire-plugin:3.0.0-SNAPSHOT:test (default-test) on project junit-platform-multiple-engines: There are test failures.

Please refer to /home/jenkins/jenkins-slave/workspace/aven-box_maven-surefire_junit550@2/surefire-its/target/JUnitPlatformIT_testMultipleEngines/target/surefire-reports for the individual test results.
Please refer to dump files (if any exist) [date].dump, [date]-jvmRun[N].dump and [date].dumpstream.
There was an error in the forked processorg/junit/platform/commons/PreconditionViolationException
java.lang.NoClassDefFoundError: org/junit/platform/commons/PreconditionViolationException
	at org.apache.maven.surefire.junitplatform.TestPlanScannerFilter.accept(TestPlanScannerFilter.java:53)
	at org.apache.maven.surefire.util.DefaultScanResult.applyFilter(DefaultScanResult.java:102)
	at org.apache.maven.surefire.junitplatform.JUnitPlatformProvider.scanClasspath(JUnitPlatformProvider.java:143)
	at org.apache.maven.surefire.junitplatform.JUnitPlatformProvider.invoke(JUnitPlatformProvider.java:124)
	at org.apache.maven.surefire.booter.ForkedBooter.invokeProviderInSameClassLoader(ForkedBooter.java:359)
	at org.apache.maven.surefire.booter.ForkedBooter.runSuitesInProcess(ForkedBooter.java:321)
	at org.apache.maven.surefire.booter.ForkedBooter.execute(ForkedBooter.java:119)
	at org.apache.maven.surefire.booter.ForkedBooter.main(ForkedBooter.java:394)
Caused by: java.lang.ClassNotFoundException: org.junit.platform.commons.PreconditionViolationException
	at java.base/jdk.internal.loader.BuiltinClassLoader.loadClass(BuiltinClassLoader.java:583)
	at java.base/jdk.internal.loader.ClassLoaders$AppClassLoader.loadClass(ClassLoaders.java:178)
	at java.base/java.lang.ClassLoader.loadClass(ClassLoader.java:521)
	... 8 more

org.apache.maven.surefire.booter.SurefireBooterForkException: There was an error in the forked processorg/junit/platform/commons/PreconditionViolationException
java.lang.NoClassDefFoundError: org/junit/platform/commons/PreconditionViolationException
	at org.apache.maven.surefire.junitplatform.TestPlanScannerFilter.accept(TestPlanScannerFilter.java:53)
	at org.apache.maven.surefire.util.DefaultScanResult.applyFilter(DefaultScanResult.java:102)
	at org.apache.maven.surefire.junitplatform.JUnitPlatformProvider.scanClasspath(JUnitPlatformProvider.java:143)
	at org.apache.maven.surefire.junitplatform.JUnitPlatformProvider.invoke(JUnitPlatformProvider.java:124)
	at org.apache.maven.surefire.booter.ForkedBooter.invokeProviderInSameClassLoader(ForkedBooter.java:359)
	at org.apache.maven.surefire.booter.ForkedBooter.runSuitesInProcess(ForkedBooter.java:321)
	at org.apache.maven.surefire.booter.ForkedBooter.execute(ForkedBooter.java:119)
	at org.apache.maven.surefire.booter.ForkedBooter.main(ForkedBooter.java:394)
Caused by: java.lang.ClassNotFoundException: org.junit.platform.commons.PreconditionViolationException
	at java.base/jdk.internal.loader.BuiltinClassLoader.loadClass(BuiltinClassLoader.java:583)
	at java.base/jdk.internal.loader.ClassLoaders$AppClassLoader.loadClass(ClassLoaders.java:178)
	at java.base/java.lang.ClassLoader.loadClass(ClassLoader.java:521)
	... 8 more

	at org.apache.maven.plugin.surefire.booterclient.ForkStarter.fork(ForkStarter.java:675)
	at org.apache.maven.plugin.surefire.booterclient.ForkStarter.run(ForkStarter.java:285)
	at org.apache.maven.plugin.surefire.booterclient.ForkStarter.run(ForkStarter.java:248)
	at org.apache.maven.plugin.surefire.AbstractSurefireMojo.executeProvider(AbstractSurefireMojo.java:1208)
	at org.apache.maven.plugin.surefire.AbstractSurefireMojo.executeAfterPreconditionsChecked(AbstractSurefireMojo.java:1055)
	at org.apache.maven.plugin.surefire.AbstractSurefireMojo.execute(AbstractSurefireMojo.java:882)
	at org.apache.maven.plugin.DefaultBuildPluginManager.executeMojo(DefaultBuildPluginManager.java:137)
	at org.apache.maven.lifecycle.internal.MojoExecutor.execute(MojoExecutor.java:210)
	at org.apache.maven.lifecycle.internal.MojoExecutor.execute(MojoExecutor.java:156)
	at org.apache.maven.lifecycle.internal.MojoExecutor.execute(MojoExecutor.java:148)
	at org.apache.maven.lifecycle.internal.LifecycleModuleBuilder.buildProject(LifecycleModuleBuilder.java:117)
	at org.apache.maven.lifecycle.internal.LifecycleModuleBuilder.buildProject(LifecycleModuleBuilder.java:81)
	at org.apache.maven.lifecycle.internal.builder.singlethreaded.SingleThreadedBuilder.build(SingleThreadedBuilder.java:56)
	at org.apache.maven.lifecycle.internal.LifecycleStarter.execute(LifecycleStarter.java:128)
	at org.apache.maven.DefaultMaven.doExecute(DefaultMaven.java:305)
	at org.apache.maven.DefaultMaven.doExecute(DefaultMaven.java:192)
	at org.apache.maven.DefaultMaven.execute(DefaultMaven.java:105)
	at org.apache.maven.cli.MavenCli.execute(MavenCli.java:956)
	at org.apache.maven.cli.MavenCli.doMain(MavenCli.java:288)
	at org.apache.maven.cli.MavenCli.main(MavenCli.java:192)
	at java.base/jdk.internal.reflect.NativeMethodAccessorImpl.invoke0(Native Method)
	at java.base/jdk.internal.reflect.NativeMethodAccessorImpl.invoke(NativeMethodAccessorImpl.java:62)
	at java.base/jdk.internal.reflect.DelegatingMethodAccessorImpl.invoke(DelegatingMethodAccessorImpl.java:43)
	at java.base/java.lang.reflect.Method.invoke(Method.java:567)
	at org.codehaus.plexus.classworlds.launcher.Launcher.launchEnhanced(Launcher.java:289)
	at org.codehaus.plexus.classworlds.launcher.Launcher.launch(Launcher.java:229)
	at org.codehaus.plexus.classworlds.launcher.Launcher.mainWithExitCode(Launcher.java:415)
	at org.codehaus.plexus.classworlds.launcher.Launcher.main(Launcher.java:356)

    at org.apache.maven.lifecycle.internal.MojoExecutor.execute (MojoExecutor.java:215)
    at org.apache.maven.lifecycle.internal.MojoExecutor.execute (MojoExecutor.java:156)
    at org.apache.maven.lifecycle.internal.MojoExecutor.execute (MojoExecutor.java:148)
    at org.apache.maven.lifecycle.internal.LifecycleModuleBuilder.buildProject (LifecycleModuleBuilder.java:117)
    at org.apache.maven.lifecycle.internal.LifecycleModuleBuilder.buildProject (LifecycleModuleBuilder.java:81)
    at org.apache.maven.lifecycle.internal.builder.singlethreaded.SingleThreadedBuilder.build (SingleThreadedBuilder.java:56)
    at org.apache.maven.lifecycle.internal.LifecycleStarter.execute (LifecycleStarter.java:128)
    at org.apache.maven.DefaultMaven.doExecute (DefaultMaven.java:305)
    at org.apache.maven.DefaultMaven.doExecute (DefaultMaven.java:192)
    at org.apache.maven.DefaultMaven.execute (DefaultMaven.java:105)
    at org.apache.maven.cli.MavenCli.execute (MavenCli.java:956)
    at org.apache.maven.cli.MavenCli.doMain (MavenCli.java:288)
    at org.apache.maven.cli.MavenCli.main (MavenCli.java:192)
    at jdk.internal.reflect.NativeMethodAccessorImpl.invoke0 (Native Method)
    at jdk.internal.reflect.NativeMethodAccessorImpl.invoke (NativeMethodAccessorImpl.java:62)
    at jdk.internal.reflect.DelegatingMethodAccessorImpl.invoke (DelegatingMethodAccessorImpl.java:43)
    at java.lang.reflect.Method.invoke (Method.java:567)
    at org.codehaus.plexus.classworlds.launcher.Launcher.launchEnhanced (Launcher.java:289)
    at org.codehaus.plexus.classworlds.launcher.Launcher.launch (Launcher.java:229)
    at org.codehaus.plexus.classworlds.launcher.Launcher.mainWithExitCode (Launcher.java:415)
    at org.codehaus.plexus.classworlds.launcher.Launcher.main (Launcher.java:356)
Caused by: org.apache.maven.plugin.MojoExecutionException: There are test failures.

Please refer to /home/jenkins/jenkins-slave/workspace/aven-box_maven-surefire_junit550@2/surefire-its/target/JUnitPlatformIT_testMultipleEngines/target/surefire-reports for the individual test results.
Please refer to dump files (if any exist) [date].dump, [date]-jvmRun[N].dump and [date].dumpstream.
There was an error in the forked processorg/junit/platform/commons/PreconditionViolationException
java.lang.NoClassDefFoundError: org/junit/platform/commons/PreconditionViolationException
	at org.apache.maven.surefire.junitplatform.TestPlanScannerFilter.accept(TestPlanScannerFilter.java:53)
	at org.apache.maven.surefire.util.DefaultScanResult.applyFilter(DefaultScanResult.java:102)
	at org.apache.maven.surefire.junitplatform.JUnitPlatformProvider.scanClasspath(JUnitPlatformProvider.java:143)
	at org.apache.maven.surefire.junitplatform.JUnitPlatformProvider.invoke(JUnitPlatformProvider.java:124)
	at org.apache.maven.surefire.booter.ForkedBooter.invokeProviderInSameClassLoader(ForkedBooter.java:359)
	at org.apache.maven.surefire.booter.ForkedBooter.runSuitesInProcess(ForkedBooter.java:321)
	at org.apache.maven.surefire.booter.ForkedBooter.execute(ForkedBooter.java:119)
	at org.apache.maven.surefire.booter.ForkedBooter.main(ForkedBooter.java:394)
Caused by: java.lang.ClassNotFoundException: org.junit.platform.commons.PreconditionViolationException
	at java.base/jdk.internal.loader.BuiltinClassLoader.loadClass(BuiltinClassLoader.java:583)
	at java.base/jdk.internal.loader.ClassLoaders$AppClassLoader.loadClass(ClassLoaders.java:178)
	at java.base/java.lang.ClassLoader.loadClass(ClassLoader.java:521)
	... 8 more

org.apache.maven.surefire.booter.SurefireBooterForkException: There was an error in the forked processorg/junit/platform/commons/PreconditionViolationException
java.lang.NoClassDefFoundError: org/junit/platform/commons/PreconditionViolationException
	at org.apache.maven.surefire.junitplatform.TestPlanScannerFilter.accept(TestPlanScannerFilter.java:53)
	at org.apache.maven.surefire.util.DefaultScanResult.applyFilter(DefaultScanResult.java:102)
	at org.apache.maven.surefire.junitplatform.JUnitPlatformProvider.scanClasspath(JUnitPlatformProvider.java:143)
	at org.apache.maven.surefire.junitplatform.JUnitPlatformProvider.invoke(JUnitPlatformProvider.java:124)
	at org.apache.maven.surefire.booter.ForkedBooter.invokeProviderInSameClassLoader(ForkedBooter.java:359)
	at org.apache.maven.surefire.booter.ForkedBooter.runSuitesInProcess(ForkedBooter.java:321)
	at org.apache.maven.surefire.booter.ForkedBooter.execute(ForkedBooter.java:119)
	at org.apache.maven.surefire.booter.ForkedBooter.main(ForkedBooter.java:394)
Caused by: java.lang.ClassNotFoundException: org.junit.platform.commons.PreconditionViolationException
	at java.base/jdk.internal.loader.BuiltinClassLoader.loadClass(BuiltinClassLoader.java:583)
	at java.base/jdk.internal.loader.ClassLoaders$AppClassLoader.loadClass(ClassLoaders.java:178)
	at java.base/java.lang.ClassLoader.loadClass(ClassLoader.java:521)
	... 8 more

	at org.apache.maven.plugin.surefire.booterclient.ForkStarter.fork(ForkStarter.java:675)
	at org.apache.maven.plugin.surefire.booterclient.ForkStarter.run(ForkStarter.java:285)
	at org.apache.maven.plugin.surefire.booterclient.ForkStarter.run(ForkStarter.java:248)
	at org.apache.maven.plugin.surefire.AbstractSurefireMojo.executeProvider(AbstractSurefireMojo.java:1208)
	at org.apache.maven.plugin.surefire.AbstractSurefireMojo.executeAfterPreconditionsChecked(AbstractSurefireMojo.java:1055)
	at org.apache.maven.plugin.surefire.AbstractSurefireMojo.execute(AbstractSurefireMojo.java:882)
	at org.apache.maven.plugin.DefaultBuildPluginManager.executeMojo(DefaultBuildPluginManager.java:137)
	at org.apache.maven.lifecycle.internal.MojoExecutor.execute(MojoExecutor.java:210)
	at org.apache.maven.lifecycle.internal.MojoExecutor.execute(MojoExecutor.java:156)
	at org.apache.maven.lifecycle.internal.MojoExecutor.execute(MojoExecutor.java:148)
	at org.apache.maven.lifecycle.internal.LifecycleModuleBuilder.buildProject(LifecycleModuleBuilder.java:117)
	at org.apache.maven.lifecycle.internal.LifecycleModuleBuilder.buildProject(LifecycleModuleBuilder.java:81)
	at org.apache.maven.lifecycle.internal.builder.singlethreaded.SingleThreadedBuilder.build(SingleThreadedBuilder.java:56)
	at org.apache.maven.lifecycle.internal.LifecycleStarter.execute(LifecycleStarter.java:128)
	at org.apache.maven.DefaultMaven.doExecute(DefaultMaven.java:305)
	at org.apache.maven.DefaultMaven.doExecute(DefaultMaven.java:192)
	at org.apache.maven.DefaultMaven.execute(DefaultMaven.java:105)
	at org.apache.maven.cli.MavenCli.execute(MavenCli.java:956)
	at org.apache.maven.cli.MavenCli.doMain(MavenCli.java:288)
	at org.apache.maven.cli.MavenCli.main(MavenCli.java:192)
	at java.base/jdk.internal.reflect.NativeMethodAccessorImpl.invoke0(Native Method)
	at java.base/jdk.internal.reflect.NativeMethodAccessorImpl.invoke(NativeMethodAccessorImpl.java:62)
	at java.base/jdk.internal.reflect.DelegatingMethodAccessorImpl.invoke(DelegatingMethodAccessorImpl.java:43)
	at java.base/java.lang.reflect.Method.invoke(Method.java:567)
	at org.codehaus.plexus.classworlds.launcher.Launcher.launchEnhanced(Launcher.java:289)
	at org.codehaus.plexus.classworlds.launcher.Launcher.launch(Launcher.java:229)
	at org.codehaus.plexus.classworlds.launcher.Launcher.mainWithExitCode(Launcher.java:415)
	at org.codehaus.plexus.classworlds.launcher.Launcher.main(Launcher.java:356)

    at org.apache.maven.plugin.surefire.SurefireHelper.throwException (SurefireHelper.java:266)
    at org.apache.maven.plugin.surefire.SurefireHelper.reportExecution (SurefireHelper.java:159)
    at org.apache.maven.plugin.surefire.SurefirePlugin.handleSummary (SurefirePlugin.java:377)
    at org.apache.maven.plugin.surefire.AbstractSurefireMojo.executeAfterPreconditionsChecked (AbstractSurefireMojo.java:1071)
    at org.apache.maven.plugin.surefire.AbstractSurefireMojo.execute (AbstractSurefireMojo.java:882)
    at org.apache.maven.plugin.DefaultBuildPluginManager.executeMojo (DefaultBuildPluginManager.java:137)
    at org.apache.maven.lifecycle.internal.MojoExecutor.execute (MojoExecutor.java:210)
    at org.apache.maven.lifecycle.internal.MojoExecutor.execute (MojoExecutor.java:156)
    at org.apache.maven.lifecycle.internal.MojoExecutor.execute (MojoExecutor.java:148)
    at org.apache.maven.lifecycle.internal.LifecycleModuleBuilder.buildProject (LifecycleModuleBuilder.java:117)
    at org.apache.maven.lifecycle.internal.LifecycleModuleBuilder.buildProject (LifecycleModuleBuilder.java:81)
    at org.apache.maven.lifecycle.internal.builder.singlethreaded.SingleThreadedBuilder.build (SingleThreadedBuilder.java:56)
    at org.apache.maven.lifecycle.internal.LifecycleStarter.execute (LifecycleStarter.java:128)
    at org.apache.maven.DefaultMaven.doExecute (DefaultMaven.java:305)
    at org.apache.maven.DefaultMaven.doExecute (DefaultMaven.java:192)
    at org.apache.maven.DefaultMaven.execute (DefaultMaven.java:105)
    at org.apache.maven.cli.MavenCli.execute (MavenCli.java:956)
    at org.apache.maven.cli.MavenCli.doMain (MavenCli.java:288)
    at org.apache.maven.cli.MavenCli.main (MavenCli.java:192)
    at jdk.internal.reflect.NativeMethodAccessorImpl.invoke0 (Native Method)
    at jdk.internal.reflect.NativeMethodAccessorImpl.invoke (NativeMethodAccessorImpl.java:62)
    at jdk.internal.reflect.DelegatingMethodAccessorImpl.invoke (DelegatingMethodAccessorImpl.java:43)
    at java.lang.reflect.Method.invoke (Method.java:567)
    at org.codehaus.plexus.classworlds.launcher.Launcher.launchEnhanced (Launcher.java:289)
    at org.codehaus.plexus.classworlds.launcher.Launcher.launch (Launcher.java:229)
    at org.codehaus.plexus.classworlds.launcher.Launcher.mainWithExitCode (Launcher.java:415)
    at org.codehaus.plexus.classworlds.launcher.Launcher.main (Launcher.java:356)
Caused by: org.apache.maven.surefire.booter.SurefireBooterForkException: There was an error in the forked processorg/junit/platform/commons/PreconditionViolationException
java.lang.NoClassDefFoundError: org/junit/platform/commons/PreconditionViolationException
	at org.apache.maven.surefire.junitplatform.TestPlanScannerFilter.accept(TestPlanScannerFilter.java:53)
	at org.apache.maven.surefire.util.DefaultScanResult.applyFilter(DefaultScanResult.java:102)
	at org.apache.maven.surefire.junitplatform.JUnitPlatformProvider.scanClasspath(JUnitPlatformProvider.java:143)
	at org.apache.maven.surefire.junitplatform.JUnitPlatformProvider.invoke(JUnitPlatformProvider.java:124)
	at org.apache.maven.surefire.booter.ForkedBooter.invokeProviderInSameClassLoader(ForkedBooter.java:359)
	at org.apache.maven.surefire.booter.ForkedBooter.runSuitesInProcess(ForkedBooter.java:321)
	at org.apache.maven.surefire.booter.ForkedBooter.execute(ForkedBooter.java:119)
	at org.apache.maven.surefire.booter.ForkedBooter.main(ForkedBooter.java:394)
Caused by: java.lang.ClassNotFoundException: org.junit.platform.commons.PreconditionViolationException
	at java.base/jdk.internal.loader.BuiltinClassLoader.loadClass(BuiltinClassLoader.java:583)
	at java.base/jdk.internal.loader.ClassLoaders$AppClassLoader.loadClass(ClassLoaders.java:178)
	at java.base/java.lang.ClassLoader.loadClass(ClassLoader.java:521)
	... 8 more

    at org.apache.maven.plugin.surefire.booterclient.ForkStarter.fork (ForkStarter.java:675)
    at org.apache.maven.plugin.surefire.booterclient.ForkStarter.run (ForkStarter.java:285)
    at org.apache.maven.plugin.surefire.booterclient.ForkStarter.run (ForkStarter.java:248)
    at org.apache.maven.plugin.surefire.AbstractSurefireMojo.executeProvider (AbstractSurefireMojo.java:1208)
    at org.apache.maven.plugin.surefire.AbstractSurefireMojo.executeAfterPreconditionsChecked (AbstractSurefireMojo.java:1055)
    at org.apache.maven.plugin.surefire.AbstractSurefireMojo.execute (AbstractSurefireMojo.java:882)
    at org.apache.maven.plugin.DefaultBuildPluginManager.executeMojo (DefaultBuildPluginManager.java:137)
    at org.apache.maven.lifecycle.internal.MojoExecutor.execute (MojoExecutor.java:210)
    at org.apache.maven.lifecycle.internal.MojoExecutor.execute (MojoExecutor.java:156)
    at org.apache.maven.lifecycle.internal.MojoExecutor.execute (MojoExecutor.java:148)
    at org.apache.maven.lifecycle.internal.LifecycleModuleBuilder.buildProject (LifecycleModuleBuilder.java:117)
    at org.apache.maven.lifecycle.internal.LifecycleModuleBuilder.buildProject (LifecycleModuleBuilder.java:81)
    at org.apache.maven.lifecycle.internal.builder.singlethreaded.SingleThreadedBuilder.build (SingleThreadedBuilder.java:56)
    at org.apache.maven.lifecycle.internal.LifecycleStarter.execute (LifecycleStarter.java:128)
    at org.apache.maven.DefaultMaven.doExecute (DefaultMaven.java:305)
    at org.apache.maven.DefaultMaven.doExecute (DefaultMaven.java:192)
    at org.apache.maven.DefaultMaven.execute (DefaultMaven.java:105)
    at org.apache.maven.cli.MavenCli.execute (MavenCli.java:956)
    at org.apache.maven.cli.MavenCli.doMain (MavenCli.java:288)
    at org.apache.maven.cli.MavenCli.main (MavenCli.java:192)
    at jdk.internal.reflect.NativeMethodAccessorImpl.invoke0 (Native Method)
    at jdk.internal.reflect.NativeMethodAccessorImpl.invoke (NativeMethodAccessorImpl.java:62)
    at jdk.internal.reflect.DelegatingMethodAccessorImpl.invoke (DelegatingMethodAccessorImpl.java:43)
    at java.lang.reflect.Method.invoke (Method.java:567)
    at org.codehaus.plexus.classworlds.launcher.Launcher.launchEnhanced (Launcher.java:289)
    at org.codehaus.plexus.classworlds.launcher.Launcher.launch (Launcher.java:229)
    at org.codehaus.plexus.classworlds.launcher.Launcher.mainWithExitCode (Launcher.java:415)
    at org.codehaus.plexus.classworlds.launcher.Launcher.main (Launcher.java:356)
[ERROR] 
[ERROR] Re-run Maven using the -X switch to enable full debug logging.
[ERROR] 
[ERROR] For more information about the errors and possible solutions, please read the following articles:
[ERROR] [Help 1] http://cwiki.apache.org/confluence/display/MAVEN/MojoExecutionException

	at org.apache.maven.surefire.its.JUnitPlatformIT.testMultipleEngines(JUnitPlatformIT.java:106)




Build log:
[...truncated 51094 lines...]
[2019-07-12T19:09:17.037Z]     at org.apache.maven.lifecycle.internal.MojoExecutor.execute (MojoExecutor.java:215)
[2019-07-12T19:09:17.037Z]     at org.apache.maven.lifecycle.internal.MojoExecutor.execute (MojoExecutor.java:156)
[2019-07-12T19:09:17.037Z]     at org.apache.maven.lifecycle.internal.MojoExecutor.execute (MojoExecutor.java:148)
[2019-07-12T19:09:17.037Z]     at org.apache.maven.lifecycle.internal.LifecycleModuleBuilder.buildProject (LifecycleModuleBuilder.java:117)
[2019-07-12T19:09:17.037Z]     at org.apache.maven.lifecycle.internal.LifecycleModuleBuilder.buildProject (LifecycleModuleBuilder.java:81)
[2019-07-12T19:09:17.037Z]     at org.apache.maven.lifecycle.internal.builder.singlethreaded.SingleThreadedBuilder.build (SingleThreadedBuilder.java:56)
[2019-07-12T19:09:17.037Z]     at org.apache.maven.lifecycle.internal.LifecycleStarter.execute (LifecycleStarter.java:128)
[2019-07-12T19:09:17.037Z]     at org.apache.maven.DefaultMaven.doExecute (DefaultMaven.java:305)
[2019-07-12T19:09:17.037Z]     at org.apache.maven.DefaultMaven.doExecute (DefaultMaven.java:192)
[2019-07-12T19:09:17.037Z]     at org.apache.maven.DefaultMaven.execute (DefaultMaven.java:105)
[2019-07-12T19:09:17.037Z]     at org.apache.maven.cli.MavenCli.execute (MavenCli.java:956)
[2019-07-12T19:09:17.037Z]     at org.apache.maven.cli.MavenCli.doMain (MavenCli.java:288)
[2019-07-12T19:09:17.037Z]     at org.apache.maven.cli.MavenCli.main (MavenCli.java:192)
[2019-07-12T19:09:17.037Z]     at sun.reflect.NativeMethodAccessorImpl.invoke0 (Native Method)
[2019-07-12T19:09:17.037Z]     at sun.reflect.NativeMethodAccessorImpl.invoke (NativeMethodAccessorImpl.java:62)
[2019-07-12T19:09:17.037Z]     at sun.reflect.DelegatingMethodAccessorImpl.invoke (DelegatingMethodAccessorImpl.java:43)
[2019-07-12T19:09:17.037Z]     at java.lang.reflect.Method.invoke (Method.java:498)
[2019-07-12T19:09:17.037Z]     at org.codehaus.plexus.classworlds.launcher.Launcher.launchEnhanced (Launcher.java:289)
[2019-07-12T19:09:17.037Z]     at org.codehaus.plexus.classworlds.launcher.Launcher.launch (Launcher.java:229)
[2019-07-12T19:09:17.037Z]     at org.codehaus.plexus.classworlds.launcher.Launcher.mainWithExitCode (Launcher.java:415)
[2019-07-12T19:09:17.037Z]     at org.codehaus.plexus.classworlds.launcher.Launcher.main (Launcher.java:356)
[2019-07-12T19:09:17.037Z] Caused by: org.apache.maven.plugin.MojoFailureException: There are test failures.
[2019-07-12T19:09:17.037Z] 
[2019-07-12T19:09:17.037Z] Please refer to /home/jenkins/jenkins-slave/workspace/aven-box_maven-surefire_junit550@2/surefire-its/target/failsafe-reports for the individual test results.
[2019-07-12T19:09:17.037Z] Please refer to dump files (if any exist) [date].dump, [date]-jvmRun[N].dump and [date].dumpstream.
[2019-07-12T19:09:17.037Z]     at org.apache.maven.plugin.surefire.SurefireHelper.throwException (SurefireHelper.java:271)
[2019-07-12T19:09:17.037Z]     at org.apache.maven.plugin.surefire.SurefireHelper.reportExecution (SurefireHelper.java:159)
[2019-07-12T19:09:17.037Z]     at org.apache.maven.plugin.failsafe.VerifyMojo.execute (VerifyMojo.java:192)
[2019-07-12T19:09:17.037Z]     at org.apache.maven.plugin.DefaultBuildPluginManager.executeMojo (DefaultBuildPluginManager.java:137)
[2019-07-12T19:09:17.037Z]     at org.apache.maven.lifecycle.internal.MojoExecutor.execute (MojoExecutor.java:210)
[2019-07-12T19:09:17.037Z]     at org.apache.maven.lifecycle.internal.MojoExecutor.execute (MojoExecutor.java:156)
[2019-07-12T19:09:17.037Z]     at org.apache.maven.lifecycle.internal.MojoExecutor.execute (MojoExecutor.java:148)
[2019-07-12T19:09:17.037Z]     at org.apache.maven.lifecycle.internal.LifecycleModuleBuilder.buildProject (LifecycleModuleBuilder.java:117)
[2019-07-12T19:09:17.037Z]     at org.apache.maven.lifecycle.internal.LifecycleModuleBuilder.buildProject (LifecycleModuleBuilder.java:81)
[2019-07-12T19:09:17.037Z]     at org.apache.maven.lifecycle.internal.builder.singlethreaded.SingleThreadedBuilder.build (SingleThreadedBuilder.java:56)
[2019-07-12T19:09:17.037Z]     at org.apache.maven.lifecycle.internal.LifecycleStarter.execute (LifecycleStarter.java:128)
[2019-07-12T19:09:17.037Z]     at org.apache.maven.DefaultMaven.doExecute (DefaultMaven.java:305)
[2019-07-12T19:09:17.037Z]     at org.apache.maven.DefaultMaven.doExecute (DefaultMaven.java:192)
[2019-07-12T19:09:17.037Z]     at org.apache.maven.DefaultMaven.execute (DefaultMaven.java:105)
[2019-07-12T19:09:17.037Z]     at org.apache.maven.cli.MavenCli.execute (MavenCli.java:956)
[2019-07-12T19:09:17.037Z]     at org.apache.maven.cli.MavenCli.doMain (MavenCli.java:288)
[2019-07-12T19:09:17.037Z]     at org.apache.maven.cli.MavenCli.main (MavenCli.java:192)
[2019-07-12T19:09:17.037Z]     at sun.reflect.NativeMethodAccessorImpl.invoke0 (Native Method)
[2019-07-12T19:09:17.037Z]     at sun.reflect.NativeMethodAccessorImpl.invoke (NativeMethodAccessorImpl.java:62)
[2019-07-12T19:09:17.037Z]     at sun.reflect.DelegatingMethodAccessorImpl.invoke (DelegatingMethodAccessorImpl.java:43)
[2019-07-12T19:09:17.037Z]     at java.lang.reflect.Method.invoke (Method.java:498)
[2019-07-12T19:09:17.037Z]     at org.codehaus.plexus.classworlds.launcher.Launcher.launchEnhanced (Launcher.java:289)
[2019-07-12T19:09:17.037Z]     at org.codehaus.plexus.classworlds.launcher.Launcher.launch (Launcher.java:229)
[2019-07-12T19:09:17.037Z]     at org.codehaus.plexus.classworlds.launcher.Launcher.mainWithExitCode (Launcher.java:415)
[2019-07-12T19:09:17.037Z]     at org.codehaus.plexus.classworlds.launcher.Launcher.main (Launcher.java:356)
[2019-07-12T19:09:17.037Z] [ERROR] 
[2019-07-12T19:09:17.037Z] [ERROR] Re-run Maven using the -X switch to enable full debug logging.
[2019-07-12T19:09:17.037Z] [ERROR] 
[2019-07-12T19:09:17.037Z] [ERROR] For more information about the errors and possible solutions, please read the following articles:
[2019-07-12T19:09:17.037Z] [ERROR] [Help 1] http://cwiki.apache.org/confluence/display/MAVEN/MojoFailureException
[2019-07-12T19:09:17.037Z] [ERROR] 
[2019-07-12T19:09:17.037Z] [ERROR] After correcting the problems, you can resume the build with the command
[2019-07-12T19:09:17.037Z] [ERROR]   mvn <goals> -rf :surefire-its
[Pipeline] }
[Pipeline] // withEnv
[Pipeline] }
[Pipeline] // stage
[Pipeline] fileExists
[Pipeline] zip
[2019-07-12T19:09:18.058Z] Writing zip file of /home/jenkins/jenkins-slave/workspace/aven-box_maven-surefire_junit550@2/maven-failsafe-plugin/target/it to /home/jenkins/jenkins-slave/workspace/aven-box_maven-surefire_junit550@2/maven-failsafe-plugin--linux-jdk11-maven3.6.x.zip
[2019-07-12T19:09:18.265Z] Zipped 78 entries.
[2019-07-12T19:09:18.265Z] Archiving /home/jenkins/jenkins-slave/workspace/aven-box_maven-surefire_junit550@2/maven-failsafe-plugin--linux-jdk11-maven3.6.x.zip
[2019-07-12T19:09:18.265Z] [Fast Archiver] No prior successful build to compare, so performing full copy of artifacts
[Pipeline] fileExists
[Pipeline] zip
[2019-07-12T19:09:19.228Z] Writing zip file of /home/jenkins/jenkins-slave/workspace/aven-box_maven-surefire_junit550@2/surefire-its/target to /home/jenkins/jenkins-slave/workspace/aven-box_maven-surefire_junit550@2/surefire-its--linux-jdk11-maven3.6.x.zip
[2019-07-12T19:09:20.381Z] [INFO] Tests run: 2, Failures: 0, Errors: 0, Skipped: 0, Time elapsed: 24.047 s - in org.apache.maven.surefire.its.jiras.Surefire943ReportContentIT
[2019-07-12T19:09:20.381Z] [INFO] Running org.apache.maven.surefire.its.jiras.Surefire946KillMainProcessInReusableForkIT
[2019-07-12T19:09:27.294Z] Zipped 17467 entries.
[2019-07-12T19:09:27.294Z] Archiving /home/jenkins/jenkins-slave/workspace/aven-box_maven-surefire_junit550@2/surefire-its--linux-jdk11-maven3.6.x.zip
[2019-07-12T19:09:27.295Z] [Fast Archiver] No prior successful build to compare, so performing full copy of artifacts
[Pipeline] archiveArtifacts
[2019-07-12T19:09:32.113Z] Archiving artifacts
[2019-07-12T19:09:32.274Z] [Fast Archiver] No prior successful build to compare, so performing full copy of artifacts
[Pipeline] cleanWs
[2019-07-12T19:09:36.294Z] [WS-CLEANUP] Deleting project workspace...
[2019-07-12T19:09:36.294Z] [WS-CLEANUP] Deferred wipeout is used...
[2019-07-12T19:09:36.638Z] [WS-CLEANUP] done
[Pipeline] }
[Pipeline] // ws
[Pipeline] }
[Pipeline] // timestamps
[Pipeline] }
[Pipeline] // node
[Pipeline] }
[2019-07-12T19:09:41.761Z] [INFO] Tests run: 3, Failures: 0, Errors: 0, Skipped: 0, Time elapsed: 21.985 s - in org.apache.maven.surefire.its.jiras.Surefire946KillMainProcessInReusableForkIT
[2019-07-12T19:09:41.761Z] [INFO] Running org.apache.maven.surefire.its.jiras.Surefire972BizarreNoClassDefIT
[2019-07-12T19:09:48.230Z] [INFO] Tests run: 1, Failures: 0, Errors: 0, Skipped: 0, Time elapsed: 6.603 s - in org.apache.maven.surefire.its.jiras.Surefire972BizarreNoClassDefIT
[2019-07-12T19:09:48.230Z] [INFO] Running org.apache.maven.surefire.its.jiras.Surefire975DefaultVMEncodingIT
[2019-07-12T19:09:52.509Z] [INFO] Tests run: 1, Failures: 0, Errors: 0, Skipped: 0, Time elapsed: 4.594 s - in org.apache.maven.surefire.its.jiras.Surefire975DefaultVMEncodingIT
[2019-07-12T19:09:52.509Z] [INFO] Running org.apache.maven.surefire.its.jiras.Surefire979WrongClassLoaderIT
[2019-07-12T19:09:56.687Z] [INFO] Tests run: 1, Failures: 0, Errors: 0, Skipped: 0, Time elapsed: 4.378 s - in org.apache.maven.surefire.its.jiras.Surefire979WrongClassLoaderIT
[2019-07-12T19:09:56.687Z] [INFO] Running org.apache.maven.surefire.its.jiras.Surefire985ParameterizedRunnerAndCategoriesIT
[2019-07-12T19:10:02.012Z] [INFO] Tests run: 1, Failures: 0, Errors: 0, Skipped: 0, Time elapsed: 4.381 s - in org.apache.maven.surefire.its.jiras.Surefire985ParameterizedRunnerAndCategoriesIT
[2019-07-12T19:10:02.012Z] [INFO] Running org.apache.maven.surefire.its.jiras.Surefire995CategoryInheritanceIT
[2019-07-12T19:10:25.304Z] [INFO] Tests run: 5, Failures: 0, Errors: 0, Skipped: 0, Time elapsed: 21.484 s - in org.apache.maven.surefire.its.jiras.Surefire995CategoryInheritanceIT
[2019-07-12T19:10:25.304Z] [INFO] 
[2019-07-12T19:10:25.304Z] [INFO] Results:
[2019-07-12T19:10:25.304Z] [INFO] 
[2019-07-12T19:10:25.304Z] [ERROR] Errors: 
[2019-07-12T19:10:25.304Z] [ERROR]   JUnitPlatformIT.testMultipleEngines:106 » SurefireVerifier Exit code was non-z...
[2019-07-12T19:10:25.304Z] [INFO] 
[2019-07-12T19:10:25.304Z] [ERROR] Tests run: 798, Failures: 0, Errors: 1, Skipped: 143
[2019-07-12T19:10:25.304Z] [INFO] 
[2019-07-12T19:10:25.304Z] [INFO] 
[2019-07-12T19:10:25.304Z] [INFO] --- maven-checkstyle-plugin:3.0.0:check (checkstyle-check) @ surefire-its ---
[2019-07-12T19:10:25.304Z] [INFO] 
[2019-07-12T19:10:25.304Z] [INFO] --- maven-failsafe-plugin:3.0.0-M3:verify (default) @ surefire-its ---
[2019-07-12T19:10:25.304Z] [INFO] Failsafe report directory: /home/jenkins/jenkins-slave/workspace/aven-box_maven-surefire_junit550@2/surefire-its/target/failsafe-reports
[2019-07-12T19:10:25.304Z] [INFO] ------------------------------------------------------------------------
[2019-07-12T19:10:25.304Z] [INFO] Reactor Summary for Apache Maven Surefire 3.0.0-SNAPSHOT:
[2019-07-12T19:10:25.304Z] [INFO] 
[2019-07-12T19:10:25.304Z] [INFO] Apache Maven Surefire .............................. SUCCESS [ 13.307 s]
[2019-07-12T19:10:25.304Z] [INFO] SureFire Logger API ................................ SUCCESS [  8.138 s]
[2019-07-12T19:10:25.304Z] [INFO] SureFire API ....................................... SUCCESS [  8.890 s]
[2019-07-12T19:10:25.304Z] [INFO] Surefire Extensions API ............................ SUCCESS [  1.578 s]
[2019-07-12T19:10:25.304Z] [INFO] SureFire Booter .................................... SUCCESS [ 11.409 s]
[2019-07-12T19:10:25.304Z] [INFO] Maven Surefire Test-Grouping Support ............... SUCCESS [  4.608 s]
[2019-07-12T19:10:25.304Z] [INFO] SureFire Providers ................................. SUCCESS [  0.842 s]
[2019-07-12T19:10:25.304Z] [INFO] Shared JUnit3 Provider Code ........................ SUCCESS [  2.937 s]
[2019-07-12T19:10:25.304Z] [INFO] Shared Java 5 Provider Base ........................ SUCCESS [  3.802 s]
[2019-07-12T19:10:25.304Z] [INFO] Shared JUnit4 Provider Code ........................ SUCCESS [  4.190 s]
[2019-07-12T19:10:25.304Z] [INFO] Shared JUnit48 Provider Code ....................... SUCCESS [  4.606 s]
[2019-07-12T19:10:25.304Z] [INFO] SureFire JUnit Runner .............................. SUCCESS [  3.454 s]
[2019-07-12T19:10:25.304Z] [INFO] SureFire JUnit4 Runner ............................. SUCCESS [  3.375 s]
[2019-07-12T19:10:25.304Z] [INFO] Maven Surefire Common .............................. SUCCESS [ 32.781 s]
[2019-07-12T19:10:25.304Z] [INFO] SureFire JUnitCore Runner .......................... SUCCESS [02:13 min]
[2019-07-12T19:10:25.304Z] [INFO] SureFire JUnit Platform Runner ..................... SUCCESS [  7.167 s]
[2019-07-12T19:10:25.304Z] [INFO] SureFire TestNG Utils .............................. SUCCESS [  2.972 s]
[2019-07-12T19:10:25.304Z] [INFO] SureFire TestNG Runner ............................. SUCCESS [  4.095 s]
[2019-07-12T19:10:25.304Z] [INFO] ShadeFire JUnit3 Provider .......................... SUCCESS [  1.097 s]
[2019-07-12T19:10:25.304Z] [INFO] Surefire Report Parser ............................. SUCCESS [  4.966 s]
[2019-07-12T19:10:25.304Z] [INFO] Maven Surefire Plugin .............................. SUCCESS [  7.719 s]
[2019-07-12T19:10:25.304Z] [INFO] Maven Failsafe Plugin .............................. SUCCESS [ 46.026 s]
[2019-07-12T19:10:25.304Z] [INFO] Maven Surefire Report Plugin ....................... SUCCESS [ 10.657 s]
[2019-07-12T19:10:25.304Z] [INFO] Maven Surefire Integration Tests ................... FAILURE [  01:03 h]
[2019-07-12T19:10:25.304Z] [INFO] ------------------------------------------------------------------------
[2019-07-12T19:10:25.304Z] [INFO] BUILD FAILURE
[2019-07-12T19:10:25.304Z] [INFO] ------------------------------------------------------------------------
[2019-07-12T19:10:25.304Z] [INFO] Total time:  01:09 h
[2019-07-12T19:10:25.304Z] [INFO] Finished at: 2019-07-12T19:10:23Z
[2019-07-12T19:10:25.305Z] [INFO] ------------------------------------------------------------------------
[2019-07-12T19:10:25.305Z] [ERROR] Failed to execute goal org.apache.maven.plugins:maven-failsafe-plugin:3.0.0-M3:verify (default) on project surefire-its: There are test failures.
[2019-07-12T19:10:25.305Z] [ERROR] 
[2019-07-12T19:10:25.305Z] [ERROR] Please refer to /home/jenkins/jenkins-slave/workspace/aven-box_maven-surefire_junit550@2/surefire-its/target/failsafe-reports for the individual test results.
[2019-07-12T19:10:25.305Z] [ERROR] Please refer to dump files (if any exist) [date].dump, [date]-jvmRun[N].dump and [date].dumpstream.
[2019-07-12T19:10:25.305Z] [ERROR] -> [Help 1]
[2019-07-12T19:10:25.305Z] org.apache.maven.lifecycle.LifecycleExecutionException: Failed to execute goal org.apache.maven.plugins:maven-failsafe-plugin:3.0.0-M3:verify (default) on project surefire-its: There are test failures.
[2019-07-12T19:10:25.305Z] 
[2019-07-12T19:10:25.305Z] Please refer to /home/jenkins/jenkins-slave/workspace/aven-box_maven-surefire_junit550@2/surefire-its/target/failsafe-reports for the individual test results.
[2019-07-12T19:10:25.305Z] Please refer to dump files (if any exist) [date].dump, [date]-jvmRun[N].dump and [date].dumpstream.
[2019-07-12T19:10:25.305Z]     at org.apache.maven.lifecycle.internal.MojoExecutor.execute (MojoExecutor.java:215)
[2019-07-12T19:10:25.305Z]     at org.apache.maven.lifecycle.internal.MojoExecutor.execute (MojoExecutor.java:156)
[2019-07-12T19:10:25.305Z]     at org.apache.maven.lifecycle.internal.MojoExecutor.execute (MojoExecutor.java:148)
[2019-07-12T19:10:25.305Z]     at org.apache.maven.lifecycle.internal.LifecycleModuleBuilder.buildProject (LifecycleModuleBuilder.java:117)
[2019-07-12T19:10:25.305Z]     at org.apache.maven.lifecycle.internal.LifecycleModuleBuilder.buildProject (LifecycleModuleBuilder.java:81)
[2019-07-12T19:10:25.305Z]     at org.apache.maven.lifecycle.internal.builder.singlethreaded.SingleThreadedBuilder.build (SingleThreadedBuilder.java:56)
[2019-07-12T19:10:25.305Z]     at org.apache.maven.lifecycle.internal.LifecycleStarter.execute (LifecycleStarter.java:128)
[2019-07-12T19:10:25.305Z]     at org.apache.maven.DefaultMaven.doExecute (DefaultMaven.java:305)
[2019-07-12T19:10:25.305Z]     at org.apache.maven.DefaultMaven.doExecute (DefaultMaven.java:192)
[2019-07-12T19:10:25.305Z]     at org.apache.maven.DefaultMaven.execute (DefaultMaven.java:105)
[2019-07-12T19:10:25.305Z]     at org.apache.maven.cli.MavenCli.execute (MavenCli.java:956)
[2019-07-12T19:10:25.305Z]     at org.apache.maven.cli.MavenCli.doMain (MavenCli.java:288)
[2019-07-12T19:10:25.305Z]     at org.apache.maven.cli.MavenCli.main (MavenCli.java:192)
[2019-07-12T19:10:25.305Z]     at sun.reflect.NativeMethodAccessorImpl.invoke0 (Native Method)
[2019-07-12T19:10:25.305Z]     at sun.reflect.NativeMethodAccessorImpl.invoke (NativeMethodAccessorImpl.java:62)
[2019-07-12T19:10:25.305Z]     at sun.reflect.DelegatingMethodAccessorImpl.invoke (DelegatingMethodAccessorImpl.java:43)
[2019-07-12T19:10:25.305Z]     at java.lang.reflect.Method.invoke (Method.java:498)
[2019-07-12T19:10:25.305Z]     at org.codehaus.plexus.classworlds.launcher.Launcher.launchEnhanced (Launcher.java:289)
[2019-07-12T19:10:25.305Z]     at org.codehaus.plexus.classworlds.launcher.Launcher.launch (Launcher.java:229)
[2019-07-12T19:10:25.305Z]     at org.codehaus.plexus.classworlds.launcher.Launcher.mainWithExitCode (Launcher.java:415)
[2019-07-12T19:10:25.305Z]     at org.codehaus.plexus.classworlds.launcher.Launcher.main (Launcher.java:356)
[2019-07-12T19:10:25.305Z] Caused by: org.apache.maven.plugin.MojoFailureException: There are test failures.
[2019-07-12T19:10:25.305Z] 
[2019-07-12T19:10:25.305Z] Please refer to /home/jenkins/jenkins-slave/workspace/aven-box_maven-surefire_junit550@2/surefire-its/target/failsafe-reports for the individual test results.
[2019-07-12T19:10:25.305Z] Please refer to dump files (if any exist) [date].dump, [date]-jvmRun[N].dump and [date].dumpstream.
[2019-07-12T19:10:25.305Z]     at org.apache.maven.plugin.surefire.SurefireHelper.throwException (SurefireHelper.java:271)
[2019-07-12T19:10:25.305Z]     at org.apache.maven.plugin.surefire.SurefireHelper.reportExecution (SurefireHelper.java:159)
[2019-07-12T19:10:25.305Z]     at org.apache.maven.plugin.failsafe.VerifyMojo.execute (VerifyMojo.java:192)
[2019-07-12T19:10:25.305Z]     at org.apache.maven.plugin.DefaultBuildPluginManager.executeMojo (DefaultBuildPluginManager.java:137)
[2019-07-12T19:10:25.305Z]     at org.apache.maven.lifecycle.internal.MojoExecutor.execute (MojoExecutor.java:210)
[2019-07-12T19:10:25.305Z]     at org.apache.maven.lifecycle.internal.MojoExecutor.execute (MojoExecutor.java:156)
[2019-07-12T19:10:25.305Z]     at org.apache.maven.lifecycle.internal.MojoExecutor.execute (MojoExecutor.java:148)
[2019-07-12T19:10:25.305Z]     at org.apache.maven.lifecycle.internal.LifecycleModuleBuilder.buildProject (LifecycleModuleBuilder.java:117)
[2019-07-12T19:10:25.305Z]     at org.apache.maven.lifecycle.internal.LifecycleModuleBuilder.buildProject (LifecycleModuleBuilder.java:81)
[2019-07-12T19:10:25.305Z]     at org.apache.maven.lifecycle.internal.builder.singlethreaded.SingleThreadedBuilder.build (SingleThreadedBuilder.java:56)
[2019-07-12T19:10:25.305Z]     at org.apache.maven.lifecycle.internal.LifecycleStarter.execute (LifecycleStarter.java:128)
[2019-07-12T19:10:25.305Z]     at org.apache.maven.DefaultMaven.doExecute (DefaultMaven.java:305)
[2019-07-12T19:10:25.305Z]     at org.apache.maven.DefaultMaven.doExecute (DefaultMaven.java:192)
[2019-07-12T19:10:25.305Z]     at org.apache.maven.DefaultMaven.execute (DefaultMaven.java:105)
[2019-07-12T19:10:25.305Z]     at org.apache.maven.cli.MavenCli.execute (MavenCli.java:956)
[2019-07-12T19:10:25.305Z]     at org.apache.maven.cli.MavenCli.doMain (MavenCli.java:288)
[2019-07-12T19:10:25.305Z]     at org.apache.maven.cli.MavenCli.main (MavenCli.java:192)
[2019-07-12T19:10:25.305Z]     at sun.reflect.NativeMethodAccessorImpl.invoke0 (Native Method)
[2019-07-12T19:10:25.305Z]     at sun.reflect.NativeMethodAccessorImpl.invoke (NativeMethodAccessorImpl.java:62)
[2019-07-12T19:10:25.305Z]     at sun.reflect.DelegatingMethodAccessorImpl.invoke (DelegatingMethodAccessorImpl.java:43)
[2019-07-12T19:10:25.305Z]     at java.lang.reflect.Method.invoke (Method.java:498)
[2019-07-12T19:10:25.305Z]     at org.codehaus.plexus.classworlds.launcher.Launcher.launchEnhanced (Launcher.java:289)
[2019-07-12T19:10:25.305Z]     at org.codehaus.plexus.classworlds.launcher.Launcher.launch (Launcher.java:229)
[2019-07-12T19:10:25.305Z]     at org.codehaus.plexus.classworlds.launcher.Launcher.mainWithExitCode (Launcher.java:415)
[2019-07-12T19:10:25.305Z]     at org.codehaus.plexus.classworlds.launcher.Launcher.main (Launcher.java:356)
[2019-07-12T19:10:25.305Z] [ERROR] 
[2019-07-12T19:10:25.305Z] [ERROR] Re-run Maven using the -X switch to enable full debug logging.
[2019-07-12T19:10:25.305Z] [ERROR] 
[2019-07-12T19:10:25.305Z] [ERROR] For more information about the errors and possible solutions, please read the following articles:
[2019-07-12T19:10:25.305Z] [ERROR] [Help 1] http://cwiki.apache.org/confluence/display/MAVEN/MojoFailureException
[2019-07-12T19:10:25.305Z] [ERROR] 
[2019-07-12T19:10:25.305Z] [ERROR] After correcting the problems, you can resume the build with the command
[2019-07-12T19:10:25.305Z] [ERROR]   mvn <goals> -rf :surefire-its
[Pipeline] }
[Pipeline] // withEnv
[Pipeline] }
[Pipeline] // stage
[Pipeline] fileExists
[Pipeline] zip
[2019-07-12T19:10:26.385Z] Writing zip file of /home/jenkins/jenkins-slave/workspace/aven-box_maven-surefire_junit550@2/maven-failsafe-plugin/target/it to /home/jenkins/jenkins-slave/workspace/aven-box_maven-surefire_junit550@2/maven-failsafe-plugin--linux-jdk8-maven3.6.x.zip
[2019-07-12T19:10:27.058Z] Zipped 78 entries.
[2019-07-12T19:10:27.058Z] Archiving /home/jenkins/jenkins-slave/workspace/aven-box_maven-surefire_junit550@2/maven-failsafe-plugin--linux-jdk8-maven3.6.x.zip
[2019-07-12T19:10:27.058Z] [Fast Archiver] No prior successful build to compare, so performing full copy of artifacts
[Pipeline] fileExists
[Pipeline] zip
[2019-07-12T19:10:27.996Z] Writing zip file of /home/jenkins/jenkins-slave/workspace/aven-box_maven-surefire_junit550@2/surefire-its/target to /home/jenkins/jenkins-slave/workspace/aven-box_maven-surefire_junit550@2/surefire-its--linux-jdk8-maven3.6.x.zip
[2019-07-12T19:12:10.234Z] Zipped 17132 entries.
[2019-07-12T19:12:10.234Z] Archiving /home/jenkins/jenkins-slave/workspace/aven-box_maven-surefire_junit550@2/surefire-its--linux-jdk8-maven3.6.x.zip
[2019-07-12T19:12:10.234Z] [Fast Archiver] No prior successful build to compare, so performing full copy of artifacts
[Pipeline] archiveArtifacts
[2019-07-12T19:12:14.431Z] Archiving artifacts
[2019-07-12T19:12:14.590Z] [Fast Archiver] No prior successful build to compare, so performing full copy of artifacts
[Pipeline] cleanWs
[2019-07-12T19:12:18.200Z] [WS-CLEANUP] Deleting project workspace...
[2019-07-12T19:12:18.200Z] [WS-CLEANUP] Deferred wipeout is used...
[2019-07-12T19:12:18.522Z] [WS-CLEANUP] done
[Pipeline] }
[Pipeline] // ws
[Pipeline] }
[Pipeline] // timestamps
[Pipeline] }
[Pipeline] // node
[Pipeline] }
[Pipeline] // parallel
[Pipeline] echo
Build result: FAILURE
[Pipeline] jiraIssueSelector
[Pipeline] emailext
Mime
  • Unnamed multipart/mixed (inline, None, 0 bytes)
View raw message