maven-notifications mailing list archives

Site index · List index
Message view « Date » · « Thread »
Top « Date » · « Thread »
From Apache Jenkins Server <jenk...@builds.apache.org>
Subject Build failed in Jenkins: Maven TLP » maven-site-plugin » J7 #2
Date Sun, 07 Jul 2019 13:22:32 GMT
See https://builds.apache.org/job/maven-box/job/maven-site-plugin/job/J7/2/

Changes:

* Add JDK 14 (latest)

No tests ran.

Build log:
[...truncated 2295 lines...]
	at org.apache.maven.lifecycle.internal.LifecycleModuleBuilder.buildProject(LifecycleModuleBuilder.java:116)
	at org.apache.maven.lifecycle.internal.LifecycleModuleBuilder.buildProject(LifecycleModuleBuilder.java:80)
	at org.apache.maven.lifecycle.internal.builder.singlethreaded.SingleThreadedBuilder.build(SingleThreadedBuilder.java:51)
	at org.apache.maven.lifecycle.internal.LifecycleStarter.execute(LifecycleStarter.java:128)
	at org.apache.maven.DefaultMaven.doExecute(DefaultMaven.java:307)
	at org.apache.maven.DefaultMaven.doExecute(DefaultMaven.java:193)
	at org.apache.maven.DefaultMaven.execute(DefaultMaven.java:106)
	at org.apache.maven.cli.MavenCli.execute(MavenCli.java:863)
	at org.apache.maven.cli.MavenCli.doMain(MavenCli.java:288)
	at org.apache.maven.cli.MavenCli.main(MavenCli.java:199)
	at sun.reflect.NativeMethodAccessorImpl.invoke0(Native Method)
	at sun.reflect.NativeMethodAccessorImpl.invoke(NativeMethodAccessorImpl.java:57)
	at sun.reflect.DelegatingMethodAccessorImpl.invoke(DelegatingMethodAccessorImpl.java:43)
	at java.lang.reflect.Method.invoke(Method.java:606)
	at org.codehaus.plexus.classworlds.launcher.Launcher.launchEnhanced(Launcher.java:289)
	at org.codehaus.plexus.classworlds.launcher.Launcher.launch(Launcher.java:229)
	at org.codehaus.plexus.classworlds.launcher.Launcher.mainWithExitCode(Launcher.java:415)
	at org.codehaus.plexus.classworlds.launcher.Launcher.main(Launcher.java:356)
Caused by: org.apache.maven.plugin.MojoExecutionException: Some Enforcer rules have failed.
Look above for specific messages explaining why the rule failed.
	at org.apache.maven.plugins.enforcer.EnforceMojo.execute(EnforceMojo.java:237)
	at org.apache.maven.plugin.DefaultBuildPluginManager.executeMojo(DefaultBuildPluginManager.java:134)
	at org.apache.maven.lifecycle.internal.MojoExecutor.execute(MojoExecutor.java:207)
	... 20 more
[ERROR] 
[ERROR] Re-run Maven using the -X switch to enable full debug logging.
[ERROR] 
[ERROR] For more information about the errors and possible solutions, please read the following
articles:
[ERROR] [Help 1] http://cwiki.apache.org/confluence/display/MAVEN/MojoExecutionException
Picked up JAVA_TOOL_OPTIONS: -Dmaven.ext.class.path="f:\jenkins\jenkins-slave\workspace\maven-box_maven-site-plugin_J7@3@tmp\withMaven48b67548\pipeline-maven-spy.jar"
-Dorg.jenkinsci.plugins.pipeline.maven.reportsFolder="f:\jenkins\jenkins-slave\workspace\maven-box_maven-site-plugin_J7@3@tmp\withMaven48b67548"

[Pipeline] // dir
[Pipeline] }
[Pipeline] }
[Pipeline] }
[Fast Archiver] No prior successful build to compare, so performing full copy of artifacts
[Pipeline] // stage
[withMaven] openTasksPublisher - Scan Tasks for Maven artifact org.apache.maven.plugins:maven-site-plugin:maven-plugin:3.8.2-SNAPSHOT
in source directory windows-jdk11-m3.6.x_build\src\main\java
[Pipeline] }
[WS-CLEANUP] done
[Pipeline] // dir
[TASKS] Scanning folder '/home/jenkins/jenkins-slave/workspace/maven-box_maven-site-plugin_J7@2'
for files matching the pattern 'linux-jdk7-m3.5.x_build/src/main/java/**/*' - excludes: null
[TASKS] Found 21 files to scan for tasks
[TASKS] Found 8 open tasks.
Skipping warnings blame since pipelines do not have an SCM link.%n
[Pipeline] }
[Fast Archiver] No prior successful build to compare, so performing full copy of artifacts
[Pipeline] // ws
[Pipeline] }
[withMaven] openTasksPublisher - Scan Tasks for Maven artifact org.apache.maven.plugins:maven-site-plugin:maven-plugin:3.8.2-SNAPSHOT
in source directory windows-jdk7-m3.3.x_build\src\main\java
[Pipeline] }
[TASKS] Scanning folder 'f:\jenkins\jenkins-slave\workspace\maven-box_maven-site-plugin_J7@2@2'
for files matching the pattern 'windows-jdk11-m3.6.x_build\src\main\java\**\*' - excludes:
null
[TASKS] Found 21 files to scan for tasks
[TASKS] Found 8 open tasks.
Skipping warnings blame since pipelines do not have an SCM link.%n
[Pipeline] // node
[Pipeline] // stage
[Pipeline] }
Failed in branch linux-jdk11-m3.6.x_build
[Pipeline] }
[withMaven] Publishers: Generated Artifacts Publisher: 6 ms, Open Task Scanner Publisher:
211 ms
[Pipeline] // ws
[Pipeline] // withMaven
[TASKS] Scanning folder 'f:\jenkins\jenkins-slave\workspace\maven-box_maven-site-plugin_J7@3'
for files matching the pattern 'windows-jdk7-m3.3.x_build\src\main\java\**\*' - excludes:
null
[TASKS] Found 21 files to scan for tasks
[TASKS] Found 8 open tasks.
Skipping warnings blame since pipelines do not have an SCM link.%n
[Pipeline] }
[Pipeline] cleanWs
[WS-CLEANUP] Deleting project workspace...
[WS-CLEANUP] Deferred wipeout is used...
[Pipeline] // node
[WS-CLEANUP] done
[Pipeline] }
Failed in branch linux-jdk12-m3.6.x_build
[Pipeline] cleanWs
[WS-CLEANUP] Deleting project workspace...
[WS-CLEANUP] Deferred wipeout is used...
[withMaven] Publishers: Generated Artifacts Publisher: 6 ms, Open Task Scanner Publisher:
259 ms
[WS-CLEANUP] done
[Pipeline] // withMaven
[Pipeline] cleanWs
[Pipeline] }
[WS-CLEANUP] Deleting project workspace...
[WS-CLEANUP] Deferred wipeout is used...
[Pipeline] // stage
[WS-CLEANUP] done
[Pipeline] }
[Pipeline] // ws
[Pipeline] }
[Pipeline] cleanWs
[WS-CLEANUP] Deleting project workspace...
[WS-CLEANUP] Deferred wipeout is used...
[WS-CLEANUP] done
[Pipeline] // node
[Pipeline] }
Failed in branch windows-jdk11-m3.6.x_build
[Pipeline] }
[Pipeline] // stage
[INFO] [jenkins-event-spy] Generate F:\jenkins\jenkins-slave\workspace\maven-box_maven-site-plugin_J7@3@tmp\withMaven96f54ff0\maven-spy-20190707-062227-478362781724855548440.log.tmp
...
[INFO] Error stacktraces are turned on.
[Pipeline] }
[Pipeline] // ws
[Pipeline] }
[Pipeline] // node
[Pipeline] }
Failed in branch windows-jdk7-m3.3.x_build
[INFO] Scanning for projects...
[INFO] 
[INFO] -------------< org.apache.maven.plugins:maven-site-plugin >-------------
[INFO] Building Apache Maven Site Plugin 3.8.2-SNAPSHOT
[INFO] ----------------------------[ maven-plugin ]----------------------------
[withMaven] Publishers: Generated Artifacts Publisher: 155 ms, Open Task Scanner Publisher:
1468 ms
[Pipeline] // withMaven
[Pipeline] cleanWs
[WS-CLEANUP] Deleting project workspace...
[WS-CLEANUP] Deferred wipeout is used...
[INFO] 
[INFO] --- maven-clean-plugin:3.1.0:clean (default-clean) @ maven-site-plugin ---
[INFO] 
[INFO] --- maven-enforcer-plugin:1.4.1:enforce (enforce-maven-version) @ maven-site-plugin
---
[WS-CLEANUP] done
[Pipeline] cleanWs
[INFO] 
[INFO] --- maven-enforcer-plugin:1.4.1:enforce (enforce-bytecode-version) @ maven-site-plugin
---
[WS-CLEANUP] Deleting project workspace...
[WS-CLEANUP] Deferred wipeout is used...
[WS-CLEANUP] done
[Pipeline] }
[Pipeline] // stage
[Pipeline] }
[Pipeline] // ws
[Pipeline] }
[Pipeline] // node
[Pipeline] }
Failed in branch linux-jdk7-m3.5.x_build
[INFO] Restricted to JDK 1.7 yet org.eclipse.jetty:jetty-util:jar:9.4.12.v20180830:compile
contains org/eclipse/jetty/util/Uptime.class targeted to JDK 1.8
[INFO] Restricted to JDK 1.7 yet org.eclipse.jetty:jetty-http:jar:9.4.12.v20180830:compile
contains org/eclipse/jetty/http/HttpStatus$Code.class targeted to JDK 1.8
[INFO] Restricted to JDK 1.7 yet org.eclipse.jetty:jetty-proxy:jar:9.4.12.v20180830:test contains
org/eclipse/jetty/proxy/AfterContentTransformer.class targeted to JDK 1.8
[INFO] Restricted to JDK 1.7 yet org.eclipse.jetty:jetty-security:jar:9.4.12.v20180830:compile
contains org/eclipse/jetty/security/RoleRunAsToken.class targeted to JDK 1.8
[INFO] Restricted to JDK 1.7 yet org.eclipse.jetty:jetty-client:jar:9.4.12.v20180830:test
contains org/eclipse/jetty/client/RoundRobinConnectionPool$Entry.class targeted to JDK 1.8
[INFO] Restricted to JDK 1.7 yet org.eclipse.jetty:jetty-servlet:jar:9.4.12.v20180830:compile
contains org/eclipse/jetty/servlet/ServletHandler.class targeted to JDK 1.8
[INFO] Restricted to JDK 1.7 yet org.eclipse.jetty:jetty-webapp:jar:9.4.12.v20180830:compile
contains org/eclipse/jetty/webapp/WebInfConfiguration$WebAppPathNameMatcher.class targeted
to JDK 1.8
[INFO] Restricted to JDK 1.7 yet org.eclipse.jetty:jetty-server:jar:9.4.12.v20180830:compile
contains org/eclipse/jetty/server/HttpInput$1.class targeted to JDK 1.8
[INFO] Restricted to JDK 1.7 yet org.eclipse.jetty:jetty-xml:jar:9.4.12.v20180830:compile
contains org/eclipse/jetty/xml/XmlParser$Node.class targeted to JDK 1.8
[INFO] Restricted to JDK 1.7 yet org.eclipse.jetty:jetty-io:jar:9.4.12.v20180830:compile contains
org/eclipse/jetty/io/ManagedSelector$Accept.class targeted to JDK 1.8
[WARNING] Rule 0: org.apache.maven.plugins.enforcer.EnforceBytecodeVersion failed with message:
Found Banned Dependency: org.eclipse.jetty:jetty-util:jar:9.4.12.v20180830
Found Banned Dependency: org.eclipse.jetty:jetty-http:jar:9.4.12.v20180830
Found Banned Dependency: org.eclipse.jetty:jetty-proxy:jar:9.4.12.v20180830
Found Banned Dependency: org.eclipse.jetty:jetty-security:jar:9.4.12.v20180830
Found Banned Dependency: org.eclipse.jetty:jetty-client:jar:9.4.12.v20180830
Found Banned Dependency: org.eclipse.jetty:jetty-servlet:jar:9.4.12.v20180830
Found Banned Dependency: org.eclipse.jetty:jetty-webapp:jar:9.4.12.v20180830
Found Banned Dependency: org.eclipse.jetty:jetty-server:jar:9.4.12.v20180830
Found Banned Dependency: org.eclipse.jetty:jetty-xml:jar:9.4.12.v20180830
Found Banned Dependency: org.eclipse.jetty:jetty-io:jar:9.4.12.v20180830
Use 'mvn dependency:tree' to locate the source of the banned dependencies.
[INFO] ------------------------------------------------------------------------
[INFO] BUILD FAILURE
[INFO] ------------------------------------------------------------------------
[INFO] Total time:  4.236 s
[INFO] Finished at: 2019-07-07T06:22:31-07:00
[INFO] ------------------------------------------------------------------------
[INFO] [jenkins-event-spy] Generated F:\jenkins\jenkins-slave\workspace\maven-box_maven-site-plugin_J7@3@tmp\withMaven96f54ff0\maven-spy-20190707-062227-478362781724855548440.log
[ERROR] Failed to execute goal org.apache.maven.plugins:maven-enforcer-plugin:1.4.1:enforce
(enforce-bytecode-version) on project maven-site-plugin: Some Enforcer rules have failed.
Look above for specific messages explaining why the rule failed. -> [Help 1]
org.apache.maven.lifecycle.LifecycleExecutionException: Failed to execute goal org.apache.maven.plugins:maven-enforcer-plugin:1.4.1:enforce
(enforce-bytecode-version) on project maven-site-plugin: Some Enforcer rules have failed.
Look above for specific messages explaining why the rule failed.
    at org.apache.maven.lifecycle.internal.MojoExecutor.execute (MojoExecutor.java:215)
    at org.apache.maven.lifecycle.internal.MojoExecutor.execute (MojoExecutor.java:156)
    at org.apache.maven.lifecycle.internal.MojoExecutor.execute (MojoExecutor.java:148)
    at org.apache.maven.lifecycle.internal.LifecycleModuleBuilder.buildProject (LifecycleModuleBuilder.java:117)
    at org.apache.maven.lifecycle.internal.LifecycleModuleBuilder.buildProject (LifecycleModuleBuilder.java:81)
    at org.apache.maven.lifecycle.internal.builder.singlethreaded.SingleThreadedBuilder.build
(SingleThreadedBuilder.java:56)
    at org.apache.maven.lifecycle.internal.LifecycleStarter.execute (LifecycleStarter.java:128)
    at org.apache.maven.DefaultMaven.doExecute (DefaultMaven.java:305)
    at org.apache.maven.DefaultMaven.doExecute (DefaultMaven.java:192)
    at org.apache.maven.DefaultMaven.execute (DefaultMaven.java:105)
    at org.apache.maven.cli.MavenCli.execute (MavenCli.java:956)
    at org.apache.maven.cli.MavenCli.doMain (MavenCli.java:288)
    at org.apache.maven.cli.MavenCli.main (MavenCli.java:192)
    at jdk.internal.reflect.NativeMethodAccessorImpl.invoke0 (Native Method)
    at jdk.internal.reflect.NativeMethodAccessorImpl.invoke (NativeMethodAccessorImpl.java:62)
    at jdk.internal.reflect.DelegatingMethodAccessorImpl.invoke (DelegatingMethodAccessorImpl.java:43)
    at java.lang.reflect.Method.invoke (Method.java:567)
    at org.codehaus.plexus.classworlds.launcher.Launcher.launchEnhanced (Launcher.java:289)
    at org.codehaus.plexus.classworlds.launcher.Launcher.launch (Launcher.java:229)
    at org.codehaus.plexus.classworlds.launcher.Launcher.mainWithExitCode (Launcher.java:415)
    at org.codehaus.plexus.classworlds.launcher.Launcher.main (Launcher.java:356)
Caused by: org.apache.maven.plugin.MojoExecutionException: Some Enforcer rules have failed.
Look above for specific messages explaining why the rule failed.
    at org.apache.maven.plugins.enforcer.EnforceMojo.execute (EnforceMojo.java:237)
    at org.apache.maven.plugin.DefaultBuildPluginManager.executeMojo (DefaultBuildPluginManager.java:137)
    at org.apache.maven.lifecycle.internal.MojoExecutor.execute (MojoExecutor.java:210)
    at org.apache.maven.lifecycle.internal.MojoExecutor.execute (MojoExecutor.java:156)
    at org.apache.maven.lifecycle.internal.MojoExecutor.execute (MojoExecutor.java:148)
    at org.apache.maven.lifecycle.internal.LifecycleModuleBuilder.buildProject (LifecycleModuleBuilder.java:117)
    at org.apache.maven.lifecycle.internal.LifecycleModuleBuilder.buildProject (LifecycleModuleBuilder.java:81)
    at org.apache.maven.lifecycle.internal.builder.singlethreaded.SingleThreadedBuilder.build
(SingleThreadedBuilder.java:56)
    at org.apache.maven.lifecycle.internal.LifecycleStarter.execute (LifecycleStarter.java:128)
    at org.apache.maven.DefaultMaven.doExecute (DefaultMaven.java:305)
    at org.apache.maven.DefaultMaven.doExecute (DefaultMaven.java:192)
    at org.apache.maven.DefaultMaven.execute (DefaultMaven.java:105)
    at org.apache.maven.cli.MavenCli.execute (MavenCli.java:956)
    at org.apache.maven.cli.MavenCli.doMain (MavenCli.java:288)
    at org.apache.maven.cli.MavenCli.main (MavenCli.java:192)
    at jdk.internal.reflect.NativeMethodAccessorImpl.invoke0 (Native Method)
    at jdk.internal.reflect.NativeMethodAccessorImpl.invoke (NativeMethodAccessorImpl.java:62)
    at jdk.internal.reflect.DelegatingMethodAccessorImpl.invoke (DelegatingMethodAccessorImpl.java:43)
    at java.lang.reflect.Method.invoke (Method.java:567)
    at org.codehaus.plexus.classworlds.launcher.Launcher.launchEnhanced (Launcher.java:289)
    at org.codehaus.plexus.classworlds.launcher.Launcher.launch (Launcher.java:229)
    at org.codehaus.plexus.classworlds.launcher.Launcher.mainWithExitCode (Launcher.java:415)
    at org.codehaus.plexus.classworlds.launcher.Launcher.main (Launcher.java:356)
[ERROR] 
[ERROR] Re-run Maven using the -X switch to enable full debug logging.
[ERROR] 
[ERROR] For more information about the errors and possible solutions, please read the following
articles:
[ERROR] [Help 1] http://cwiki.apache.org/confluence/display/MAVEN/MojoExecutionException
[Pipeline] }
[Pipeline] // dir
[Pipeline] }
[Fast Archiver] No prior successful build to compare, so performing full copy of artifacts
[withMaven] openTasksPublisher - Scan Tasks for Maven artifact org.apache.maven.plugins:maven-site-plugin:maven-plugin:3.8.2-SNAPSHOT
in source directory windows-jdk12-m3.6.x_build\src\main\java
[TASKS] Scanning folder 'f:\jenkins\jenkins-slave\workspace\maven-box_maven-site-plugin_J7@3'
for files matching the pattern 'windows-jdk12-m3.6.x_build\src\main\java\**\*' - excludes:
null
[TASKS] Found 21 files to scan for tasks
[TASKS] Found 8 open tasks.
Skipping warnings blame since pipelines do not have an SCM link.%n
[withMaven] Publishers: Generated Artifacts Publisher: 7 ms, Open Task Scanner Publisher:
201 ms
[Pipeline] // withMaven
[Pipeline] cleanWs
[WS-CLEANUP] Deleting project workspace...
[WS-CLEANUP] Deferred wipeout is used...
[WS-CLEANUP] done
[Pipeline] cleanWs
[WS-CLEANUP] Deleting project workspace...
[WS-CLEANUP] Deferred wipeout is used...
[WS-CLEANUP] done
[Pipeline] }
[Pipeline] // stage
[Pipeline] }
[Pipeline] // ws
[Pipeline] }
[Pipeline] // node
[Pipeline] }
Failed in branch windows-jdk12-m3.6.x_build
[Pipeline] // parallel
[Pipeline] stage
[Pipeline] { (Notifications)
[Pipeline] echo
Build result: FAILURE
[Pipeline] jiraIssueSelector
[Pipeline] emailext
Mime
  • Unnamed multipart/mixed (inline, None, 0 bytes)
View raw message