maven-notifications mailing list archives

Site index · List index
Message view « Date » · « Thread »
Top « Date » · « Thread »
From Apache Jenkins Server <jenk...@builds.apache.org>
Subject Build failed in Jenkins: Maven TLP » maven » maven-resolver-1.4.0 #6
Date Mon, 01 Jul 2019 19:54:35 GMT
See https://builds.apache.org/job/maven-box/job/maven/job/maven-resolver-1.4.0/6/

No changes.

All tests passed

Build log:
[...truncated 58217 lines...]
mng3422ActiveComponentCollection(itMNG3422).................OK (0.4 s)
mng3415JunkRepositoryMetadata(ShouldNotRepeatedlyUpdateOnResourceNotFoundException)OK (0.9
s)
mng3415JunkRepositoryMetadata(itTransferFailed).............OK (0.8 s)
mng3401CLIDefaultExecId(itWithoutPluginManagement)..........OK (0.3 s)
[withMaven] junitPublisher - Archive test results for Maven artifact org.apache.maven.its.plugins:maven-it-plugin-active-collection:maven-plugin:2.1-SNAPSHOT
generated by maven-surefire-plugin:test (default-test): core-it-support\core-it-plugins\maven-it-plugin-active-collection\target\surefire-reports\*.xml
[withMaven] junitPublisher - Archive test results for Maven artifact org.apache.maven.its.plugins:maven-it-plugin-ant-based:maven-plugin:2.1-SNAPSHOT
generated by maven-surefire-plugin:test (default-test): core-it-support\core-it-plugins\maven-it-plugin-ant-based\target\surefire-reports\*.xml
[withMaven] junitPublisher - Archive test results for Maven artifact org.apache.maven.its.plugins:maven-it-plugin-artifact:maven-plugin:2.1-SNAPSHOT
generated by maven-surefire-plugin:test (default-test): core-it-support\core-it-plugins\maven-it-plugin-artifact\target\surefire-reports\*.xml
[withMaven] junitPublisher - Archive test results for Maven artifact org.apache.maven.its.plugins.class-loader:dep-a:jar:2.1-SNAPSHOT
generated by maven-surefire-plugin:test (default-test): core-it-support\core-it-plugins\maven-it-plugin-class-loader\dep-a\target\surefire-reports\*.xml
[withMaven] junitPublisher - Archive test results for Maven artifact org.apache.maven.its.plugins.class-loader:dep-b:jar:2.1-SNAPSHOT
generated by maven-surefire-plugin:test (default-test): core-it-support\core-it-plugins\maven-it-plugin-class-loader\dep-b\target\surefire-reports\*.xml
[withMaven] junitPublisher - Archive test results for Maven artifact org.apache.maven.its.plugins.class-loader:dep-c:jar:2.1-SNAPSHOT
generated by maven-surefire-plugin:test (default-test): core-it-support\core-it-plugins\maven-it-plugin-class-loader\dep-c\target\surefire-reports\*.xml
[withMaven] junitPublisher - Archive test results for Maven artifact org.apache.maven.its.plugins:maven-it-plugin-class-loader:maven-plugin:2.1-SNAPSHOT
generated by maven-surefire-plugin:test (default-test): core-it-support\core-it-plugins\maven-it-plugin-class-loader\maven-it-plugin-class-loader\target\surefire-reports\*.xml
[withMaven] junitPublisher - Archive test results for Maven artifact org.apache.maven.its.plugins:maven-it-plugin-configuration:maven-plugin:2.1-SNAPSHOT
generated by maven-surefire-plugin:test (default-test): core-it-support\core-it-plugins\maven-it-plugin-configuration\target\surefire-reports\*.xml
[withMaven] junitPublisher - Archive test results for Maven artifact org.apache.maven.its.plugins:maven-it-plugin-context-passing:maven-plugin:2.1-SNAPSHOT
generated by maven-surefire-plugin:test (default-test): core-it-support\core-it-plugins\maven-it-plugin-context-passing\target\surefire-reports\*.xml
[withMaven] junitPublisher - Archive test results for Maven artifact org.apache.maven.plugins:maven-clean-plugin:maven-plugin:0.1-stub-SNAPSHOT
generated by maven-surefire-plugin:test (default-test): core-it-support\core-it-plugins\maven-it-plugin-core-stubs\maven-clean-plugin\target\surefire-reports\*.xml
[withMaven] junitPublisher - Archive test results for Maven artifact org.apache.maven.plugins:maven-compiler-plugin:maven-plugin:0.1-stub-SNAPSHOT
generated by maven-surefire-plugin:test (default-test): core-it-support\core-it-plugins\maven-it-plugin-core-stubs\maven-compiler-plugin\target\surefire-reports\*.xml
[withMaven] junitPublisher - Archive test results for Maven artifact org.apache.maven.plugins:maven-deploy-plugin:maven-plugin:0.1-stub-SNAPSHOT
generated by maven-surefire-plugin:test (default-test): core-it-support\core-it-plugins\maven-it-plugin-core-stubs\maven-deploy-plugin\target\surefire-reports\*.xml
[withMaven] junitPublisher - Archive test results for Maven artifact org.apache.maven.plugins:maven-ear-plugin:maven-plugin:0.1-stub-SNAPSHOT
generated by maven-surefire-plugin:test (default-test): core-it-support\core-it-plugins\maven-it-plugin-core-stubs\maven-ear-plugin\target\surefire-reports\*.xml
[withMaven] junitPublisher - Archive test results for Maven artifact org.apache.maven.plugins:maven-ejb-plugin:maven-plugin:0.1-stub-SNAPSHOT
generated by maven-surefire-plugin:test (default-test): core-it-support\core-it-plugins\maven-it-plugin-core-stubs\maven-ejb-plugin\target\surefire-reports\*.xml
[withMaven] junitPublisher - Archive test results for Maven artifact org.apache.maven.plugins:maven-install-plugin:maven-plugin:0.1-stub-SNAPSHOT
generated by maven-surefire-plugin:test (default-test): core-it-support\core-it-plugins\maven-it-plugin-core-stubs\maven-install-plugin\target\surefire-reports\*.xml
[withMaven] junitPublisher - Archive test results for Maven artifact org.apache.maven.plugins:maven-jar-plugin:maven-plugin:0.1-stub-SNAPSHOT
generated by maven-surefire-plugin:test (default-test): core-it-support\core-it-plugins\maven-it-plugin-core-stubs\maven-jar-plugin\target\surefire-reports\*.xml
[withMaven] junitPublisher - Archive test results for Maven artifact org.apache.maven.plugins:maven-javadoc-plugin:maven-plugin:0.1-stub-SNAPSHOT
generated by maven-surefire-plugin:test (default-test): core-it-support\core-it-plugins\maven-it-plugin-core-stubs\maven-javadoc-plugin\target\surefire-reports\*.xml
[withMaven] junitPublisher - Archive test results for Maven artifact org.apache.maven.plugins:maven-plugin-plugin:maven-plugin:0.1-stub-SNAPSHOT
generated by maven-surefire-plugin:test (default-test): core-it-support\core-it-plugins\maven-it-plugin-core-stubs\maven-plugin-plugin\target\surefire-reports\*.xml
[withMaven] junitPublisher - Archive test results for Maven artifact org.apache.maven.plugins:maven-rar-plugin:maven-plugin:0.1-stub-SNAPSHOT
generated by maven-surefire-plugin:test (default-test): core-it-support\core-it-plugins\maven-it-plugin-core-stubs\maven-rar-plugin\target\surefire-reports\*.xml
[withMaven] junitPublisher - Archive test results for Maven artifact org.apache.maven.plugins:maven-resources-plugin:maven-plugin:0.1-stub-SNAPSHOT
generated by maven-surefire-plugin:test (default-test): core-it-support\core-it-plugins\maven-it-plugin-core-stubs\maven-resources-plugin\target\surefire-reports\*.xml
[withMaven] junitPublisher - Archive test results for Maven artifact org.apache.maven.plugins:maven-site-plugin:maven-plugin:0.1-stub-SNAPSHOT
generated by maven-surefire-plugin:test (default-test): core-it-support\core-it-plugins\maven-it-plugin-core-stubs\maven-site-plugin\target\surefire-reports\*.xml
[withMaven] junitPublisher - Archive test results for Maven artifact org.apache.maven.plugins:maven-source-plugin:maven-plugin:0.1-stub-SNAPSHOT
generated by maven-surefire-plugin:test (default-test): core-it-support\core-it-plugins\maven-it-plugin-core-stubs\maven-source-plugin\target\surefire-reports\*.xml
[withMaven] junitPublisher - Archive test results for Maven artifact org.apache.maven.plugins:maven-surefire-plugin:maven-plugin:0.1-stub-SNAPSHOT
generated by maven-surefire-plugin:test (default-test): core-it-support\core-it-plugins\maven-it-plugin-core-stubs\maven-surefire-plugin\target\surefire-reports\*.xml
[withMaven] junitPublisher - Archive test results for Maven artifact org.apache.maven.plugins:maven-war-plugin:maven-plugin:0.1-stub-SNAPSHOT
generated by maven-surefire-plugin:test (default-test): core-it-support\core-it-plugins\maven-it-plugin-core-stubs\maven-war-plugin\target\surefire-reports\*.xml
[withMaven] junitPublisher - Archive test results for Maven artifact org.apache.maven.its.plugins:maven-it-plugin-dependency-collection:maven-plugin:2.1-SNAPSHOT
generated by maven-surefire-plugin:test (default-test): core-it-support\core-it-plugins\maven-it-plugin-dependency-collection\target\surefire-reports\*.xml
[withMaven] junitPublisher - Archive test results for Maven artifact org.apache.maven.its.plugins:maven-it-plugin-dependency-resolution:maven-plugin:2.1-SNAPSHOT
generated by maven-surefire-plugin:test (default-test): core-it-support\core-it-plugins\maven-it-plugin-dependency-resolution\target\surefire-reports\*.xml
[withMaven] junitPublisher - Archive test results for Maven artifact org.apache.maven.its.plugins:maven-it-plugin-expression:maven-plugin:2.1-SNAPSHOT
generated by maven-surefire-plugin:test (default-test): core-it-support\core-it-plugins\maven-it-plugin-expression\target\surefire-reports\*.xml
[withMaven] junitPublisher - Archive test results for Maven artifact org.apache.maven.its.plugins:maven-it-plugin-error:maven-plugin:2.1-SNAPSHOT
generated by maven-surefire-plugin:test (default-test): core-it-support\core-it-plugins\maven-it-plugin-error\target\surefire-reports\*.xml
[withMaven] junitPublisher - Archive test results for Maven artifact org.apache.maven.its:core-it-component:jar:2.1-SNAPSHOT
generated by maven-surefire-plugin:test (default-test): core-it-support\core-it-component\target\surefire-reports\*.xml
[withMaven] junitPublisher - Archive test results for Maven artifact org.apache.maven.its.plugins:maven-it-plugin-extension-consumer:maven-plugin:2.1-SNAPSHOT
generated by maven-surefire-plugin:test (default-test): core-it-support\core-it-plugins\maven-it-plugin-extension-consumer\target\surefire-reports\*.xml
[withMaven] junitPublisher - Archive test results for Maven artifact org.apache.maven.its.plugins:maven-it-plugin-extension-provider:maven-plugin:2.1-SNAPSHOT
generated by maven-surefire-plugin:test (default-test): core-it-support\core-it-plugins\maven-it-plugin-extension-provider\target\surefire-reports\*.xml
[withMaven] junitPublisher - Archive test results for Maven artifact org.apache.maven.its.plugins:maven-it-plugin-fork:maven-plugin:2.1-SNAPSHOT
generated by maven-surefire-plugin:test (default-test): core-it-support\core-it-plugins\maven-it-plugin-fork\target\surefire-reports\*.xml
[withMaven] junitPublisher - Archive test results for Maven artifact org.apache.maven.its.plugins:maven-it-plugin-invalid-descriptor:maven-plugin:2.1-SNAPSHOT
generated by maven-surefire-plugin:test (default-test): core-it-support\core-it-plugins\maven-it-plugin-invalid-descriptor\target\surefire-reports\*.xml
[withMaven] junitPublisher - Archive test results for Maven artifact org.apache.maven.its.plugins:maven-it-plugin-log-file:maven-plugin:2.1-SNAPSHOT
generated by maven-surefire-plugin:test (default-test): core-it-support\core-it-plugins\maven-it-plugin-log-file\target\surefire-reports\*.xml
[withMaven] junitPublisher - Archive test results for Maven artifact org.apache.maven.its:maven-it-helper:jar:2.1-SNAPSHOT
generated by maven-surefire-plugin:test (default-test): core-it-support\maven-it-helper\target\surefire-reports\*.xml
[withMaven] junitPublisher - Archive test results for Maven artifact org.apache.maven.its.plugins:maven-it-plugin-model-interpolation:maven-plugin:2.1-SNAPSHOT
generated by maven-surefire-plugin:test (default-test): core-it-support\core-it-plugins\maven-it-plugin-model-interpolation\target\surefire-reports\*.xml
[withMaven] junitPublisher - Archive test results for Maven artifact org.apache.maven.its.plugins:maven-it-plugin-no-default-comp:maven-plugin:2.1-SNAPSHOT
generated by maven-surefire-plugin:test (default-test): core-it-support\core-it-plugins\maven-it-plugin-no-default-comp\target\surefire-reports\*.xml
[withMaven] junitPublisher - Archive test results for Maven artifact org.apache.maven.its.plugins:maven-it-plugin-no-project:maven-plugin:2.1-SNAPSHOT
generated by maven-surefire-plugin:test (default-test): core-it-support\core-it-plugins\maven-it-plugin-no-project\target\surefire-reports\*.xml
[withMaven] junitPublisher - Archive test results for Maven artifact org.apache.maven.its.plugins:maven-it-plugin-online:maven-plugin:2.1-SNAPSHOT
generated by maven-surefire-plugin:test (default-test): core-it-support\core-it-plugins\maven-it-plugin-online\target\surefire-reports\*.xml
[withMaven] junitPublisher - Archive test results for Maven artifact org.apache.maven.its.plugins:maven-it-plugin-optional-mojos:maven-plugin:2.1-SNAPSHOT
generated by maven-surefire-plugin:test (default-test): core-it-support\core-it-plugins\maven-it-plugin-optional-mojos\target\surefire-reports\*.xml
[withMaven] junitPublisher - Archive test results for Maven artifact org.apache.maven.its.plugins:maven-it-plugin-packaging:maven-plugin:2.1-SNAPSHOT
generated by maven-surefire-plugin:test (default-test): core-it-support\core-it-plugins\maven-it-plugin-packaging\target\surefire-reports\*.xml
[withMaven] junitPublisher - Archive test results for Maven artifact org.apache.maven.its.plugins:maven-it-plugin-parameter-implementation:maven-plugin:2.1-SNAPSHOT
generated by maven-surefire-plugin:test (default-test): core-it-support\core-it-plugins\maven-it-plugin-parameter-implementation\target\surefire-reports\*.xml
[withMaven] junitPublisher - Archive test results for Maven artifact org.apache.maven.its.plugins:maven-it-plugin-plugin-dependency:maven-plugin:2.1-SNAPSHOT
generated by maven-surefire-plugin:test (default-test): core-it-support\core-it-plugins\maven-it-plugin-plugin-dependency\target\surefire-reports\*.xml
[withMaven] junitPublisher - Archive test results for Maven artifact org.apache.maven.its.plugins:maven-it-plugin-project:maven-plugin:2.1-SNAPSHOT
generated by maven-surefire-plugin:test (default-test): core-it-support\core-it-plugins\maven-it-plugin-project\target\surefire-reports\*.xml
[withMaven] junitPublisher - Archive test results for Maven artifact org.apache.maven.its.plugins:maven-it-plugin-project-interpolation:maven-plugin:2.1-SNAPSHOT
generated by maven-surefire-plugin:test (default-test): core-it-support\core-it-plugins\maven-it-plugin-project-interpolation\target\surefire-reports\*.xml
[withMaven] junitPublisher - Archive test results for Maven artifact org.apache.maven.its.plugins:maven-it-plugin-setter:maven-plugin:2.1-SNAPSHOT
generated by maven-surefire-plugin:test (default-test): core-it-support\core-it-plugins\maven-it-plugin-setter\target\surefire-reports\*.xml
[withMaven] junitPublisher - Archive test results for Maven artifact org.apache.maven.its.plugins:maven-it-plugin-singleton-component:maven-plugin:2.1-SNAPSHOT
generated by maven-surefire-plugin:test (default-test): core-it-support\core-it-plugins\maven-it-plugin-singleton-component\target\surefire-reports\*.xml
[withMaven] junitPublisher - Archive test results for Maven artifact org.apache.maven.its.plugins:maven-it-plugin-site:maven-plugin:2.1-SNAPSHOT
generated by maven-surefire-plugin:test (default-test): core-it-support\core-it-plugins\maven-it-plugin-site\target\surefire-reports\*.xml
[withMaven] junitPublisher - Archive test results for Maven artifact org.apache.maven.its.plugins:maven-it-plugin-toolchain:maven-plugin:2.1-SNAPSHOT
generated by maven-surefire-plugin:test (default-test): core-it-support\core-it-plugins\maven-it-plugin-toolchain\target\surefire-reports\*.xml
[withMaven] junitPublisher - Archive test results for Maven artifact org.apache.maven.its.plugins:maven-it-plugin-touch:maven-plugin:2.1-SNAPSHOT
generated by maven-surefire-plugin:test (default-test): core-it-support\core-it-plugins\maven-it-plugin-touch\target\surefire-reports\*.xml
[withMaven] junitPublisher - Archive test results for Maven artifact org.apache.maven.its.plugins:maven-it-plugin-uses-properties:maven-plugin:2.1-SNAPSHOT
generated by maven-surefire-plugin:test (default-test): core-it-support\core-it-plugins\maven-it-plugin-uses-properties\target\surefire-reports\*.xml
[withMaven] junitPublisher - Archive test results for Maven artifact org.apache.maven.its.plugins:maven-it-plugin-uses-wagon:maven-plugin:2.1-SNAPSHOT
generated by maven-surefire-plugin:test (default-test): core-it-support\core-it-plugins\maven-it-plugin-uses-wagon\target\surefire-reports\*.xml
[withMaven] junitPublisher - Archive test results for Maven artifact org.apache.maven.its.plugins:maven-it-plugin-all:maven-plugin:2.1-SNAPSHOT
generated by maven-surefire-plugin:test (default-test): core-it-support\core-it-plugins\maven-it-plugin-all\target\surefire-reports\*.xml
[withMaven] junitPublisher - Archive test results for Maven artifact org.apache.maven.its.plugins:maven-it-plugin-plexus-utils-11:maven-plugin:2.1-SNAPSHOT
generated by maven-surefire-plugin:test (default-test): core-it-support\core-it-plugins\maven-it-plugin-plexus-utils-11\target\surefire-reports\*.xml
[withMaven] junitPublisher - Archive test results for Maven artifact org.apache.maven.its.plugins:maven-it-plugin-plexus-utils-new:maven-plugin:2.1-SNAPSHOT
generated by maven-surefire-plugin:test (default-test): core-it-support\core-it-plugins\maven-it-plugin-plexus-utils-new\target\surefire-reports\*.xml
[withMaven] junitPublisher - Archive test results for Maven artifact org.apache.maven.its.plugins:maven-it-plugin-plexus-component-api:maven-plugin:2.1-SNAPSHOT
generated by maven-surefire-plugin:test (default-test): core-it-support\core-it-plugins\maven-it-plugin-plexus-component-api\target\surefire-reports\*.xml
[withMaven] junitPublisher - Archive test results for Maven artifact org.apache.maven.its.plugins:maven-it-plugin-log4j:maven-plugin:2.1-SNAPSHOT
generated by maven-surefire-plugin:test (default-test): core-it-support\core-it-plugins\maven-it-plugin-log4j\target\surefire-reports\*.xml
[withMaven] junitPublisher - Archive test results for Maven artifact org.apache.maven.its.plugins:maven-it-plugin-extension1:maven-plugin:2.1-SNAPSHOT
generated by maven-surefire-plugin:test (default-test): core-it-support\core-it-plugins\maven-it-plugin-extension1\target\surefire-reports\*.xml
[withMaven] junitPublisher - Archive test results for Maven artifact org.apache.maven.its.plugins:maven-it-plugin-extension2:maven-plugin:2.1-SNAPSHOT
generated by maven-surefire-plugin:test (default-test): core-it-support\core-it-plugins\maven-it-plugin-extension2\target\surefire-reports\*.xml
[withMaven] junitPublisher - Archive test results for Maven artifact org.apache.maven.its.plugins:maven-it-plugin-plexus-lifecycle:maven-plugin:2.1-SNAPSHOT
generated by maven-surefire-plugin:test (default-test): core-it-support\core-it-plugins\maven-it-plugin-plexus-lifecycle\target\surefire-reports\*.xml
[withMaven] junitPublisher - Archive test results for Maven artifact org.apache.maven.its.plugins:maven-it-plugin-settings:maven-plugin:2.1-SNAPSHOT
generated by maven-surefire-plugin:test (default-test): core-it-support\core-it-plugins\maven-it-plugin-settings\target\surefire-reports\*.xml
[withMaven] junitPublisher - Archive test results for Maven artifact org.apache.maven.its.plugins:mng-5805-pkg-type-mojo-configuration-extension:jar:2.1-SNAPSHOT
generated by maven-surefire-plugin:test (default-test): core-it-support\core-it-plugins\mng5805-extension\target\surefire-reports\*.xml
[withMaven] junitPublisher - Archive test results for Maven artifact org.apache.maven.its.plugins:mng-5805-pkg-type-mojo-configuration-extension2:jar:2.1-SNAPSHOT
generated by maven-surefire-plugin:test (default-test): core-it-support\core-it-plugins\mng5805-extension2\target\surefire-reports\*.xml
[withMaven] junitPublisher - Archive test results for Maven artifact org.apache.maven.its.plugins:mng-5805-pkg-type-mojo-configuration-plugin:maven-plugin:2.1-SNAPSHOT
generated by maven-surefire-plugin:test (default-test): core-it-support\core-it-plugins\mng5805-plugin\target\surefire-reports\*.xml
[withMaven] junitPublisher - Archive test results for Maven artifact org.apache.maven.its.plugins:mng-5805-pkg-type-mojo-configuration-plugin-dep:jar:2.1-SNAPSHOT
generated by maven-surefire-plugin:test (default-test): core-it-support\core-it-plugins\mng5805-plugin-dep\target\surefire-reports\*.xml
[withMaven] junitPublisher - Archive test results for Maven artifact org.apache.maven.its.plugins:mng-5958-pkg-type-extension:jar:2.1-SNAPSHOT
generated by maven-surefire-plugin:test (default-test): core-it-support\core-it-plugins\mng5958-extension\target\surefire-reports\*.xml
[withMaven] junitPublisher - Archive test results for Maven artifact org.apache.maven.its:core-it-toolchain:jar:2.1-SNAPSHOT
generated by maven-surefire-plugin:test (default-test): core-it-support\core-it-toolchain\target\surefire-reports\*.xml
[withMaven] junitPublisher - Archive test results for Maven artifact org.apache.maven.its:core-it-wagon:jar:2.1-SNAPSHOT
generated by maven-surefire-plugin:test (default-test): core-it-support\core-it-wagon\target\surefire-reports\*.xml
[withMaven] junitPublisher - Archive test results for Maven artifact org.apache.maven.its:core-it-extension:jar:2.1-SNAPSHOT
generated by maven-surefire-plugin:test (default-test): core-it-support\core-it-extension\target\surefire-reports\*.xml
[withMaven] junitPublisher - Archive test results for Maven artifact org.apache.maven.its:core-it-suite:jar:2.1-SNAPSHOT
generated by maven-surefire-plugin:test (default-test): core-it-suite\target\surefire-reports\*.xml
Recording test results
mng3401CLIDefaultExecId(itWithPluginManagement).............OK (0.4 s)
mng3396DependencyManagementForOverConstrainedRanges(itMNG3396)OK (6.7 s)
mng3394POMPluginVersionDominance(itMNG3394a)................OK (0.3 s)
mng3394POMPluginVersionDominance(itMNG3394b)................OK (0.3 s)
mng3380ManagedRelocatedTransdeps(itMNG3380).................OK (0.6 s)
mng3379ParallelArtifactDownloads(itMNG3379).................OK (0.9 s)
mng3372DirectInvocationOfPlugins(itMNG3372).................OK (2.5 s)
[withMaven] openTasksPublisher - Scan Tasks for Maven artifact org.apache.maven.its.plugins:maven-it-plugin-active-collection:maven-plugin:2.1-SNAPSHOT
in source directory core-it-support\core-it-plugins\maven-it-plugin-active-collection\src\main\java
[withMaven] openTasksPublisher - Scan Tasks for Maven artifact org.apache.maven.its.plugins:maven-it-plugin-artifact:maven-plugin:2.1-SNAPSHOT
in source directory core-it-support\core-it-plugins\maven-it-plugin-artifact\src\main\java
[withMaven] openTasksPublisher - Scan Tasks for Maven artifact org.apache.maven.its.plugins.class-loader:dep-a:jar:2.1-SNAPSHOT
in source directory core-it-support\core-it-plugins\maven-it-plugin-class-loader\dep-a\src\main\java
[withMaven] openTasksPublisher - Scan Tasks for Maven artifact org.apache.maven.its.plugins.class-loader:dep-b:jar:2.1-SNAPSHOT
in source directory core-it-support\core-it-plugins\maven-it-plugin-class-loader\dep-b\src\main\java
[withMaven] openTasksPublisher - Scan Tasks for Maven artifact org.apache.maven.its.plugins:maven-it-plugin-class-loader:maven-plugin:2.1-SNAPSHOT
in source directory core-it-support\core-it-plugins\maven-it-plugin-class-loader\maven-it-plugin-class-loader\src\main\java
[withMaven] openTasksPublisher - Scan Tasks for Maven artifact org.apache.maven.its.plugins:maven-it-plugin-configuration:maven-plugin:2.1-SNAPSHOT
in source directory core-it-support\core-it-plugins\maven-it-plugin-configuration\src\main\java
[withMaven] openTasksPublisher - Scan Tasks for Maven artifact org.apache.maven.its.plugins:maven-it-plugin-context-passing:maven-plugin:2.1-SNAPSHOT
in source directory core-it-support\core-it-plugins\maven-it-plugin-context-passing\src\main\java
[withMaven] openTasksPublisher - Scan Tasks for Maven artifact org.apache.maven.plugins:maven-clean-plugin:maven-plugin:0.1-stub-SNAPSHOT
in source directory core-it-support\core-it-plugins\maven-it-plugin-core-stubs\maven-clean-plugin\src\main\java
[withMaven] openTasksPublisher - Scan Tasks for Maven artifact org.apache.maven.plugins:maven-compiler-plugin:maven-plugin:0.1-stub-SNAPSHOT
in source directory core-it-support\core-it-plugins\maven-it-plugin-core-stubs\maven-compiler-plugin\src\main\java
[withMaven] openTasksPublisher - Scan Tasks for Maven artifact org.apache.maven.plugins:maven-deploy-plugin:maven-plugin:0.1-stub-SNAPSHOT
in source directory core-it-support\core-it-plugins\maven-it-plugin-core-stubs\maven-deploy-plugin\src\main\java
[withMaven] openTasksPublisher - Scan Tasks for Maven artifact org.apache.maven.plugins:maven-ear-plugin:maven-plugin:0.1-stub-SNAPSHOT
in source directory core-it-support\core-it-plugins\maven-it-plugin-core-stubs\maven-ear-plugin\src\main\java
[withMaven] openTasksPublisher - Scan Tasks for Maven artifact org.apache.maven.plugins:maven-ejb-plugin:maven-plugin:0.1-stub-SNAPSHOT
in source directory core-it-support\core-it-plugins\maven-it-plugin-core-stubs\maven-ejb-plugin\src\main\java
[withMaven] openTasksPublisher - Scan Tasks for Maven artifact org.apache.maven.plugins:maven-install-plugin:maven-plugin:0.1-stub-SNAPSHOT
in source directory core-it-support\core-it-plugins\maven-it-plugin-core-stubs\maven-install-plugin\src\main\java
[withMaven] openTasksPublisher - Scan Tasks for Maven artifact org.apache.maven.plugins:maven-jar-plugin:maven-plugin:0.1-stub-SNAPSHOT
in source directory core-it-support\core-it-plugins\maven-it-plugin-core-stubs\maven-jar-plugin\src\main\java
[withMaven] openTasksPublisher - Scan Tasks for Maven artifact org.apache.maven.plugins:maven-javadoc-plugin:maven-plugin:0.1-stub-SNAPSHOT
in source directory core-it-support\core-it-plugins\maven-it-plugin-core-stubs\maven-javadoc-plugin\src\main\java
[withMaven] openTasksPublisher - Scan Tasks for Maven artifact org.apache.maven.plugins:maven-plugin-plugin:maven-plugin:0.1-stub-SNAPSHOT
in source directory core-it-support\core-it-plugins\maven-it-plugin-core-stubs\maven-plugin-plugin\src\main\java
[withMaven] openTasksPublisher - Scan Tasks for Maven artifact org.apache.maven.plugins:maven-rar-plugin:maven-plugin:0.1-stub-SNAPSHOT
in source directory core-it-support\core-it-plugins\maven-it-plugin-core-stubs\maven-rar-plugin\src\main\java
[withMaven] openTasksPublisher - Scan Tasks for Maven artifact org.apache.maven.plugins:maven-resources-plugin:maven-plugin:0.1-stub-SNAPSHOT
in source directory core-it-support\core-it-plugins\maven-it-plugin-core-stubs\maven-resources-plugin\src\main\java
[withMaven] openTasksPublisher - Scan Tasks for Maven artifact org.apache.maven.plugins:maven-site-plugin:maven-plugin:0.1-stub-SNAPSHOT
in source directory core-it-support\core-it-plugins\maven-it-plugin-core-stubs\maven-site-plugin\src\main\java
[withMaven] openTasksPublisher - Scan Tasks for Maven artifact org.apache.maven.plugins:maven-source-plugin:maven-plugin:0.1-stub-SNAPSHOT
in source directory core-it-support\core-it-plugins\maven-it-plugin-core-stubs\maven-source-plugin\src\main\java
[withMaven] openTasksPublisher - Scan Tasks for Maven artifact org.apache.maven.plugins:maven-surefire-plugin:maven-plugin:0.1-stub-SNAPSHOT
in source directory core-it-support\core-it-plugins\maven-it-plugin-core-stubs\maven-surefire-plugin\src\main\java
[withMaven] openTasksPublisher - Scan Tasks for Maven artifact org.apache.maven.plugins:maven-war-plugin:maven-plugin:0.1-stub-SNAPSHOT
in source directory core-it-support\core-it-plugins\maven-it-plugin-core-stubs\maven-war-plugin\src\main\java
[withMaven] openTasksPublisher - Scan Tasks for Maven artifact org.apache.maven.its.plugins:maven-it-plugin-dependency-collection:maven-plugin:2.1-SNAPSHOT
in source directory core-it-support\core-it-plugins\maven-it-plugin-dependency-collection\src\main\java
[withMaven] openTasksPublisher - Scan Tasks for Maven artifact org.apache.maven.its.plugins:maven-it-plugin-dependency-resolution:maven-plugin:2.1-SNAPSHOT
in source directory core-it-support\core-it-plugins\maven-it-plugin-dependency-resolution\src\main\java
[withMaven] openTasksPublisher - Scan Tasks for Maven artifact org.apache.maven.its.plugins:maven-it-plugin-expression:maven-plugin:2.1-SNAPSHOT
in source directory core-it-support\core-it-plugins\maven-it-plugin-expression\src\main\java
[withMaven] openTasksPublisher - Scan Tasks for Maven artifact org.apache.maven.its.plugins:maven-it-plugin-error:maven-plugin:2.1-SNAPSHOT
in source directory core-it-support\core-it-plugins\maven-it-plugin-error\src\main\java
[withMaven] openTasksPublisher - Scan Tasks for Maven artifact org.apache.maven.its:core-it-component:jar:2.1-SNAPSHOT
in source directory core-it-support\core-it-component\src\main\java
[withMaven] openTasksPublisher - Scan Tasks for Maven artifact org.apache.maven.its.plugins:maven-it-plugin-extension-consumer:maven-plugin:2.1-SNAPSHOT
in source directory core-it-support\core-it-plugins\maven-it-plugin-extension-consumer\src\main\java
[withMaven] openTasksPublisher - Scan Tasks for Maven artifact org.apache.maven.its.plugins:maven-it-plugin-extension-provider:maven-plugin:2.1-SNAPSHOT
in source directory core-it-support\core-it-plugins\maven-it-plugin-extension-provider\src\main\java
[withMaven] openTasksPublisher - Scan Tasks for Maven artifact org.apache.maven.its.plugins:maven-it-plugin-fork:maven-plugin:2.1-SNAPSHOT
in source directory core-it-support\core-it-plugins\maven-it-plugin-fork\src\main\java
[withMaven] openTasksPublisher - Scan Tasks for Maven artifact org.apache.maven.its.plugins:maven-it-plugin-invalid-descriptor:maven-plugin:2.1-SNAPSHOT
in source directory core-it-support\core-it-plugins\maven-it-plugin-invalid-descriptor\src\main\java
[withMaven] openTasksPublisher - Scan Tasks for Maven artifact org.apache.maven.its.plugins:maven-it-plugin-log-file:maven-plugin:2.1-SNAPSHOT
in source directory core-it-support\core-it-plugins\maven-it-plugin-log-file\src\main\java
[withMaven] openTasksPublisher - Scan Tasks for Maven artifact org.apache.maven.its:maven-it-helper:jar:2.1-SNAPSHOT
in source directory core-it-support\maven-it-helper\src\main\java
[withMaven] openTasksPublisher - Scan Tasks for Maven artifact org.apache.maven.its.plugins:maven-it-plugin-model-interpolation:maven-plugin:2.1-SNAPSHOT
in source directory core-it-support\core-it-plugins\maven-it-plugin-model-interpolation\src\main\java
[withMaven] openTasksPublisher - Scan Tasks for Maven artifact org.apache.maven.its.plugins:maven-it-plugin-no-default-comp:maven-plugin:2.1-SNAPSHOT
in source directory core-it-support\core-it-plugins\maven-it-plugin-no-default-comp\src\main\java
[withMaven] openTasksPublisher - Scan Tasks for Maven artifact org.apache.maven.its.plugins:maven-it-plugin-no-project:maven-plugin:2.1-SNAPSHOT
in source directory core-it-support\core-it-plugins\maven-it-plugin-no-project\src\main\java
[withMaven] openTasksPublisher - Scan Tasks for Maven artifact org.apache.maven.its.plugins:maven-it-plugin-online:maven-plugin:2.1-SNAPSHOT
in source directory core-it-support\core-it-plugins\maven-it-plugin-online\src\main\java
[withMaven] openTasksPublisher - Scan Tasks for Maven artifact org.apache.maven.its.plugins:maven-it-plugin-optional-mojos:maven-plugin:2.1-SNAPSHOT
in source directory core-it-support\core-it-plugins\maven-it-plugin-optional-mojos\src\main\java
[withMaven] openTasksPublisher - Scan Tasks for Maven artifact org.apache.maven.its.plugins:maven-it-plugin-packaging:maven-plugin:2.1-SNAPSHOT
in source directory core-it-support\core-it-plugins\maven-it-plugin-packaging\src\main\java
[withMaven] openTasksPublisher - Scan Tasks for Maven artifact org.apache.maven.its.plugins:maven-it-plugin-parameter-implementation:maven-plugin:2.1-SNAPSHOT
in source directory core-it-support\core-it-plugins\maven-it-plugin-parameter-implementation\src\main\java
[withMaven] openTasksPublisher - Scan Tasks for Maven artifact org.apache.maven.its.plugins:maven-it-plugin-plugin-dependency:maven-plugin:2.1-SNAPSHOT
in source directory core-it-support\core-it-plugins\maven-it-plugin-plugin-dependency\src\main\java
[withMaven] openTasksPublisher - Scan Tasks for Maven artifact org.apache.maven.its.plugins:maven-it-plugin-project:maven-plugin:2.1-SNAPSHOT
in source directory core-it-support\core-it-plugins\maven-it-plugin-project\src\main\java
[withMaven] openTasksPublisher - Scan Tasks for Maven artifact org.apache.maven.its.plugins:maven-it-plugin-project-interpolation:maven-plugin:2.1-SNAPSHOT
in source directory core-it-support\core-it-plugins\maven-it-plugin-project-interpolation\src\main\java
[withMaven] openTasksPublisher - Scan Tasks for Maven artifact org.apache.maven.its.plugins:maven-it-plugin-setter:maven-plugin:2.1-SNAPSHOT
in source directory core-it-support\core-it-plugins\maven-it-plugin-setter\src\main\java
[withMaven] openTasksPublisher - Scan Tasks for Maven artifact org.apache.maven.its.plugins:maven-it-plugin-singleton-component:maven-plugin:2.1-SNAPSHOT
in source directory core-it-support\core-it-plugins\maven-it-plugin-singleton-component\src\main\java
[withMaven] openTasksPublisher - Scan Tasks for Maven artifact org.apache.maven.its.plugins:maven-it-plugin-site:maven-plugin:2.1-SNAPSHOT
in source directory core-it-support\core-it-plugins\maven-it-plugin-site\src\main\java
[withMaven] openTasksPublisher - Scan Tasks for Maven artifact org.apache.maven.its.plugins:maven-it-plugin-toolchain:maven-plugin:2.1-SNAPSHOT
in source directory core-it-support\core-it-plugins\maven-it-plugin-toolchain\src\main\java
[withMaven] openTasksPublisher - Scan Tasks for Maven artifact org.apache.maven.its.plugins:maven-it-plugin-touch:maven-plugin:2.1-SNAPSHOT
in source directory core-it-support\core-it-plugins\maven-it-plugin-touch\src\main\java
[withMaven] openTasksPublisher - Scan Tasks for Maven artifact org.apache.maven.its.plugins:maven-it-plugin-uses-properties:maven-plugin:2.1-SNAPSHOT
in source directory core-it-support\core-it-plugins\maven-it-plugin-uses-properties\src\main\java
[withMaven] openTasksPublisher - Scan Tasks for Maven artifact org.apache.maven.its.plugins:maven-it-plugin-uses-wagon:maven-plugin:2.1-SNAPSHOT
in source directory core-it-support\core-it-plugins\maven-it-plugin-uses-wagon\src\main\java
[withMaven] openTasksPublisher - Scan Tasks for Maven artifact org.apache.maven.its.plugins:maven-it-plugin-all:maven-plugin:2.1-SNAPSHOT
in source directory core-it-support\core-it-plugins\maven-it-plugin-all\src\main\java
[withMaven] openTasksPublisher - Scan Tasks for Maven artifact org.apache.maven.its.plugins:maven-it-plugin-plexus-utils-11:maven-plugin:2.1-SNAPSHOT
in source directory core-it-support\core-it-plugins\maven-it-plugin-plexus-utils-11\src\main\java
[withMaven] openTasksPublisher - Scan Tasks for Maven artifact org.apache.maven.its.plugins:maven-it-plugin-plexus-utils-new:maven-plugin:2.1-SNAPSHOT
in source directory core-it-support\core-it-plugins\maven-it-plugin-plexus-utils-new\src\main\java
[withMaven] openTasksPublisher - Scan Tasks for Maven artifact org.apache.maven.its.plugins:maven-it-plugin-plexus-component-api:maven-plugin:2.1-SNAPSHOT
in source directory core-it-support\core-it-plugins\maven-it-plugin-plexus-component-api\src\main\java
[withMaven] openTasksPublisher - Scan Tasks for Maven artifact org.apache.maven.its.plugins:maven-it-plugin-log4j:maven-plugin:2.1-SNAPSHOT
in source directory core-it-support\core-it-plugins\maven-it-plugin-log4j\src\main\java
[withMaven] openTasksPublisher - Scan Tasks for Maven artifact org.apache.maven.its.plugins:maven-it-plugin-extension1:maven-plugin:2.1-SNAPSHOT
in source directory core-it-support\core-it-plugins\maven-it-plugin-extension1\src\main\java
[withMaven] openTasksPublisher - Scan Tasks for Maven artifact org.apache.maven.its.plugins:maven-it-plugin-extension2:maven-plugin:2.1-SNAPSHOT
in source directory core-it-support\core-it-plugins\maven-it-plugin-extension2\src\main\java
[withMaven] openTasksPublisher - Scan Tasks for Maven artifact org.apache.maven.its.plugins:maven-it-plugin-plexus-lifecycle:maven-plugin:2.1-SNAPSHOT
in source directory core-it-support\core-it-plugins\maven-it-plugin-plexus-lifecycle\src\main\java
[withMaven] openTasksPublisher - Scan Tasks for Maven artifact org.apache.maven.its.plugins:maven-it-plugin-settings:maven-plugin:2.1-SNAPSHOT
in source directory core-it-support\core-it-plugins\maven-it-plugin-settings\src\main\java
[withMaven] openTasksPublisher - Scan Tasks for Maven artifact org.apache.maven.its.plugins:mng-5805-pkg-type-mojo-configuration-plugin:maven-plugin:2.1-SNAPSHOT
in source directory core-it-support\core-it-plugins\mng5805-plugin\src\main\java
[withMaven] openTasksPublisher - Scan Tasks for Maven artifact org.apache.maven.its.plugins:mng-5805-pkg-type-mojo-configuration-plugin-dep:jar:2.1-SNAPSHOT
in source directory core-it-support\core-it-plugins\mng5805-plugin-dep\src\main\java
[withMaven] openTasksPublisher - Scan Tasks for Maven artifact org.apache.maven.its.plugins:mng-5958-pkg-type-extension:jar:2.1-SNAPSHOT
in source directory core-it-support\core-it-plugins\mng5958-extension\src\main\java
[withMaven] openTasksPublisher - Scan Tasks for Maven artifact org.apache.maven.its:core-it-toolchain:jar:2.1-SNAPSHOT
in source directory core-it-support\core-it-toolchain\src\main\java
[withMaven] openTasksPublisher - Scan Tasks for Maven artifact org.apache.maven.its:core-it-wagon:jar:2.1-SNAPSHOT
in source directory core-it-support\core-it-wagon\src\main\java
[TASKS] Scanning folder 'c:\mvn-it-0.tmp' for files matching the pattern 'core-it-support\core-it-plugins\maven-it-plugin-active-collection\src\main\java\**\*,core-it-support\core-it-plugins\maven-it-plugin-artifact\src\main\java\**\*,core-it-support\core-it-plugins\maven-it-plugin-class-loader\dep-a\src\main\java\**\*,core-it-support\core-it-plugins\maven-it-plugin-class-loader\dep-b\src\main\java\**\*,core-it-support\core-it-plugins\maven-it-plugin-class-loader\maven-it-plugin-class-loader\src\main\java\**\*,core-it-support\core-it-plugins\maven-it-plugin-configuration\src\main\java\**\*,core-it-support\core-it-plugins\maven-it-plugin-context-passing\src\main\java\**\*,core-it-support\core-it-plugins\maven-it-plugin-core-stubs\maven-clean-plugin\src\main\java\**\*,core-it-support\core-it-plugins\maven-it-plugin-core-stubs\maven-compiler-plugin\src\main\java\**\*,core-it-support\core-it-plugins\maven-it-plugin-core-stubs\maven-deploy-plugin\src\main\java\**\*,core-it-support\core-it-plugins\maven-it-plugin-core-stubs\maven-ear-plugin\src\main\java\**\*,core-it-support\core-it-plugins\maven-it-plugin-core-stubs\maven-ejb-plugin\src\main\java\**\*,core-it-support\core-it-plugins\maven-it-plugin-core-stubs\maven-install-plugin\src\main\java\**\*,core-it-support\core-it-plugins\maven-it-plugin-core-stubs\maven-jar-plugin\src\main\java\**\*,core-it-support\core-it-plugins\maven-it-plugin-core-stubs\maven-javadoc-plugin\src\main\java\**\*,core-it-support\core-it-plugins\maven-it-plugin-core-stubs\maven-plugin-plugin\src\main\java\**\*,core-it-support\core-it-plugins\maven-it-plugin-core-stubs\maven-rar-plugin\src\main\java\**\*,core-it-support\core-it-plugins\maven-it-plugin-core-stubs\maven-resources-plugin\src\main\java\**\*,core-it-support\core-it-plugins\maven-it-plugin-core-stubs\maven-site-plugin\src\main\java\**\*,core-it-support\core-it-plugins\maven-it-plugin-core-stubs\maven-source-plugin\src\main\java\**\*,core-it-support\core-it-plugins\maven-it-plugin-core-stubs\maven-surefire-plugin\src\main\java\**\*,core-it-support\core-it-plugins\maven-it-plugin-core-stubs\maven-war-plugin\src\main\java\**\*,core-it-support\core-it-plugins\maven-it-plugin-dependency-collection\src\main\java\**\*,core-it-support\core-it-plugins\maven-it-plugin-dependency-resolution\src\main\java\**\*,core-it-support\core-it-plugins\maven-it-plugin-expression\src\main\java\**\*,core-it-support\core-it-plugins\maven-it-plugin-error\src\main\java\**\*,core-it-support\core-it-component\src\main\java\**\*,core-it-support\core-it-plugins\maven-it-plugin-extension-consumer\src\main\java\**\*,core-it-support\core-it-plugins\maven-it-plugin-extension-provider\src\main\java\**\*,core-it-support\core-it-plugins\maven-it-plugin-fork\src\main\java\**\*,core-it-support\core-it-plugins\maven-it-plugin-invalid-descriptor\src\main\java\**\*,core-it-support\core-it-plugins\maven-it-plugin-log-file\src\main\java\**\*,core-it-support\maven-it-helper\src\main\java\**\*,core-it-support\core-it-plugins\maven-it-plugin-model-interpolation\src\main\java\**\*,core-it-support\core-it-plugins\maven-it-plugin-no-default-comp\src\main\java\**\*,core-it-support\core-it-plugins\maven-it-plugin-no-project\src\main\java\**\*,core-it-support\core-it-plugins\maven-it-plugin-online\src\main\java\**\*,core-it-support\core-it-plugins\maven-it-plugin-optional-mojos\src\main\java\**\*,core-it-support\core-it-plugins\maven-it-plugin-packaging\src\main\java\**\*,core-it-support\core-it-plugins\maven-it-plugin-parameter-implementation\src\main\java\**\*,core-it-support\core-it-plugins\maven-it-plugin-plugin-dependency\src\main\java\**\*,core-it-support\core-it-plugins\maven-it-plugin-project\src\main\java\**\*,core-it-support\core-it-plugins\maven-it-plugin-project-interpolation\src\main\java\**\*,core-it-support\core-it-plugins\maven-it-plugin-setter\src\main\java\**\*,core-it-support\core-it-plugins\maven-it-plugin-singleton-component\src\main\java\**\*,core-it-support\core-it-plugins\maven-it-plugin-site\src\main\java\**\*,core-it-support\core-it-plugins\maven-it-plugin-toolchain\src\main\java\**\*,core-it-support\core-it-plugins\maven-it-plugin-touch\src\main\java\**\*,core-it-support\core-it-plugins\maven-it-plugin-uses-properties\src\main\java\**\*,core-it-support\core-it-plugins\maven-it-plugin-uses-wagon\src\main\java\**\*,core-it-support\core-it-plugins\maven-it-plugin-all\src\main\java\**\*,core-it-support\core-it-plugins\maven-it-plugin-plexus-utils-11\src\main\java\**\*,core-it-support\core-it-plugins\maven-it-plugin-plexus-utils-new\src\main\java\**\*,core-it-support\core-it-plugins\maven-it-plugin-plexus-component-api\src\main\java\**\*,core-it-support\core-it-plugins\maven-it-plugin-log4j\src\main\java\**\*,core-it-support\core-it-plugins\maven-it-plugin-extension1\src\main\java\**\*,core-it-support\core-it-plugins\maven-it-plugin-extension2\src\main\java\**\*,core-it-support\core-it-plugins\maven-it-plugin-plexus-lifecycle\src\main\java\**\*,core-it-support\core-it-plugins\maven-it-plugin-settings\src\main\java\**\*,core-it-support\core-it-plugins\mng5805-plugin\src\main\java\**\*,core-it-support\core-it-plugins\mng5805-plugin-dep\src\main\java\**\*,core-it-support\core-it-plugins\mng5958-extension\src\main\java\**\*,core-it-support\core-it-toolchain\src\main\java\**\*,core-it-support\core-it-wagon\src\main\java\**\*'
- excludes: null
[TASKS] Found 164 files to scan for tasks
[TASKS] Found 0 open tasks.
Skipping warnings blame since pipelines do not have an SCM link.%n
[TASKS] Computing warning deltas based on reference build #4
[withMaven] Publishers: Pipeline Graph Publisher: 21 ms, Generated Artifacts Publisher: 8613
ms, Invoker Publisher: 6 ms, Junit Publisher: 30315 ms, Concordion Publisher: 7 ms, Dependencies
Fingerprint Publisher: 250 ms, Findbugs Publisher: 4 ms, JGiven Publisher: 3 ms, Jacoco Publisher:
4 ms, SpotBugs Publisher: 3 ms, Open Task Scanner Publisher: 1321 ms
[Pipeline] // withMaven
[Pipeline] deleteDir
[Pipeline] }
[Pipeline] // dir
[Pipeline] }
[Pipeline] // stage
[Pipeline] }
[Pipeline] // node
[Pipeline] }
Aborted by michaelo
mng3372DirectInvocationOfPlugins(DependencyTreeInvocation)..Sending interrupt signal to process
Sending interrupt signal to process
Aborted by michaelo
Sending interrupt signal to process
Sending interrupt signal to process
[INFO] 
[INFO] Results:
[INFO] 
[INFO] Tests run: 0, Failures: 0, Errors: 0, Skipped: 0
[INFO] 
[ERROR] There are test failures.

Please refer to C:\mvn-it-1.tmp\core-it-suite\target\surefire-reports for the individual test
results.
Please refer to dump files (if any exist) [date]-jvmRun[N].dump, [date].dumpstream and [date]-jvmRun[N].dumpstream.
The forked VM terminated without properly saying goodbye. VM crash or System.exit called?
Command was cmd.exe /X /C "f:\jenkins\tools\java\latest1.7\jre\bin\java -Xmx384m -XX:MaxPermSize=192m
-Dcom.sun.management.jmxremote=true org.apache.maven.surefire.booter.ForkedBooter C:\Users\jenkins\AppData\Local\Temp\2\surefire3281199957740701738
2019-06-22T07-59-21_889-jvmRun1 surefire4754228151103879983tmp surefire_32895688389659611130tmp"
Error occurred in starting fork, check output in log
Process Exit Code: 130
Crashed tests:
org.apache.maven.it.MavenITmng3372DirectInvocationOfPluginsTest
org.apache.maven.surefire.booter.SurefireBooterForkException: The forked VM terminated without
properly saying goodbye. VM crash or System.exit called?
Command was cmd.exe /X /C "f:\jenkins\tools\java\latest1.7\jre\bin\java -Xmx384m -XX:MaxPermSize=192m
-Dcom.sun.management.jmxremote=true org.apache.maven.surefire.booter.ForkedBooter C:\Users\jenkins\AppData\Local\Temp\2\surefire3281199957740701738
2019-06-22T07-59-21_889-jvmRun1 surefire4754228151103879983tmp surefire_32895688389659611130tmp"
Error occurred in starting fork, check output in log
Process Exit Code: 130
Crashed tests:
org.apache.maven.it.MavenITmng3372DirectInvocationOfPluginsTest
	at org.apache.maven.plugin.surefire.booterclient.ForkStarter.fork(ForkStarter.java:671)
	at org.apache.maven.plugin.surefire.booterclient.ForkStarter.fork(ForkStarter.java:533)
	at org.apache.maven.plugin.surefire.booterclient.ForkStarter.run(ForkStarter.java:278)
	at org.apache.maven.plugin.surefire.booterclient.ForkStarter.run(ForkStarter.java:244)
	at org.apache.maven.plugin.surefire.AbstractSurefireMojo.executeProvider(AbstractSurefireMojo.java:1194)
	at org.apache.maven.plugin.surefire.AbstractSurefireMojo.executeAfterPreconditionsChecked(AbstractSurefireMojo.java:1022)
	at org.apache.maven.plugin.surefire.AbstractSurefireMojo.execute(AbstractSurefireMojo.java:868)
	at org.apache.maven.plugin.DefaultBuildPluginManager.executeMojo(DefaultBuildPluginManager.java:137)
	at org.apache.maven.lifecycle.internal.MojoExecutor.execute(MojoExecutor.java:210)
	at org.apache.maven.lifecycle.internal.MojoExecutor.execute(MojoExecutor.java:156)
	at org.apache.maven.lifecycle.internal.MojoExecutor.execute(MojoExecutor.java:148)
	at org.apache.maven.lifecycle.internal.LifecycleModuleBuilder.buildProject(LifecycleModuleBuilder.java:117)
	at org.apache.maven.lifecycle.internal.LifecycleModuleBuilder.buildProject(LifecycleModuleBuilder.java:81)
	at org.apache.maven.lifecycle.internal.builder.singlethreaded.SingleThreadedBuilder.build(SingleThreadedBuilder.java:56)
	at org.apache.maven.lifecycle.internal.LifecycleStarter.execute(LifecycleStarter.java:128)
	at org.apache.maven.DefaultMaven.doExecute(DefaultMaven.java:305)
	at org.apache.maven.DefaultMaven.doExecute(DefaultMaven.java:192)
	at org.apache.maven.DefaultMaven.execute(DefaultMaven.java:105)
	at org.apache.maven.cli.MavenCli.execute(MavenCli.java:956)
	at org.apache.maven.cli.MavenCli.doMain(MavenCli.java:288)
	at org.apache.maven.cli.MavenCli.main(MavenCli.java:192)
	at sun.reflect.NativeMethodAccessorImpl.invoke0(Native Method)
	at sun.reflect.NativeMethodAccessorImpl.invoke(NativeMethodAccessorImpl.java:57)
	at sun.reflect.DelegatingMethodAccessorImpl.invoke(DelegatingMethodAccessorImpl.java:43)
	at java.lang.reflect.Method.invoke(Method.java:606)
	at org.codehaus.plexus.classworlds.launcher.Launcher.launchEnhanced(Launcher.java:289)
	at org.codehaus.plexus.classworlds.launcher.Launcher.launch(Launcher.java:229)
	at org.codehaus.plexus.classworlds.launcher.Launcher.mainWithExitCode(Launcher.java:415)
	at org.codehaus.plexus.classworlds.launcher.Launcher.main(Launcher.java:356)

[INFO] 
[INFO] --- maven-jar-plugin:3.0.2:jar (default-jar) @ core-it-suite ---
[INFO] Building jar: C:\mvn-it-1.tmp\core-it-suite\target\core-it-suite-2.1-SNAPSHOT.jar
[INFO] 
[INFO] --- maven-site-plugin:3.7:attach-descriptor (attach-descriptor) @ core-it-suite ---
[INFO] Skipping because packaging 'jar' is not pom.
[INFO] 
[INFO] --- maven-jar-plugin:3.0.2:test-jar (default) @ core-it-suite ---
Picked up JAVA_TOOL_OPTIONS: -Dmaven.ext.class.path="c:\mvn-it-1.tmp@tmp\withMaven93204c94\pipeline-maven-spy.jar"
-Dorg.jenkinsci.plugins.pipeline.maven.reportsFolder="c:\mvn-it-1.tmp@tmp\withMaven93204c94"

Terminate batch job (Y/N)? 
script returned exit code 1
[Pipeline] }
[withMaven] One or multiple Maven executions have been ignored by the Jenkins Pipeline Maven
Plugin because they have been interrupted before completion (1). See Pipeline Maven Plugin
FAQ for more details.
[Pipeline] // withMaven
[Pipeline] }
[Pipeline] // dir
[Pipeline] }
[Pipeline] // stage
[Pipeline] }
[Pipeline] // node
[Pipeline] }
Failed in branch windows-jdk7
[Pipeline] // parallel
[Pipeline] echo
[FAILURE-002] FlowInterruptedException org.jenkinsci.plugins.workflow.steps.FlowInterruptedException
[Pipeline] stage
[Pipeline] { (Notifications)
[Pipeline] echo
Build result: FAILURE
[Pipeline] jiraIssueSelector
[Pipeline] emailext
Mime
  • Unnamed multipart/mixed (inline, None, 0 bytes)
View raw message