maven-notifications mailing list archives

Site index · List index
Message view « Date » · « Thread »
Top « Date » · « Thread »
From Apache Jenkins Server <jenk...@builds.apache.org>
Subject Build unstable in Jenkins: Maven TLP » maven » jenkins-buld-error-wip #2
Date Fri, 12 Jul 2019 21:23:36 GMT
See https://builds.apache.org/job/maven-box/job/maven/job/jenkins-buld-error-wip/2/

No changes.

4 tests failed.
FAILED:  org.apache.maven.it.MavenITmng0553SettingsAuthzEncryptionTest.linux-jdk12 / Run ITs Linux Java 12 / testitEncryption

Error Message:
Exit code was non-zero: 1; command line and log = 
/home/jenkins/jenkins-slave/workspace/box_maven_jenkins-buld-error-wip/test/core-it-suite/target/apache-maven/bin/mvn --global-settings /home/jenkins/jenkins-slave/workspace/box_maven_jenkins-buld-error-wip/test/core-it-suite/target/test-classes/settings.xml --encrypt-password testpass -e --batch-mode -Dmaven.repo.local=/home/jenkins/jenkins-slave/workspace/box_maven_jenkins-buld-error-wip/test/it-local-repo -e
Picked up JAVA_TOOL_OPTIONS: -Dmaven.ext.class.path="/home/jenkins/jenkins-slave/workspace/box_maven_jenkins-buld-error-wip/test@tmp/withMaven2ba9eba3/pipeline-maven-spy.jar" -Dorg.jenkinsci.plugins.pipeline.maven.reportsFolder="/home/jenkins/jenkins-slave/workspace/box_maven_jenkins-buld-error-wip/test@tmp/withMaven2ba9eba3" 
OpenJDK 64-Bit Server VM warning: Ignoring option MaxPermSize; support was removed in 8.0
[INFO] [jenkins-event-spy] Jenkins Maven Event Spy is disabled
[INFO] Error stacktraces are turned on.
[ERROR] Error executing Maven.
org.sonatype.plexus.components.sec.dispatcher.SecDispatcherException: java.io.FileNotFoundException: /home/jenkins/.m2/settings-security.xml (No such file or directory)
    at org.sonatype.plexus.components.sec.dispatcher.SecUtil.read (SecUtil.java:69)
    at org.apache.maven.cli.MavenCli.encryption (MavenCli.java:920)
    at org.apache.maven.cli.MavenCli.doMain (MavenCli.java:286)
    at org.apache.maven.cli.MavenCli.main (MavenCli.java:192)
    at jdk.internal.reflect.NativeMethodAccessorImpl.invoke0 (Native Method)
    at jdk.internal.reflect.NativeMethodAccessorImpl.invoke (NativeMethodAccessorImpl.java:62)
    at jdk.internal.reflect.DelegatingMethodAccessorImpl.invoke (DelegatingMethodAccessorImpl.java:43)
    at java.lang.reflect.Method.invoke (Method.java:567)
    at org.codehaus.plexus.classworlds.launcher.Launcher.launchEnhanced (Launcher.java:282)
    at org.codehaus.plexus.classworlds.launcher.Launcher.launch (Launcher.java:225)
    at org.codehaus.plexus.classworlds.launcher.Launcher.mainWithExitCode (Launcher.java:406)
    at org.codehaus.plexus.classworlds.launcher.Launcher.main (Launcher.java:347)
Caused by: java.io.FileNotFoundException: /home/jenkins/.m2/settings-security.xml (No such file or directory)
    at java.io.FileInputStream.open0 (Native Method)
    at java.io.FileInputStream.open (FileInputStream.java:213)
    at java.io.FileInputStream.<init> (FileInputStream.java:155)
    at org.sonatype.plexus.components.sec.dispatcher.SecUtil.toStream (SecUtil.java:100)
    at org.sonatype.plexus.components.sec.dispatcher.SecUtil.read (SecUtil.java:56)
    at org.apache.maven.cli.MavenCli.encryption (MavenCli.java:920)
    at org.apache.maven.cli.MavenCli.doMain (MavenCli.java:286)
    at org.apache.maven.cli.MavenCli.main (MavenCli.java:192)
    at jdk.internal.reflect.NativeMethodAccessorImpl.invoke0 (Native Method)
    at jdk.internal.reflect.NativeMethodAccessorImpl.invoke (NativeMethodAccessorImpl.java:62)
    at jdk.internal.reflect.DelegatingMethodAccessorImpl.invoke (DelegatingMethodAccessorImpl.java:43)
    at java.lang.reflect.Method.invoke (Method.java:567)
    at org.codehaus.plexus.classworlds.launcher.Launcher.launchEnhanced (Launcher.java:282)
    at org.codehaus.plexus.classworlds.launcher.Launcher.launch (Launcher.java:225)
    at org.codehaus.plexus.classworlds.launcher.Launcher.mainWithExitCode (Launcher.java:406)
    at org.codehaus.plexus.classworlds.launcher.Launcher.main (Launcher.java:347)


Stack Trace:
org.apache.maven.it.VerificationException: 
Exit code was non-zero: 1; command line and log = 
/home/jenkins/jenkins-slave/workspace/box_maven_jenkins-buld-error-wip/test/core-it-suite/target/apache-maven/bin/mvn --global-settings /home/jenkins/jenkins-slave/workspace/box_maven_jenkins-buld-error-wip/test/core-it-suite/target/test-classes/settings.xml --encrypt-password testpass -e --batch-mode -Dmaven.repo.local=/home/jenkins/jenkins-slave/workspace/box_maven_jenkins-buld-error-wip/test/it-local-repo -e
Picked up JAVA_TOOL_OPTIONS: -Dmaven.ext.class.path="/home/jenkins/jenkins-slave/workspace/box_maven_jenkins-buld-error-wip/test@tmp/withMaven2ba9eba3/pipeline-maven-spy.jar" -Dorg.jenkinsci.plugins.pipeline.maven.reportsFolder="/home/jenkins/jenkins-slave/workspace/box_maven_jenkins-buld-error-wip/test@tmp/withMaven2ba9eba3" 
OpenJDK 64-Bit Server VM warning: Ignoring option MaxPermSize; support was removed in 8.0
[INFO] [jenkins-event-spy] Jenkins Maven Event Spy is disabled
[INFO] Error stacktraces are turned on.
[ERROR] Error executing Maven.
org.sonatype.plexus.components.sec.dispatcher.SecDispatcherException: java.io.FileNotFoundException: /home/jenkins/.m2/settings-security.xml (No such file or directory)
    at org.sonatype.plexus.components.sec.dispatcher.SecUtil.read (SecUtil.java:69)
    at org.apache.maven.cli.MavenCli.encryption (MavenCli.java:920)
    at org.apache.maven.cli.MavenCli.doMain (MavenCli.java:286)
    at org.apache.maven.cli.MavenCli.main (MavenCli.java:192)
    at jdk.internal.reflect.NativeMethodAccessorImpl.invoke0 (Native Method)
    at jdk.internal.reflect.NativeMethodAccessorImpl.invoke (NativeMethodAccessorImpl.java:62)
    at jdk.internal.reflect.DelegatingMethodAccessorImpl.invoke (DelegatingMethodAccessorImpl.java:43)
    at java.lang.reflect.Method.invoke (Method.java:567)
    at org.codehaus.plexus.classworlds.launcher.Launcher.launchEnhanced (Launcher.java:282)
    at org.codehaus.plexus.classworlds.launcher.Launcher.launch (Launcher.java:225)
    at org.codehaus.plexus.classworlds.launcher.Launcher.mainWithExitCode (Launcher.java:406)
    at org.codehaus.plexus.classworlds.launcher.Launcher.main (Launcher.java:347)
Caused by: java.io.FileNotFoundException: /home/jenkins/.m2/settings-security.xml (No such file or directory)
    at java.io.FileInputStream.open0 (Native Method)
    at java.io.FileInputStream.open (FileInputStream.java:213)
    at java.io.FileInputStream.<init> (FileInputStream.java:155)
    at org.sonatype.plexus.components.sec.dispatcher.SecUtil.toStream (SecUtil.java:100)
    at org.sonatype.plexus.components.sec.dispatcher.SecUtil.read (SecUtil.java:56)
    at org.apache.maven.cli.MavenCli.encryption (MavenCli.java:920)
    at org.apache.maven.cli.MavenCli.doMain (MavenCli.java:286)
    at org.apache.maven.cli.MavenCli.main (MavenCli.java:192)
    at jdk.internal.reflect.NativeMethodAccessorImpl.invoke0 (Native Method)
    at jdk.internal.reflect.NativeMethodAccessorImpl.invoke (NativeMethodAccessorImpl.java:62)
    at jdk.internal.reflect.DelegatingMethodAccessorImpl.invoke (DelegatingMethodAccessorImpl.java:43)
    at java.lang.reflect.Method.invoke (Method.java:567)
    at org.codehaus.plexus.classworlds.launcher.Launcher.launchEnhanced (Launcher.java:282)
    at org.codehaus.plexus.classworlds.launcher.Launcher.launch (Launcher.java:225)
    at org.codehaus.plexus.classworlds.launcher.Launcher.mainWithExitCode (Launcher.java:406)
    at org.codehaus.plexus.classworlds.launcher.Launcher.main (Launcher.java:347)

	at org.apache.maven.it.MavenITmng0553SettingsAuthzEncryptionTest.testitEncryption(MavenITmng0553SettingsAuthzEncryptionTest.java:201)


FAILED:  org.apache.maven.it.MavenITmng0553SettingsAuthzEncryptionTest.linux-jdk12 / Run ITs Linux Java 12 / testitBasic

Error Message:
Exit code was non-zero: 1; command line and log = 
/home/jenkins/jenkins-slave/workspace/box_maven_jenkins-buld-error-wip/test/core-it-suite/target/apache-maven/bin/mvn --global-settings /home/jenkins/jenkins-slave/workspace/box_maven_jenkins-buld-error-wip/test/core-it-suite/target/test-classes/settings.xml --settings settings.xml -e --batch-mode -Dmaven.repo.local=/home/jenkins/jenkins-slave/workspace/box_maven_jenkins-buld-error-wip/test/it-local-repo validate
Picked up JAVA_TOOL_OPTIONS: -Dmaven.ext.class.path="/home/jenkins/jenkins-slave/workspace/box_maven_jenkins-buld-error-wip/test@tmp/withMaven2ba9eba3/pipeline-maven-spy.jar" -Dorg.jenkinsci.plugins.pipeline.maven.reportsFolder="/home/jenkins/jenkins-slave/workspace/box_maven_jenkins-buld-error-wip/test@tmp/withMaven2ba9eba3" 
OpenJDK 64-Bit Server VM warning: Ignoring option MaxPermSize; support was removed in 8.0
[INFO] [jenkins-event-spy] Jenkins Maven Event Spy is disabled
[INFO] Error stacktraces are turned on.
[INFO] Scanning for projects...
[INFO] 
[INFO] -----------------< org.apache.maven.its.mng0553:test >------------------
[INFO] Building Maven Integration Test :: MNG-533 1.0-SNAPSHOT
[INFO] --------------------------------[ jar ]---------------------------------
[INFO] Downloading from test: http://localhost:45740/org/apache/maven/its/mng0553/a/0.1-SNAPSHOT/maven-metadata.xml
[WARNING] Could not transfer metadata org.apache.maven.its.mng0553:a:0.1-SNAPSHOT/maven-metadata.xml from/to test (http://localhost:45740/): Not authorized
[WARNING] Failure to transfer org.apache.maven.its.mng0553:a:0.1-SNAPSHOT/maven-metadata.xml from http://localhost:45740/ was cached in the local repository, resolution will not be reattempted until the update interval of test has elapsed or updates are forced. Original error: Could not transfer metadata org.apache.maven.its.mng0553:a:0.1-SNAPSHOT/maven-metadata.xml from/to test (http://localhost:45740/): Not authorized
[INFO] Downloading from test: http://localhost:45740/org/apache/maven/its/mng0553/a/0.1-SNAPSHOT/a-0.1-SNAPSHOT.pom
[INFO] ------------------------------------------------------------------------
[INFO] BUILD FAILURE
[INFO] ------------------------------------------------------------------------
[INFO] Total time:  0.675 s
[INFO] Finished at: 2019-07-12T21:02:44Z
[INFO] ------------------------------------------------------------------------
[ERROR] Failed to execute goal on project test: Could not resolve dependencies for project org.apache.maven.its.mng0553:test:jar:1.0-SNAPSHOT: Failed to collect dependencies at org.apache.maven.its.mng0553:a:jar:0.1-SNAPSHOT: Failed to read artifact descriptor for org.apache.maven.its.mng0553:a:jar:0.1-SNAPSHOT: Could not transfer artifact org.apache.maven.its.mng0553:a:pom:0.1-SNAPSHOT from/to test (http://localhost:45740/): Not authorized -> [Help 1]
org.apache.maven.lifecycle.LifecycleExecutionException: Failed to execute goal on project test: Could not resolve dependencies for project org.apache.maven.its.mng0553:test:jar:1.0-SNAPSHOT: Failed to collect dependencies at org.apache.maven.its.mng0553:a:jar:0.1-SNAPSHOT
    at org.apache.maven.lifecycle.internal.LifecycleDependencyResolver.getDependencies (LifecycleDependencyResolver.java:269)
    at org.apache.maven.lifecycle.internal.LifecycleDependencyResolver.resolveProjectDependencies (LifecycleDependencyResolver.java:147)
    at org.apache.maven.lifecycle.internal.MojoExecutor.ensureDependenciesAreResolved (MojoExecutor.java:248)
    at org.apache.maven.lifecycle.internal.MojoExecutor.execute (MojoExecutor.java:202)
    at org.apache.maven.lifecycle.internal.MojoExecutor.execute (MojoExecutor.java:156)
    at org.apache.maven.lifecycle.internal.MojoExecutor.execute (MojoExecutor.java:148)
    at org.apache.maven.lifecycle.internal.LifecycleModuleBuilder.buildProject (LifecycleModuleBuilder.java:117)
    at org.apache.maven.lifecycle.internal.LifecycleModuleBuilder.buildProject (LifecycleModuleBuilder.java:81)
    at org.apache.maven.lifecycle.internal.builder.singlethreaded.SingleThreadedBuilder.build (SingleThreadedBuilder.java:56)
    at org.apache.maven.lifecycle.internal.LifecycleStarter.execute (LifecycleStarter.java:128)
    at org.apache.maven.DefaultMaven.doExecute (DefaultMaven.java:305)
    at org.apache.maven.DefaultMaven.doExecute (DefaultMaven.java:192)
    at org.apache.maven.DefaultMaven.execute (DefaultMaven.java:105)
    at org.apache.maven.cli.MavenCli.execute (MavenCli.java:956)
    at org.apache.maven.cli.MavenCli.doMain (MavenCli.java:288)
    at org.apache.maven.cli.MavenCli.main (MavenCli.java:192)
    at jdk.internal.reflect.NativeMethodAccessorImpl.invoke0 (Native Method)
    at jdk.internal.reflect.NativeMethodAccessorImpl.invoke (NativeMethodAccessorImpl.java:62)
    at jdk.internal.reflect.DelegatingMethodAccessorImpl.invoke (DelegatingMethodAccessorImpl.java:43)
    at java.lang.reflect.Method.invoke (Method.java:567)
    at org.codehaus.plexus.classworlds.launcher.Launcher.launchEnhanced (Launcher.java:282)
    at org.codehaus.plexus.classworlds.launcher.Launcher.launch (Launcher.java:225)
    at org.codehaus.plexus.classworlds.launcher.Launcher.mainWithExitCode (Launcher.java:406)
    at org.codehaus.plexus.classworlds.launcher.Launcher.main (Launcher.java:347)
Caused by: org.apache.maven.project.DependencyResolutionException: Could not resolve dependencies for project org.apache.maven.its.mng0553:test:jar:1.0-SNAPSHOT: Failed to collect dependencies at org.apache.maven.its.mng0553:a:jar:0.1-SNAPSHOT
    at org.apache.maven.project.DefaultProjectDependenciesResolver.resolve (DefaultProjectDependenciesResolver.java:178)
    at org.apache.maven.lifecycle.internal.LifecycleDependencyResolver.getDependencies (LifecycleDependencyResolver.java:243)
    at org.apache.maven.lifecycle.internal.LifecycleDependencyResolver.resolveProjectDependencies (LifecycleDependencyResolver.java:147)
    at org.apache.maven.lifecycle.internal.MojoExecutor.ensureDependenciesAreResolved (MojoExecutor.java:248)
    at org.apache.maven.lifecycle.internal.MojoExecutor.execute (MojoExecutor.java:202)
    at org.apache.maven.lifecycle.internal.MojoExecutor.execute (MojoExecutor.java:156)
    at org.apache.maven.lifecycle.internal.MojoExecutor.execute (MojoExecutor.java:148)
    at org.apache.maven.lifecycle.internal.LifecycleModuleBuilder.buildProject (LifecycleModuleBuilder.java:117)
    at org.apache.maven.lifecycle.internal.LifecycleModuleBuilder.buildProject (LifecycleModuleBuilder.java:81)
    at org.apache.maven.lifecycle.internal.builder.singlethreaded.SingleThreadedBuilder.build (SingleThreadedBuilder.java:56)
    at org.apache.maven.lifecycle.internal.LifecycleStarter.execute (LifecycleStarter.java:128)
    at org.apache.maven.DefaultMaven.doExecute (DefaultMaven.java:305)
    at org.apache.maven.DefaultMaven.doExecute (DefaultMaven.java:192)
    at org.apache.maven.DefaultMaven.execute (DefaultMaven.java:105)
    at org.apache.maven.cli.MavenCli.execute (MavenCli.java:956)
    at org.apache.maven.cli.MavenCli.doMain (MavenCli.java:288)
    at org.apache.maven.cli.MavenCli.main (MavenCli.java:192)
    at jdk.internal.reflect.NativeMethodAccessorImpl.invoke0 (Native Method)
    at jdk.internal.reflect.NativeMethodAccessorImpl.invoke (NativeMethodAccessorImpl.java:62)
    at jdk.internal.reflect.DelegatingMethodAccessorImpl.invoke (DelegatingMethodAccessorImpl.java:43)
    at java.lang.reflect.Method.invoke (Method.java:567)
    at org.codehaus.plexus.classworlds.launcher.Launcher.launchEnhanced (Launcher.java:282)
    at org.codehaus.plexus.classworlds.launcher.Launcher.launch (Launcher.java:225)
    at org.codehaus.plexus.classworlds.launcher.Launcher.mainWithExitCode (Launcher.java:406)
    at org.codehaus.plexus.classworlds.launcher.Launcher.main (Launcher.java:347)
Caused by: org.eclipse.aether.collection.DependencyCollectionException: Failed to collect dependencies at org.apache.maven.its.mng0553:a:jar:0.1-SNAPSHOT
    at org.eclipse.aether.internal.impl.collect.DefaultDependencyCollector.collectDependencies (DefaultDependencyCollector.java:284)
    at org.eclipse.aether.internal.impl.DefaultRepositorySystem.collectDependencies (DefaultRepositorySystem.java:279)
    at org.apache.maven.project.DefaultProjectDependenciesResolver.resolve (DefaultProjectDependenciesResolver.java:169)
    at org.apache.maven.lifecycle.internal.LifecycleDependencyResolver.getDependencies (LifecycleDependencyResolver.java:243)
    at org.apache.maven.lifecycle.internal.LifecycleDependencyResolver.resolveProjectDependencies (LifecycleDependencyResolver.java:147)
    at org.apache.maven.lifecycle.internal.MojoExecutor.ensureDependenciesAreResolved (MojoExecutor.java:248)
    at org.apache.maven.lifecycle.internal.MojoExecutor.execute (MojoExecutor.java:202)
    at org.apache.maven.lifecycle.internal.MojoExecutor.execute (MojoExecutor.java:156)
    at org.apache.maven.lifecycle.internal.MojoExecutor.execute (MojoExecutor.java:148)
    at org.apache.maven.lifecycle.internal.LifecycleModuleBuilder.buildProject (LifecycleModuleBuilder.java:117)
    at org.apache.maven.lifecycle.internal.LifecycleModuleBuilder.buildProject (LifecycleModuleBuilder.java:81)
    at org.apache.maven.lifecycle.internal.builder.singlethreaded.SingleThreadedBuilder.build (SingleThreadedBuilder.java:56)
    at org.apache.maven.lifecycle.internal.LifecycleStarter.execute (LifecycleStarter.java:128)
    at org.apache.maven.DefaultMaven.doExecute (DefaultMaven.java:305)
    at org.apache.maven.DefaultMaven.doExecute (DefaultMaven.java:192)
    at org.apache.maven.DefaultMaven.execute (DefaultMaven.java:105)
    at org.apache.maven.cli.MavenCli.execute (MavenCli.java:956)
    at org.apache.maven.cli.MavenCli.doMain (MavenCli.java:288)
    at org.apache.maven.cli.MavenCli.main (MavenCli.java:192)
    at jdk.internal.reflect.NativeMethodAccessorImpl.invoke0 (Native Method)
    at jdk.internal.reflect.NativeMethodAccessorImpl.invoke (NativeMethodAccessorImpl.java:62)
    at jdk.internal.reflect.DelegatingMethodAccessorImpl.invoke (DelegatingMethodAccessorImpl.java:43)
    at java.lang.reflect.Method.invoke (Method.java:567)
    at org.codehaus.plexus.classworlds.launcher.Launcher.launchEnhanced (Launcher.java:282)
    at org.codehaus.plexus.classworlds.launcher.Launcher.launch (Launcher.java:225)
    at org.codehaus.plexus.classworlds.launcher.Launcher.mainWithExitCode (Launcher.java:406)
    at org.codehaus.plexus.classworlds.launcher.Launcher.main (Launcher.java:347)
Caused by: org.eclipse.aether.resolution.ArtifactDescriptorException: Failed to read artifact descriptor for org.apache.maven.its.mng0553:a:jar:0.1-SNAPSHOT
    at org.apache.maven.repository.internal.DefaultArtifactDescriptorReader.loadPom (DefaultArtifactDescriptorReader.java:255)
    at org.apache.maven.repository.internal.DefaultArtifactDescriptorReader.readArtifactDescriptor (DefaultArtifactDescriptorReader.java:171)
    at org.eclipse.aether.internal.impl.collect.DefaultDependencyCollector.resolveCachedArtifactDescriptor (DefaultDependencyCollector.java:530)
    at org.eclipse.aether.internal.impl.collect.DefaultDependencyCollector.getArtifactDescriptorResult (DefaultDependencyCollector.java:515)
    at org.eclipse.aether.internal.impl.collect.DefaultDependencyCollector.processDependency (DefaultDependencyCollector.java:403)
    at org.eclipse.aether.internal.impl.collect.DefaultDependencyCollector.processDependency (DefaultDependencyCollector.java:356)
    at org.eclipse.aether.internal.impl.collect.DefaultDependencyCollector.process (DefaultDependencyCollector.java:344)
    at org.eclipse.aether.internal.impl.collect.DefaultDependencyCollector.collectDependencies (DefaultDependencyCollector.java:247)
    at org.eclipse.aether.internal.impl.DefaultRepositorySystem.collectDependencies (DefaultRepositorySystem.java:279)
    at org.apache.maven.project.DefaultProjectDependenciesResolver.resolve (DefaultProjectDependenciesResolver.java:169)
    at org.apache.maven.lifecycle.internal.LifecycleDependencyResolver.getDependencies (LifecycleDependencyResolver.java:243)
    at org.apache.maven.lifecycle.internal.LifecycleDependencyResolver.resolveProjectDependencies (LifecycleDependencyResolver.java:147)
    at org.apache.maven.lifecycle.internal.MojoExecutor.ensureDependenciesAreResolved (MojoExecutor.java:248)
    at org.apache.maven.lifecycle.internal.MojoExecutor.execute (MojoExecutor.java:202)
    at org.apache.maven.lifecycle.internal.MojoExecutor.execute (MojoExecutor.java:156)
    at org.apache.maven.lifecycle.internal.MojoExecutor.execute (MojoExecutor.java:148)
    at org.apache.maven.lifecycle.internal.LifecycleModuleBuilder.buildProject (LifecycleModuleBuilder.java:117)
    at org.apache.maven.lifecycle.internal.LifecycleModuleBuilder.buildProject (LifecycleModuleBuilder.java:81)
    at org.apache.maven.lifecycle.internal.builder.singlethreaded.SingleThreadedBuilder.build (SingleThreadedBuilder.java:56)
    at org.apache.maven.lifecycle.internal.LifecycleStarter.execute (LifecycleStarter.java:128)
    at org.apache.maven.DefaultMaven.doExecute (DefaultMaven.java:305)
    at org.apache.maven.DefaultMaven.doExecute (DefaultMaven.java:192)
    at org.apache.maven.DefaultMaven.execute (DefaultMaven.java:105)
    at org.apache.maven.cli.MavenCli.execute (MavenCli.java:956)
    at org.apache.maven.cli.MavenCli.doMain (MavenCli.java:288)
    at org.apache.maven.cli.MavenCli.main (MavenCli.java:192)
    at jdk.internal.reflect.NativeMethodAccessorImpl.invoke0 (Native Method)
    at jdk.internal.reflect.NativeMethodAccessorImpl.invoke (NativeMethodAccessorImpl.java:62)
    at jdk.internal.reflect.DelegatingMethodAccessorImpl.invoke (DelegatingMethodAccessorImpl.java:43)
    at java.lang.reflect.Method.invoke (Method.java:567)
    at org.codehaus.plexus.classworlds.launcher.Launcher.launchEnhanced (Launcher.java:282)
    at org.codehaus.plexus.classworlds.launcher.Launcher.launch (Launcher.java:225)
    at org.codehaus.plexus.classworlds.launcher.Launcher.mainWithExitCode (Launcher.java:406)
    at org.codehaus.plexus.classworlds.launcher.Launcher.main (Launcher.java:347)
Caused by: org.eclipse.aether.resolution.ArtifactResolutionException: Could not transfer artifact org.apache.maven.its.mng0553:a:pom:0.1-SNAPSHOT from/to test (http://localhost:45740/): Not authorized
    at org.eclipse.aether.internal.impl.DefaultArtifactResolver.resolve (DefaultArtifactResolver.java:423)
    at org.eclipse.aether.internal.impl.DefaultArtifactResolver.resolveArtifacts (DefaultArtifactResolver.java:225)
    at org.eclipse.aether.internal.impl.DefaultArtifactResolver.resolveArtifact (DefaultArtifactResolver.java:202)
    at org.apache.maven.repository.internal.DefaultArtifactDescriptorReader.loadPom (DefaultArtifactDescriptorReader.java:240)
    at org.apache.maven.repository.internal.DefaultArtifactDescriptorReader.readArtifactDescriptor (DefaultArtifactDescriptorReader.java:171)
    at org.eclipse.aether.internal.impl.collect.DefaultDependencyCollector.resolveCachedArtifactDescriptor (DefaultDependencyCollector.java:530)
    at org.eclipse.aether.internal.impl.collect.DefaultDependencyCollector.getArtifactDescriptorResult (DefaultDependencyCollector.java:515)
    at org.eclipse.aether.internal.impl.collect.DefaultDependencyCollector.processDependency (DefaultDependencyCollector.java:403)
    at org.eclipse.aether.internal.impl.collect.DefaultDependencyCollector.processDependency (DefaultDependencyCollector.java:356)
    at org.eclipse.aether.internal.impl.collect.DefaultDependencyCollector.process (DefaultDependencyCollector.java:344)
    at org.eclipse.aether.internal.impl.collect.DefaultDependencyCollector.collectDependencies (DefaultDependencyCollector.java:247)
    at org.eclipse.aether.internal.impl.DefaultRepositorySystem.collectDependencies (DefaultRepositorySystem.java:279)
    at org.apache.maven.project.DefaultProjectDependenciesResolver.resolve (DefaultProjectDependenciesResolver.java:169)
    at org.apache.maven.lifecycle.internal.LifecycleDependencyResolver.getDependencies (LifecycleDependencyResolver.java:243)
    at org.apache.maven.lifecycle.internal.LifecycleDependencyResolver.resolveProjectDependencies (LifecycleDependencyResolver.java:147)
    at org.apache.maven.lifecycle.internal.MojoExecutor.ensureDependenciesAreResolved (MojoExecutor.java:248)
    at org.apache.maven.lifecycle.internal.MojoExecutor.execute (MojoExecutor.java:202)
    at org.apache.maven.lifecycle.internal.MojoExecutor.execute (MojoExecutor.java:156)
    at org.apache.maven.lifecycle.internal.MojoExecutor.execute (MojoExecutor.java:148)
    at org.apache.maven.lifecycle.internal.LifecycleModuleBuilder.buildProject (LifecycleModuleBuilder.java:117)
    at org.apache.maven.lifecycle.internal.LifecycleModuleBuilder.buildProject (LifecycleModuleBuilder.java:81)
    at org.apache.maven.lifecycle.internal.builder.singlethreaded.SingleThreadedBuilder.build (SingleThreadedBuilder.java:56)
    at org.apache.maven.lifecycle.internal.LifecycleStarter.execute (LifecycleStarter.java:128)
    at org.apache.maven.DefaultMaven.doExecute (DefaultMaven.java:305)
    at org.apache.maven.DefaultMaven.doExecute (DefaultMaven.java:192)
    at org.apache.maven.DefaultMaven.execute (DefaultMaven.java:105)
    at org.apache.maven.cli.MavenCli.execute (MavenCli.java:956)
    at org.apache.maven.cli.MavenCli.doMain (MavenCli.java:288)
    at org.apache.maven.cli.MavenCli.main (MavenCli.java:192)
    at jdk.internal.reflect.NativeMethodAccessorImpl.invoke0 (Native Method)
    at jdk.internal.reflect.NativeMethodAccessorImpl.invoke (NativeMethodAccessorImpl.java:62)
    at jdk.internal.reflect.DelegatingMethodAccessorImpl.invoke (DelegatingMethodAccessorImpl.java:43)
    at java.lang.reflect.Method.invoke (Method.java:567)
    at org.codehaus.plexus.classworlds.launcher.Launcher.launchEnhanced (Launcher.java:282)
    at org.codehaus.plexus.classworlds.launcher.Launcher.launch (Launcher.java:225)
    at org.codehaus.plexus.classworlds.launcher.Launcher.mainWithExitCode (Launcher.java:406)
    at org.codehaus.plexus.classworlds.launcher.Launcher.main (Launcher.java:347)
Caused by: org.eclipse.aether.transfer.ArtifactTransferException: Could not transfer artifact org.apache.maven.its.mng0553:a:pom:0.1-SNAPSHOT from/to test (http://localhost:45740/): Not authorized
    at org.eclipse.aether.connector.basic.ArtifactTransportListener.transferFailed (ArtifactTransportListener.java:52)
    at org.eclipse.aether.connector.basic.BasicRepositoryConnector$TaskRunner.run (BasicRepositoryConnector.java:368)
    at org.eclipse.aether.util.concurrency.RunnableErrorForwarder$1.run (RunnableErrorForwarder.java:75)
    at org.eclipse.aether.connector.basic.BasicRepositoryConnector$DirectExecutor.execute (BasicRepositoryConnector.java:642)
    at org.eclipse.aether.connector.basic.BasicRepositoryConnector.get (BasicRepositoryConnector.java:262)
    at org.eclipse.aether.internal.impl.DefaultArtifactResolver.performDownloads (DefaultArtifactResolver.java:499)
    at org.eclipse.aether.internal.impl.DefaultArtifactResolver.resolve (DefaultArtifactResolver.java:400)
    at org.eclipse.aether.internal.impl.DefaultArtifactResolver.resolveArtifacts (DefaultArtifactResolver.java:225)
    at org.eclipse.aether.internal.impl.DefaultArtifactResolver.resolveArtifact (DefaultArtifactResolver.java:202)
    at org.apache.maven.repository.internal.DefaultArtifactDescriptorReader.loadPom (DefaultArtifactDescriptorReader.java:240)
    at org.apache.maven.repository.internal.DefaultArtifactDescriptorReader.readArtifactDescriptor (DefaultArtifactDescriptorReader.java:171)
    at org.eclipse.aether.internal.impl.collect.DefaultDependencyCollector.resolveCachedArtifactDescriptor (DefaultDependencyCollector.java:530)
    at org.eclipse.aether.internal.impl.collect.DefaultDependencyCollector.getArtifactDescriptorResult (DefaultDependencyCollector.java:515)
    at org.eclipse.aether.internal.impl.collect.DefaultDependencyCollector.processDependency (DefaultDependencyCollector.java:403)
    at org.eclipse.aether.internal.impl.collect.DefaultDependencyCollector.processDependency (DefaultDependencyCollector.java:356)
    at org.eclipse.aether.internal.impl.collect.DefaultDependencyCollector.process (DefaultDependencyCollector.java:344)
    at org.eclipse.aether.internal.impl.collect.DefaultDependencyCollector.collectDependencies (DefaultDependencyCollector.java:247)
    at org.eclipse.aether.internal.impl.DefaultRepositorySystem.collectDependencies (DefaultRepositorySystem.java:279)
    at org.apache.maven.project.DefaultProjectDependenciesResolver.resolve (DefaultProjectDependenciesResolver.java:169)
    at org.apache.maven.lifecycle.internal.LifecycleDependencyResolver.getDependencies (LifecycleDependencyResolver.java:243)
    at org.apache.maven.lifecycle.internal.LifecycleDependencyResolver.resolveProjectDependencies (LifecycleDependencyResolver.java:147)
    at org.apache.maven.lifecycle.internal.MojoExecutor.ensureDependenciesAreResolved (MojoExecutor.java:248)
    at org.apache.maven.lifecycle.internal.MojoExecutor.execute (MojoExecutor.java:202)
    at org.apache.maven.lifecycle.internal.MojoExecutor.execute (MojoExecutor.java:156)
    at org.apache.maven.lifecycle.internal.MojoExecutor.execute (MojoExecutor.java:148)
    at org.apache.maven.lifecycle.internal.LifecycleModuleBuilder.buildProject (LifecycleModuleBuilder.java:117)
    at org.apache.maven.lifecycle.internal.LifecycleModuleBuilder.buildProject (LifecycleModuleBuilder.java:81)
    at org.apache.maven.lifecycle.internal.builder.singlethreaded.SingleThreadedBuilder.build (SingleThreadedBuilder.java:56)
    at org.apache.maven.lifecycle.internal.LifecycleStarter.execute (LifecycleStarter.java:128)
    at org.apache.maven.DefaultMaven.doExecute (DefaultMaven.java:305)
    at org.apache.maven.DefaultMaven.doExecute (DefaultMaven.java:192)
    at org.apache.maven.DefaultMaven.execute (DefaultMaven.java:105)
    at org.apache.maven.cli.MavenCli.execute (MavenCli.java:956)
    at org.apache.maven.cli.MavenCli.doMain (MavenCli.java:288)
    at org.apache.maven.cli.MavenCli.main (MavenCli.java:192)
    at jdk.internal.reflect.NativeMethodAccessorImpl.invoke0 (Native Method)
    at jdk.internal.reflect.NativeMethodAccessorImpl.invoke (NativeMethodAccessorImpl.java:62)
    at jdk.internal.reflect.DelegatingMethodAccessorImpl.invoke (DelegatingMethodAccessorImpl.java:43)
    at java.lang.reflect.Method.invoke (Method.java:567)
    at org.codehaus.plexus.classworlds.launcher.Launcher.launchEnhanced (Launcher.java:282)
    at org.codehaus.plexus.classworlds.launcher.Launcher.launch (Launcher.java:225)
    at org.codehaus.plexus.classworlds.launcher.Launcher.mainWithExitCode (Launcher.java:406)
    at org.codehaus.plexus.classworlds.launcher.Launcher.main (Launcher.java:347)
Caused by: org.apache.maven.wagon.authorization.AuthorizationException: Not authorized
    at org.apache.maven.wagon.providers.http.wagon.shared.AbstractHttpClientWagon.fillInputData (AbstractHttpClientWagon.java:1145)
    at org.apache.maven.wagon.providers.http.wagon.shared.AbstractHttpClientWagon.fillInputData (AbstractHttpClientWagon.java:1094)
    at org.apache.maven.wagon.StreamWagon.getInputStream (StreamWagon.java:126)
    at org.apache.maven.wagon.StreamWagon.getIfNewer (StreamWagon.java:88)
    at org.apache.maven.wagon.StreamWagon.get (StreamWagon.java:61)
    at org.eclipse.aether.transport.wagon.WagonTransporter$GetTaskRunner.run (WagonTransporter.java:567)
    at org.eclipse.aether.transport.wagon.WagonTransporter.execute (WagonTransporter.java:435)
    at org.eclipse.aether.transport.wagon.WagonTransporter.get (WagonTransporter.java:412)
    at org.eclipse.aether.connector.basic.BasicRepositoryConnector$GetTaskRunner.runTask (BasicRepositoryConnector.java:456)
    at org.eclipse.aether.connector.basic.BasicRepositoryConnector$TaskRunner.run (BasicRepositoryConnector.java:363)
    at org.eclipse.aether.util.concurrency.RunnableErrorForwarder$1.run (RunnableErrorForwarder.java:75)
    at org.eclipse.aether.connector.basic.BasicRepositoryConnector$DirectExecutor.execute (BasicRepositoryConnector.java:642)
    at org.eclipse.aether.connector.basic.BasicRepositoryConnector.get (BasicRepositoryConnector.java:262)
    at org.eclipse.aether.internal.impl.DefaultArtifactResolver.performDownloads (DefaultArtifactResolver.java:499)
    at org.eclipse.aether.internal.impl.DefaultArtifactResolver.resolve (DefaultArtifactResolver.java:400)
    at org.eclipse.aether.internal.impl.DefaultArtifactResolver.resolveArtifacts (DefaultArtifactResolver.java:225)
    at org.eclipse.aether.internal.impl.DefaultArtifactResolver.resolveArtifact (DefaultArtifactResolver.java:202)
    at org.apache.maven.repository.internal.DefaultArtifactDescriptorReader.loadPom (DefaultArtifactDescriptorReader.java:240)
    at org.apache.maven.repository.internal.DefaultArtifactDescriptorReader.readArtifactDescriptor (DefaultArtifactDescriptorReader.java:171)
    at org.eclipse.aether.internal.impl.collect.DefaultDependencyCollector.resolveCachedArtifactDescriptor (DefaultDependencyCollector.java:530)
    at org.eclipse.aether.internal.impl.collect.DefaultDependencyCollector.getArtifactDescriptorResult (DefaultDependencyCollector.java:515)
    at org.eclipse.aether.internal.impl.collect.DefaultDependencyCollector.processDependency (DefaultDependencyCollector.java:403)
    at org.eclipse.aether.internal.impl.collect.DefaultDependencyCollector.processDependency (DefaultDependencyCollector.java:356)
    at org.eclipse.aether.internal.impl.collect.DefaultDependencyCollector.process (DefaultDependencyCollector.java:344)
    at org.eclipse.aether.internal.impl.collect.DefaultDependencyCollector.collectDependencies (DefaultDependencyCollector.java:247)
    at org.eclipse.aether.internal.impl.DefaultRepositorySystem.collectDependencies (DefaultRepositorySystem.java:279)
    at org.apache.maven.project.DefaultProjectDependenciesResolver.resolve (DefaultProjectDependenciesResolver.java:169)
    at org.apache.maven.lifecycle.internal.LifecycleDependencyResolver.getDependencies (LifecycleDependencyResolver.java:243)
    at org.apache.maven.lifecycle.internal.LifecycleDependencyResolver.resolveProjectDependencies (LifecycleDependencyResolver.java:147)
    at org.apache.maven.lifecycle.internal.MojoExecutor.ensureDependenciesAreResolved (MojoExecutor.java:248)
    at org.apache.maven.lifecycle.internal.MojoExecutor.execute (MojoExecutor.java:202)
    at org.apache.maven.lifecycle.internal.MojoExecutor.execute (MojoExecutor.java:156)
    at org.apache.maven.lifecycle.internal.MojoExecutor.execute (MojoExecutor.java:148)
    at org.apache.maven.lifecycle.internal.LifecycleModuleBuilder.buildProject (LifecycleModuleBuilder.java:117)
    at org.apache.maven.lifecycle.internal.LifecycleModuleBuilder.buildProject (LifecycleModuleBuilder.java:81)
    at org.apache.maven.lifecycle.internal.builder.singlethreaded.SingleThreadedBuilder.build (SingleThreadedBuilder.java:56)
    at org.apache.maven.lifecycle.internal.LifecycleStarter.execute (LifecycleStarter.java:128)
    at org.apache.maven.DefaultMaven.doExecute (DefaultMaven.java:305)
    at org.apache.maven.DefaultMaven.doExecute (DefaultMaven.java:192)
    at org.apache.maven.DefaultMaven.execute (DefaultMaven.java:105)
    at org.apache.maven.cli.MavenCli.execute (MavenCli.java:956)
    at org.apache.maven.cli.MavenCli.doMain (MavenCli.java:288)
    at org.apache.maven.cli.MavenCli.main (MavenCli.java:192)
    at jdk.internal.reflect.NativeMethodAccessorImpl.invoke0 (Native Method)
    at jdk.internal.reflect.NativeMethodAccessorImpl.invoke (NativeMethodAccessorImpl.java:62)
    at jdk.internal.reflect.DelegatingMethodAccessorImpl.invoke (DelegatingMethodAccessorImpl.java:43)
    at java.lang.reflect.Method.invoke (Method.java:567)
    at org.codehaus.plexus.classworlds.launcher.Launcher.launchEnhanced (Launcher.java:282)
    at org.codehaus.plexus.classworlds.launcher.Launcher.launch (Launcher.java:225)
    at org.codehaus.plexus.classworlds.launcher.Launcher.mainWithExitCode (Launcher.java:406)
    at org.codehaus.plexus.classworlds.launcher.Launcher.main (Launcher.java:347)
[ERROR] 
[ERROR] Re-run Maven using the -X switch to enable full debug logging.
[ERROR] 
[ERROR] For more information about the errors and possible solutions, please read the following articles:
[ERROR] [Help 1] http://cwiki.apache.org/confluence/display/MAVEN/DependencyResolutionException


Stack Trace:
org.apache.maven.it.VerificationException: 
Exit code was non-zero: 1; command line and log = 
/home/jenkins/jenkins-slave/workspace/box_maven_jenkins-buld-error-wip/test/core-it-suite/target/apache-maven/bin/mvn --global-settings /home/jenkins/jenkins-slave/workspace/box_maven_jenkins-buld-error-wip/test/core-it-suite/target/test-classes/settings.xml --settings settings.xml -e --batch-mode -Dmaven.repo.local=/home/jenkins/jenkins-slave/workspace/box_maven_jenkins-buld-error-wip/test/it-local-repo validate
Picked up JAVA_TOOL_OPTIONS: -Dmaven.ext.class.path="/home/jenkins/jenkins-slave/workspace/box_maven_jenkins-buld-error-wip/test@tmp/withMaven2ba9eba3/pipeline-maven-spy.jar" -Dorg.jenkinsci.plugins.pipeline.maven.reportsFolder="/home/jenkins/jenkins-slave/workspace/box_maven_jenkins-buld-error-wip/test@tmp/withMaven2ba9eba3" 
OpenJDK 64-Bit Server VM warning: Ignoring option MaxPermSize; support was removed in 8.0
[INFO] [jenkins-event-spy] Jenkins Maven Event Spy is disabled
[INFO] Error stacktraces are turned on.
[INFO] Scanning for projects...
[INFO] 
[INFO] -----------------< org.apache.maven.its.mng0553:test >------------------
[INFO] Building Maven Integration Test :: MNG-533 1.0-SNAPSHOT
[INFO] --------------------------------[ jar ]---------------------------------
[INFO] Downloading from test: http://localhost:45740/org/apache/maven/its/mng0553/a/0.1-SNAPSHOT/maven-metadata.xml
[WARNING] Could not transfer metadata org.apache.maven.its.mng0553:a:0.1-SNAPSHOT/maven-metadata.xml from/to test (http://localhost:45740/): Not authorized
[WARNING] Failure to transfer org.apache.maven.its.mng0553:a:0.1-SNAPSHOT/maven-metadata.xml from http://localhost:45740/ was cached in the local repository, resolution will not be reattempted until the update interval of test has elapsed or updates are forced. Original error: Could not transfer metadata org.apache.maven.its.mng0553:a:0.1-SNAPSHOT/maven-metadata.xml from/to test (http://localhost:45740/): Not authorized
[INFO] Downloading from test: http://localhost:45740/org/apache/maven/its/mng0553/a/0.1-SNAPSHOT/a-0.1-SNAPSHOT.pom
[INFO] ------------------------------------------------------------------------
[INFO] BUILD FAILURE
[INFO] ------------------------------------------------------------------------
[INFO] Total time:  0.675 s
[INFO] Finished at: 2019-07-12T21:02:44Z
[INFO] ------------------------------------------------------------------------
[ERROR] Failed to execute goal on project test: Could not resolve dependencies for project org.apache.maven.its.mng0553:test:jar:1.0-SNAPSHOT: Failed to collect dependencies at org.apache.maven.its.mng0553:a:jar:0.1-SNAPSHOT: Failed to read artifact descriptor for org.apache.maven.its.mng0553:a:jar:0.1-SNAPSHOT: Could not transfer artifact org.apache.maven.its.mng0553:a:pom:0.1-SNAPSHOT from/to test (http://localhost:45740/): Not authorized -> [Help 1]
org.apache.maven.lifecycle.LifecycleExecutionException: Failed to execute goal on project test: Could not resolve dependencies for project org.apache.maven.its.mng0553:test:jar:1.0-SNAPSHOT: Failed to collect dependencies at org.apache.maven.its.mng0553:a:jar:0.1-SNAPSHOT
    at org.apache.maven.lifecycle.internal.LifecycleDependencyResolver.getDependencies (LifecycleDependencyResolver.java:269)
    at org.apache.maven.lifecycle.internal.LifecycleDependencyResolver.resolveProjectDependencies (LifecycleDependencyResolver.java:147)
    at org.apache.maven.lifecycle.internal.MojoExecutor.ensureDependenciesAreResolved (MojoExecutor.java:248)
    at org.apache.maven.lifecycle.internal.MojoExecutor.execute (MojoExecutor.java:202)
    at org.apache.maven.lifecycle.internal.MojoExecutor.execute (MojoExecutor.java:156)
    at org.apache.maven.lifecycle.internal.MojoExecutor.execute (MojoExecutor.java:148)
    at org.apache.maven.lifecycle.internal.LifecycleModuleBuilder.buildProject (LifecycleModuleBuilder.java:117)
    at org.apache.maven.lifecycle.internal.LifecycleModuleBuilder.buildProject (LifecycleModuleBuilder.java:81)
    at org.apache.maven.lifecycle.internal.builder.singlethreaded.SingleThreadedBuilder.build (SingleThreadedBuilder.java:56)
    at org.apache.maven.lifecycle.internal.LifecycleStarter.execute (LifecycleStarter.java:128)
    at org.apache.maven.DefaultMaven.doExecute (DefaultMaven.java:305)
    at org.apache.maven.DefaultMaven.doExecute (DefaultMaven.java:192)
    at org.apache.maven.DefaultMaven.execute (DefaultMaven.java:105)
    at org.apache.maven.cli.MavenCli.execute (MavenCli.java:956)
    at org.apache.maven.cli.MavenCli.doMain (MavenCli.java:288)
    at org.apache.maven.cli.MavenCli.main (MavenCli.java:192)
    at jdk.internal.reflect.NativeMethodAccessorImpl.invoke0 (Native Method)
    at jdk.internal.reflect.NativeMethodAccessorImpl.invoke (NativeMethodAccessorImpl.java:62)
    at jdk.internal.reflect.DelegatingMethodAccessorImpl.invoke (DelegatingMethodAccessorImpl.java:43)
    at java.lang.reflect.Method.invoke (Method.java:567)
    at org.codehaus.plexus.classworlds.launcher.Launcher.launchEnhanced (Launcher.java:282)
    at org.codehaus.plexus.classworlds.launcher.Launcher.launch (Launcher.java:225)
    at org.codehaus.plexus.classworlds.launcher.Launcher.mainWithExitCode (Launcher.java:406)
    at org.codehaus.plexus.classworlds.launcher.Launcher.main (Launcher.java:347)
Caused by: org.apache.maven.project.DependencyResolutionException: Could not resolve dependencies for project org.apache.maven.its.mng0553:test:jar:1.0-SNAPSHOT: Failed to collect dependencies at org.apache.maven.its.mng0553:a:jar:0.1-SNAPSHOT
    at org.apache.maven.project.DefaultProjectDependenciesResolver.resolve (DefaultProjectDependenciesResolver.java:178)
    at org.apache.maven.lifecycle.internal.LifecycleDependencyResolver.getDependencies (LifecycleDependencyResolver.java:243)
    at org.apache.maven.lifecycle.internal.LifecycleDependencyResolver.resolveProjectDependencies (LifecycleDependencyResolver.java:147)
    at org.apache.maven.lifecycle.internal.MojoExecutor.ensureDependenciesAreResolved (MojoExecutor.java:248)
    at org.apache.maven.lifecycle.internal.MojoExecutor.execute (MojoExecutor.java:202)
    at org.apache.maven.lifecycle.internal.MojoExecutor.execute (MojoExecutor.java:156)
    at org.apache.maven.lifecycle.internal.MojoExecutor.execute (MojoExecutor.java:148)
    at org.apache.maven.lifecycle.internal.LifecycleModuleBuilder.buildProject (LifecycleModuleBuilder.java:117)
    at org.apache.maven.lifecycle.internal.LifecycleModuleBuilder.buildProject (LifecycleModuleBuilder.java:81)
    at org.apache.maven.lifecycle.internal.builder.singlethreaded.SingleThreadedBuilder.build (SingleThreadedBuilder.java:56)
    at org.apache.maven.lifecycle.internal.LifecycleStarter.execute (LifecycleStarter.java:128)
    at org.apache.maven.DefaultMaven.doExecute (DefaultMaven.java:305)
    at org.apache.maven.DefaultMaven.doExecute (DefaultMaven.java:192)
    at org.apache.maven.DefaultMaven.execute (DefaultMaven.java:105)
    at org.apache.maven.cli.MavenCli.execute (MavenCli.java:956)
    at org.apache.maven.cli.MavenCli.doMain (MavenCli.java:288)
    at org.apache.maven.cli.MavenCli.main (MavenCli.java:192)
    at jdk.internal.reflect.NativeMethodAccessorImpl.invoke0 (Native Method)
    at jdk.internal.reflect.NativeMethodAccessorImpl.invoke (NativeMethodAccessorImpl.java:62)
    at jdk.internal.reflect.DelegatingMethodAccessorImpl.invoke (DelegatingMethodAccessorImpl.java:43)
    at java.lang.reflect.Method.invoke (Method.java:567)
    at org.codehaus.plexus.classworlds.launcher.Launcher.launchEnhanced (Launcher.java:282)
    at org.codehaus.plexus.classworlds.launcher.Launcher.launch (Launcher.java:225)
    at org.codehaus.plexus.classworlds.launcher.Launcher.mainWithExitCode (Launcher.java:406)
    at org.codehaus.plexus.classworlds.launcher.Launcher.main (Launcher.java:347)
Caused by: org.eclipse.aether.collection.DependencyCollectionException: Failed to collect dependencies at org.apache.maven.its.mng0553:a:jar:0.1-SNAPSHOT
    at org.eclipse.aether.internal.impl.collect.DefaultDependencyCollector.collectDependencies (DefaultDependencyCollector.java:284)
    at org.eclipse.aether.internal.impl.DefaultRepositorySystem.collectDependencies (DefaultRepositorySystem.java:279)
    at org.apache.maven.project.DefaultProjectDependenciesResolver.resolve (DefaultProjectDependenciesResolver.java:169)
    at org.apache.maven.lifecycle.internal.LifecycleDependencyResolver.getDependencies (LifecycleDependencyResolver.java:243)
    at org.apache.maven.lifecycle.internal.LifecycleDependencyResolver.resolveProjectDependencies (LifecycleDependencyResolver.java:147)
    at org.apache.maven.lifecycle.internal.MojoExecutor.ensureDependenciesAreResolved (MojoExecutor.java:248)
    at org.apache.maven.lifecycle.internal.MojoExecutor.execute (MojoExecutor.java:202)
    at org.apache.maven.lifecycle.internal.MojoExecutor.execute (MojoExecutor.java:156)
    at org.apache.maven.lifecycle.internal.MojoExecutor.execute (MojoExecutor.java:148)
    at org.apache.maven.lifecycle.internal.LifecycleModuleBuilder.buildProject (LifecycleModuleBuilder.java:117)
    at org.apache.maven.lifecycle.internal.LifecycleModuleBuilder.buildProject (LifecycleModuleBuilder.java:81)
    at org.apache.maven.lifecycle.internal.builder.singlethreaded.SingleThreadedBuilder.build (SingleThreadedBuilder.java:56)
    at org.apache.maven.lifecycle.internal.LifecycleStarter.execute (LifecycleStarter.java:128)
    at org.apache.maven.DefaultMaven.doExecute (DefaultMaven.java:305)
    at org.apache.maven.DefaultMaven.doExecute (DefaultMaven.java:192)
    at org.apache.maven.DefaultMaven.execute (DefaultMaven.java:105)
    at org.apache.maven.cli.MavenCli.execute (MavenCli.java:956)
    at org.apache.maven.cli.MavenCli.doMain (MavenCli.java:288)
    at org.apache.maven.cli.MavenCli.main (MavenCli.java:192)
    at jdk.internal.reflect.NativeMethodAccessorImpl.invoke0 (Native Method)
    at jdk.internal.reflect.NativeMethodAccessorImpl.invoke (NativeMethodAccessorImpl.java:62)
    at jdk.internal.reflect.DelegatingMethodAccessorImpl.invoke (DelegatingMethodAccessorImpl.java:43)
    at java.lang.reflect.Method.invoke (Method.java:567)
    at org.codehaus.plexus.classworlds.launcher.Launcher.launchEnhanced (Launcher.java:282)
    at org.codehaus.plexus.classworlds.launcher.Launcher.launch (Launcher.java:225)
    at org.codehaus.plexus.classworlds.launcher.Launcher.mainWithExitCode (Launcher.java:406)
    at org.codehaus.plexus.classworlds.launcher.Launcher.main (Launcher.java:347)
Caused by: org.eclipse.aether.resolution.ArtifactDescriptorException: Failed to read artifact descriptor for org.apache.maven.its.mng0553:a:jar:0.1-SNAPSHOT
    at org.apache.maven.repository.internal.DefaultArtifactDescriptorReader.loadPom (DefaultArtifactDescriptorReader.java:255)
    at org.apache.maven.repository.internal.DefaultArtifactDescriptorReader.readArtifactDescriptor (DefaultArtifactDescriptorReader.java:171)
    at org.eclipse.aether.internal.impl.collect.DefaultDependencyCollector.resolveCachedArtifactDescriptor (DefaultDependencyCollector.java:530)
    at org.eclipse.aether.internal.impl.collect.DefaultDependencyCollector.getArtifactDescriptorResult (DefaultDependencyCollector.java:515)
    at org.eclipse.aether.internal.impl.collect.DefaultDependencyCollector.processDependency (DefaultDependencyCollector.java:403)
    at org.eclipse.aether.internal.impl.collect.DefaultDependencyCollector.processDependency (DefaultDependencyCollector.java:356)
    at org.eclipse.aether.internal.impl.collect.DefaultDependencyCollector.process (DefaultDependencyCollector.java:344)
    at org.eclipse.aether.internal.impl.collect.DefaultDependencyCollector.collectDependencies (DefaultDependencyCollector.java:247)
    at org.eclipse.aether.internal.impl.DefaultRepositorySystem.collectDependencies (DefaultRepositorySystem.java:279)
    at org.apache.maven.project.DefaultProjectDependenciesResolver.resolve (DefaultProjectDependenciesResolver.java:169)
    at org.apache.maven.lifecycle.internal.LifecycleDependencyResolver.getDependencies (LifecycleDependencyResolver.java:243)
    at org.apache.maven.lifecycle.internal.LifecycleDependencyResolver.resolveProjectDependencies (LifecycleDependencyResolver.java:147)
    at org.apache.maven.lifecycle.internal.MojoExecutor.ensureDependenciesAreResolved (MojoExecutor.java:248)
    at org.apache.maven.lifecycle.internal.MojoExecutor.execute (MojoExecutor.java:202)
    at org.apache.maven.lifecycle.internal.MojoExecutor.execute (MojoExecutor.java:156)
    at org.apache.maven.lifecycle.internal.MojoExecutor.execute (MojoExecutor.java:148)
    at org.apache.maven.lifecycle.internal.LifecycleModuleBuilder.buildProject (LifecycleModuleBuilder.java:117)
    at org.apache.maven.lifecycle.internal.LifecycleModuleBuilder.buildProject (LifecycleModuleBuilder.java:81)
    at org.apache.maven.lifecycle.internal.builder.singlethreaded.SingleThreadedBuilder.build (SingleThreadedBuilder.java:56)
    at org.apache.maven.lifecycle.internal.LifecycleStarter.execute (LifecycleStarter.java:128)
    at org.apache.maven.DefaultMaven.doExecute (DefaultMaven.java:305)
    at org.apache.maven.DefaultMaven.doExecute (DefaultMaven.java:192)
    at org.apache.maven.DefaultMaven.execute (DefaultMaven.java:105)
    at org.apache.maven.cli.MavenCli.execute (MavenCli.java:956)
    at org.apache.maven.cli.MavenCli.doMain (MavenCli.java:288)
    at org.apache.maven.cli.MavenCli.main (MavenCli.java:192)
    at jdk.internal.reflect.NativeMethodAccessorImpl.invoke0 (Native Method)
    at jdk.internal.reflect.NativeMethodAccessorImpl.invoke (NativeMethodAccessorImpl.java:62)
    at jdk.internal.reflect.DelegatingMethodAccessorImpl.invoke (DelegatingMethodAccessorImpl.java:43)
    at java.lang.reflect.Method.invoke (Method.java:567)
    at org.codehaus.plexus.classworlds.launcher.Launcher.launchEnhanced (Launcher.java:282)
    at org.codehaus.plexus.classworlds.launcher.Launcher.launch (Launcher.java:225)
    at org.codehaus.plexus.classworlds.launcher.Launcher.mainWithExitCode (Launcher.java:406)
    at org.codehaus.plexus.classworlds.launcher.Launcher.main (Launcher.java:347)
Caused by: org.eclipse.aether.resolution.ArtifactResolutionException: Could not transfer artifact org.apache.maven.its.mng0553:a:pom:0.1-SNAPSHOT from/to test (http://localhost:45740/): Not authorized
    at org.eclipse.aether.internal.impl.DefaultArtifactResolver.resolve (DefaultArtifactResolver.java:423)
    at org.eclipse.aether.internal.impl.DefaultArtifactResolver.resolveArtifacts (DefaultArtifactResolver.java:225)
    at org.eclipse.aether.internal.impl.DefaultArtifactResolver.resolveArtifact (DefaultArtifactResolver.java:202)
    at org.apache.maven.repository.internal.DefaultArtifactDescriptorReader.loadPom (DefaultArtifactDescriptorReader.java:240)
    at org.apache.maven.repository.internal.DefaultArtifactDescriptorReader.readArtifactDescriptor (DefaultArtifactDescriptorReader.java:171)
    at org.eclipse.aether.internal.impl.collect.DefaultDependencyCollector.resolveCachedArtifactDescriptor (DefaultDependencyCollector.java:530)
    at org.eclipse.aether.internal.impl.collect.DefaultDependencyCollector.getArtifactDescriptorResult (DefaultDependencyCollector.java:515)
    at org.eclipse.aether.internal.impl.collect.DefaultDependencyCollector.processDependency (DefaultDependencyCollector.java:403)
    at org.eclipse.aether.internal.impl.collect.DefaultDependencyCollector.processDependency (DefaultDependencyCollector.java:356)
    at org.eclipse.aether.internal.impl.collect.DefaultDependencyCollector.process (DefaultDependencyCollector.java:344)
    at org.eclipse.aether.internal.impl.collect.DefaultDependencyCollector.collectDependencies (DefaultDependencyCollector.java:247)
    at org.eclipse.aether.internal.impl.DefaultRepositorySystem.collectDependencies (DefaultRepositorySystem.java:279)
    at org.apache.maven.project.DefaultProjectDependenciesResolver.resolve (DefaultProjectDependenciesResolver.java:169)
    at org.apache.maven.lifecycle.internal.LifecycleDependencyResolver.getDependencies (LifecycleDependencyResolver.java:243)
    at org.apache.maven.lifecycle.internal.LifecycleDependencyResolver.resolveProjectDependencies (LifecycleDependencyResolver.java:147)
    at org.apache.maven.lifecycle.internal.MojoExecutor.ensureDependenciesAreResolved (MojoExecutor.java:248)
    at org.apache.maven.lifecycle.internal.MojoExecutor.execute (MojoExecutor.java:202)
    at org.apache.maven.lifecycle.internal.MojoExecutor.execute (MojoExecutor.java:156)
    at org.apache.maven.lifecycle.internal.MojoExecutor.execute (MojoExecutor.java:148)
    at org.apache.maven.lifecycle.internal.LifecycleModuleBuilder.buildProject (LifecycleModuleBuilder.java:117)
    at org.apache.maven.lifecycle.internal.LifecycleModuleBuilder.buildProject (LifecycleModuleBuilder.java:81)
    at org.apache.maven.lifecycle.internal.builder.singlethreaded.SingleThreadedBuilder.build (SingleThreadedBuilder.java:56)
    at org.apache.maven.lifecycle.internal.LifecycleStarter.execute (LifecycleStarter.java:128)
    at org.apache.maven.DefaultMaven.doExecute (DefaultMaven.java:305)
    at org.apache.maven.DefaultMaven.doExecute (DefaultMaven.java:192)
    at org.apache.maven.DefaultMaven.execute (DefaultMaven.java:105)
    at org.apache.maven.cli.MavenCli.execute (MavenCli.java:956)
    at org.apache.maven.cli.MavenCli.doMain (MavenCli.java:288)
    at org.apache.maven.cli.MavenCli.main (MavenCli.java:192)
    at jdk.internal.reflect.NativeMethodAccessorImpl.invoke0 (Native Method)
    at jdk.internal.reflect.NativeMethodAccessorImpl.invoke (NativeMethodAccessorImpl.java:62)
    at jdk.internal.reflect.DelegatingMethodAccessorImpl.invoke (DelegatingMethodAccessorImpl.java:43)
    at java.lang.reflect.Method.invoke (Method.java:567)
    at org.codehaus.plexus.classworlds.launcher.Launcher.launchEnhanced (Launcher.java:282)
    at org.codehaus.plexus.classworlds.launcher.Launcher.launch (Launcher.java:225)
    at org.codehaus.plexus.classworlds.launcher.Launcher.mainWithExitCode (Launcher.java:406)
    at org.codehaus.plexus.classworlds.launcher.Launcher.main (Launcher.java:347)
Caused by: org.eclipse.aether.transfer.ArtifactTransferException: Could not transfer artifact org.apache.maven.its.mng0553:a:pom:0.1-SNAPSHOT from/to test (http://localhost:45740/): Not authorized
    at org.eclipse.aether.connector.basic.ArtifactTransportListener.transferFailed (ArtifactTransportListener.java:52)
    at org.eclipse.aether.connector.basic.BasicRepositoryConnector$TaskRunner.run (BasicRepositoryConnector.java:368)
    at org.eclipse.aether.util.concurrency.RunnableErrorForwarder$1.run (RunnableErrorForwarder.java:75)
    at org.eclipse.aether.connector.basic.BasicRepositoryConnector$DirectExecutor.execute (BasicRepositoryConnector.java:642)
    at org.eclipse.aether.connector.basic.BasicRepositoryConnector.get (BasicRepositoryConnector.java:262)
    at org.eclipse.aether.internal.impl.DefaultArtifactResolver.performDownloads (DefaultArtifactResolver.java:499)
    at org.eclipse.aether.internal.impl.DefaultArtifactResolver.resolve (DefaultArtifactResolver.java:400)
    at org.eclipse.aether.internal.impl.DefaultArtifactResolver.resolveArtifacts (DefaultArtifactResolver.java:225)
    at org.eclipse.aether.internal.impl.DefaultArtifactResolver.resolveArtifact (DefaultArtifactResolver.java:202)
    at org.apache.maven.repository.internal.DefaultArtifactDescriptorReader.loadPom (DefaultArtifactDescriptorReader.java:240)
    at org.apache.maven.repository.internal.DefaultArtifactDescriptorReader.readArtifactDescriptor (DefaultArtifactDescriptorReader.java:171)
    at org.eclipse.aether.internal.impl.collect.DefaultDependencyCollector.resolveCachedArtifactDescriptor (DefaultDependencyCollector.java:530)
    at org.eclipse.aether.internal.impl.collect.DefaultDependencyCollector.getArtifactDescriptorResult (DefaultDependencyCollector.java:515)
    at org.eclipse.aether.internal.impl.collect.DefaultDependencyCollector.processDependency (DefaultDependencyCollector.java:403)
    at org.eclipse.aether.internal.impl.collect.DefaultDependencyCollector.processDependency (DefaultDependencyCollector.java:356)
    at org.eclipse.aether.internal.impl.collect.DefaultDependencyCollector.process (DefaultDependencyCollector.java:344)
    at org.eclipse.aether.internal.impl.collect.DefaultDependencyCollector.collectDependencies (DefaultDependencyCollector.java:247)
    at org.eclipse.aether.internal.impl.DefaultRepositorySystem.collectDependencies (DefaultRepositorySystem.java:279)
    at org.apache.maven.project.DefaultProjectDependenciesResolver.resolve (DefaultProjectDependenciesResolver.java:169)
    at org.apache.maven.lifecycle.internal.LifecycleDependencyResolver.getDependencies (LifecycleDependencyResolver.java:243)
    at org.apache.maven.lifecycle.internal.LifecycleDependencyResolver.resolveProjectDependencies (LifecycleDependencyResolver.java:147)
    at org.apache.maven.lifecycle.internal.MojoExecutor.ensureDependenciesAreResolved (MojoExecutor.java:248)
    at org.apache.maven.lifecycle.internal.MojoExecutor.execute (MojoExecutor.java:202)
    at org.apache.maven.lifecycle.internal.MojoExecutor.execute (MojoExecutor.java:156)
    at org.apache.maven.lifecycle.internal.MojoExecutor.execute (MojoExecutor.java:148)
    at org.apache.maven.lifecycle.internal.LifecycleModuleBuilder.buildProject (LifecycleModuleBuilder.java:117)
    at org.apache.maven.lifecycle.internal.LifecycleModuleBuilder.buildProject (LifecycleModuleBuilder.java:81)
    at org.apache.maven.lifecycle.internal.builder.singlethreaded.SingleThreadedBuilder.build (SingleThreadedBuilder.java:56)
    at org.apache.maven.lifecycle.internal.LifecycleStarter.execute (LifecycleStarter.java:128)
    at org.apache.maven.DefaultMaven.doExecute (DefaultMaven.java:305)
    at org.apache.maven.DefaultMaven.doExecute (DefaultMaven.java:192)
    at org.apache.maven.DefaultMaven.execute (DefaultMaven.java:105)
    at org.apache.maven.cli.MavenCli.execute (MavenCli.java:956)
    at org.apache.maven.cli.MavenCli.doMain (MavenCli.java:288)
    at org.apache.maven.cli.MavenCli.main (MavenCli.java:192)
    at jdk.internal.reflect.NativeMethodAccessorImpl.invoke0 (Native Method)
    at jdk.internal.reflect.NativeMethodAccessorImpl.invoke (NativeMethodAccessorImpl.java:62)
    at jdk.internal.reflect.DelegatingMethodAccessorImpl.invoke (DelegatingMethodAccessorImpl.java:43)
    at java.lang.reflect.Method.invoke (Method.java:567)
    at org.codehaus.plexus.classworlds.launcher.Launcher.launchEnhanced (Launcher.java:282)
    at org.codehaus.plexus.classworlds.launcher.Launcher.launch (Launcher.java:225)
    at org.codehaus.plexus.classworlds.launcher.Launcher.mainWithExitCode (Launcher.java:406)
    at org.codehaus.plexus.classworlds.launcher.Launcher.main (Launcher.java:347)
Caused by: org.apache.maven.wagon.authorization.AuthorizationException: Not authorized
    at org.apache.maven.wagon.providers.http.wagon.shared.AbstractHttpClientWagon.fillInputData (AbstractHttpClientWagon.java:1145)
    at org.apache.maven.wagon.providers.http.wagon.shared.AbstractHttpClientWagon.fillInputData (AbstractHttpClientWagon.java:1094)
    at org.apache.maven.wagon.StreamWagon.getInputStream (StreamWagon.java:126)
    at org.apache.maven.wagon.StreamWagon.getIfNewer (StreamWagon.java:88)
    at org.apache.maven.wagon.StreamWagon.get (StreamWagon.java:61)
    at org.eclipse.aether.transport.wagon.WagonTransporter$GetTaskRunner.run (WagonTransporter.java:567)
    at org.eclipse.aether.transport.wagon.WagonTransporter.execute (WagonTransporter.java:435)
    at org.eclipse.aether.transport.wagon.WagonTransporter.get (WagonTransporter.java:412)
    at org.eclipse.aether.connector.basic.BasicRepositoryConnector$GetTaskRunner.runTask (BasicRepositoryConnector.java:456)
    at org.eclipse.aether.connector.basic.BasicRepositoryConnector$TaskRunner.run (BasicRepositoryConnector.java:363)
    at org.eclipse.aether.util.concurrency.RunnableErrorForwarder$1.run (RunnableErrorForwarder.java:75)
    at org.eclipse.aether.connector.basic.BasicRepositoryConnector$DirectExecutor.execute (BasicRepositoryConnector.java:642)
    at org.eclipse.aether.connector.basic.BasicRepositoryConnector.get (BasicRepositoryConnector.java:262)
    at org.eclipse.aether.internal.impl.DefaultArtifactResolver.performDownloads (DefaultArtifactResolver.java:499)
    at org.eclipse.aether.internal.impl.DefaultArtifactResolver.resolve (DefaultArtifactResolver.java:400)
    at org.eclipse.aether.internal.impl.DefaultArtifactResolver.resolveArtifacts (DefaultArtifactResolver.java:225)
    at org.eclipse.aether.internal.impl.DefaultArtifactResolver.resolveArtifact (DefaultArtifactResolver.java:202)
    at org.apache.maven.repository.internal.DefaultArtifactDescriptorReader.loadPom (DefaultArtifactDescriptorReader.java:240)
    at org.apache.maven.repository.internal.DefaultArtifactDescriptorReader.readArtifactDescriptor (DefaultArtifactDescriptorReader.java:171)
    at org.eclipse.aether.internal.impl.collect.DefaultDependencyCollector.resolveCachedArtifactDescriptor (DefaultDependencyCollector.java:530)
    at org.eclipse.aether.internal.impl.collect.DefaultDependencyCollector.getArtifactDescriptorResult (DefaultDependencyCollector.java:515)
    at org.eclipse.aether.internal.impl.collect.DefaultDependencyCollector.processDependency (DefaultDependencyCollector.java:403)
    at org.eclipse.aether.internal.impl.collect.DefaultDependencyCollector.processDependency (DefaultDependencyCollector.java:356)
    at org.eclipse.aether.internal.impl.collect.DefaultDependencyCollector.process (DefaultDependencyCollector.java:344)
    at org.eclipse.aether.internal.impl.collect.DefaultDependencyCollector.collectDependencies (DefaultDependencyCollector.java:247)
    at org.eclipse.aether.internal.impl.DefaultRepositorySystem.collectDependencies (DefaultRepositorySystem.java:279)
    at org.apache.maven.project.DefaultProjectDependenciesResolver.resolve (DefaultProjectDependenciesResolver.java:169)
    at org.apache.maven.lifecycle.internal.LifecycleDependencyResolver.getDependencies (LifecycleDependencyResolver.java:243)
    at org.apache.maven.lifecycle.internal.LifecycleDependencyResolver.resolveProjectDependencies (LifecycleDependencyResolver.java:147)
    at org.apache.maven.lifecycle.internal.MojoExecutor.ensureDependenciesAreResolved (MojoExecutor.java:248)
    at org.apache.maven.lifecycle.internal.MojoExecutor.execute (MojoExecutor.java:202)
    at org.apache.maven.lifecycle.internal.MojoExecutor.execute (MojoExecutor.java:156)
    at org.apache.maven.lifecycle.internal.MojoExecutor.execute (MojoExecutor.java:148)
    at org.apache.maven.lifecycle.internal.LifecycleModuleBuilder.buildProject (LifecycleModuleBuilder.java:117)
    at org.apache.maven.lifecycle.internal.LifecycleModuleBuilder.buildProject (LifecycleModuleBuilder.java:81)
    at org.apache.maven.lifecycle.internal.builder.singlethreaded.SingleThreadedBuilder.build (SingleThreadedBuilder.java:56)
    at org.apache.maven.lifecycle.internal.LifecycleStarter.execute (LifecycleStarter.java:128)
    at org.apache.maven.DefaultMaven.doExecute (DefaultMaven.java:305)
    at org.apache.maven.DefaultMaven.doExecute (DefaultMaven.java:192)
    at org.apache.maven.DefaultMaven.execute (DefaultMaven.java:105)
    at org.apache.maven.cli.MavenCli.execute (MavenCli.java:956)
    at org.apache.maven.cli.MavenCli.doMain (MavenCli.java:288)
    at org.apache.maven.cli.MavenCli.main (MavenCli.java:192)
    at jdk.internal.reflect.NativeMethodAccessorImpl.invoke0 (Native Method)
    at jdk.internal.reflect.NativeMethodAccessorImpl.invoke (NativeMethodAccessorImpl.java:62)
    at jdk.internal.reflect.DelegatingMethodAccessorImpl.invoke (DelegatingMethodAccessorImpl.java:43)
    at java.lang.reflect.Method.invoke (Method.java:567)
    at org.codehaus.plexus.classworlds.launcher.Launcher.launchEnhanced (Launcher.java:282)
    at org.codehaus.plexus.classworlds.launcher.Launcher.launch (Launcher.java:225)
    at org.codehaus.plexus.classworlds.launcher.Launcher.mainWithExitCode (Launcher.java:406)
    at org.codehaus.plexus.classworlds.launcher.Launcher.main (Launcher.java:347)
[ERROR] 
[ERROR] Re-run Maven using the -X switch to enable full debug logging.
[ERROR] 
[ERROR] For more information about the errors and possible solutions, please read the following articles:
[ERROR] [Help 1] http://cwiki.apache.org/confluence/display/MAVEN/DependencyResolutionException

	at org.apache.maven.it.MavenITmng0553SettingsAuthzEncryptionTest.testitBasic(MavenITmng0553SettingsAuthzEncryptionTest.java:129)


FAILED:  org.apache.maven.it.MavenITmng4590ImportedPomUsesSystemPropertiesTest.linux-jdk12 / Run ITs Linux Java 12 / testit

Error Message:
expected:</home/jenkins/jenkins-slave/workspace/box_maven_jenkins-buld-error-wip/test/core-it-suite/target/test-classes/mng-4590/pom.xml> but was:</home/jenkins/jenkins-slave/workspace/box_maven_jenkins-buld-error-wip/test/core-it-suite/target/test-classes/mng-4590/${test.file}>

Stack Trace:
junit.framework.AssertionFailedError: expected:</home/jenkins/jenkins-slave/workspace/box_maven_jenkins-buld-error-wip/test/core-it-suite/target/test-classes/mng-4590/pom.xml> but was:</home/jenkins/jenkins-slave/workspace/box_maven_jenkins-buld-error-wip/test/core-it-suite/target/test-classes/mng-4590/${test.file}>
	at org.apache.maven.it.MavenITmng4590ImportedPomUsesSystemPropertiesTest.testit(MavenITmng4590ImportedPomUsesSystemPropertiesTest.java:66)


FAILED:  org.apache.maven.it.MavenITmng4747JavaAgentUsedByPluginTest.linux-jdk12 / Run ITs Linux Java 12 / testit

Error Message:
null

Stack Trace:
junit.framework.AssertionFailedError
	at org.apache.maven.it.MavenITmng4747JavaAgentUsedByPluginTest.testit(MavenITmng4747JavaAgentUsedByPluginTest.java:63)




Build log:
[...truncated 77192 lines...]
[withMaven] junitPublisher - Archive test results for Maven artifact org.apache.maven.its.plugins:mng-5805-pkg-type-mojo-configuration-plugin:maven-plugin:2.1-SNAPSHOT generated by maven-surefire-plugin:test (default-test): core-it-support/core-it-plugins/mng5805-plugin/target/surefire-reports/*.xml
[withMaven] junitPublisher - Archive test results for Maven artifact org.apache.maven.its.plugins:mng-5805-pkg-type-mojo-configuration-plugin-dep:jar:2.1-SNAPSHOT generated by maven-surefire-plugin:test (default-test): core-it-support/core-it-plugins/mng5805-plugin-dep/target/surefire-reports/*.xml
[withMaven] junitPublisher - Archive test results for Maven artifact org.apache.maven.its.plugins:mng-5958-pkg-type-extension:jar:2.1-SNAPSHOT generated by maven-surefire-plugin:test (default-test): core-it-support/core-it-plugins/mng5958-extension/target/surefire-reports/*.xml
[withMaven] junitPublisher - Archive test results for Maven artifact org.apache.maven.its:core-it-toolchain:jar:2.1-SNAPSHOT generated by maven-surefire-plugin:test (default-test): core-it-support/core-it-toolchain/target/surefire-reports/*.xml
[withMaven] junitPublisher - Archive test results for Maven artifact org.apache.maven.its:core-it-wagon:jar:2.1-SNAPSHOT generated by maven-surefire-plugin:test (default-test): core-it-support/core-it-wagon/target/surefire-reports/*.xml
[withMaven] junitPublisher - Archive test results for Maven artifact org.apache.maven.its:core-it-extension:jar:2.1-SNAPSHOT generated by maven-surefire-plugin:test (default-test): core-it-support/core-it-extension/target/surefire-reports/*.xml
[withMaven] junitPublisher - Archive test results for Maven artifact org.apache.maven.its:core-it-suite:jar:2.1-SNAPSHOT generated by maven-surefire-plugin:test (default-test): core-it-suite/target/surefire-reports/*.xml
Recording test results
[withMaven] openTasksPublisher - Scan Tasks for Maven artifact org.apache.maven.its.plugins:maven-it-plugin-active-collection:maven-plugin:2.1-SNAPSHOT in source directory core-it-support/core-it-plugins/maven-it-plugin-active-collection/src/main/java
[withMaven] openTasksPublisher - Scan Tasks for Maven artifact org.apache.maven.its.plugins:maven-it-plugin-artifact:maven-plugin:2.1-SNAPSHOT in source directory core-it-support/core-it-plugins/maven-it-plugin-artifact/src/main/java
[withMaven] openTasksPublisher - Scan Tasks for Maven artifact org.apache.maven.its.plugins.class-loader:dep-a:jar:2.1-SNAPSHOT in source directory core-it-support/core-it-plugins/maven-it-plugin-class-loader/dep-a/src/main/java
[withMaven] openTasksPublisher - Scan Tasks for Maven artifact org.apache.maven.its.plugins.class-loader:dep-b:jar:2.1-SNAPSHOT in source directory core-it-support/core-it-plugins/maven-it-plugin-class-loader/dep-b/src/main/java
[withMaven] openTasksPublisher - Scan Tasks for Maven artifact org.apache.maven.its.plugins:maven-it-plugin-class-loader:maven-plugin:2.1-SNAPSHOT in source directory core-it-support/core-it-plugins/maven-it-plugin-class-loader/maven-it-plugin-class-loader/src/main/java
[withMaven] openTasksPublisher - Scan Tasks for Maven artifact org.apache.maven.its.plugins:maven-it-plugin-configuration:maven-plugin:2.1-SNAPSHOT in source directory core-it-support/core-it-plugins/maven-it-plugin-configuration/src/main/java
[withMaven] openTasksPublisher - Scan Tasks for Maven artifact org.apache.maven.its.plugins:maven-it-plugin-context-passing:maven-plugin:2.1-SNAPSHOT in source directory core-it-support/core-it-plugins/maven-it-plugin-context-passing/src/main/java
[withMaven] openTasksPublisher - Scan Tasks for Maven artifact org.apache.maven.plugins:maven-clean-plugin:maven-plugin:0.1-stub-SNAPSHOT in source directory core-it-support/core-it-plugins/maven-it-plugin-core-stubs/maven-clean-plugin/src/main/java
[withMaven] openTasksPublisher - Scan Tasks for Maven artifact org.apache.maven.plugins:maven-compiler-plugin:maven-plugin:0.1-stub-SNAPSHOT in source directory core-it-support/core-it-plugins/maven-it-plugin-core-stubs/maven-compiler-plugin/src/main/java
[withMaven] openTasksPublisher - Scan Tasks for Maven artifact org.apache.maven.plugins:maven-deploy-plugin:maven-plugin:0.1-stub-SNAPSHOT in source directory core-it-support/core-it-plugins/maven-it-plugin-core-stubs/maven-deploy-plugin/src/main/java
[withMaven] openTasksPublisher - Scan Tasks for Maven artifact org.apache.maven.plugins:maven-ear-plugin:maven-plugin:0.1-stub-SNAPSHOT in source directory core-it-support/core-it-plugins/maven-it-plugin-core-stubs/maven-ear-plugin/src/main/java
[withMaven] openTasksPublisher - Scan Tasks for Maven artifact org.apache.maven.plugins:maven-ejb-plugin:maven-plugin:0.1-stub-SNAPSHOT in source directory core-it-support/core-it-plugins/maven-it-plugin-core-stubs/maven-ejb-plugin/src/main/java
[withMaven] openTasksPublisher - Scan Tasks for Maven artifact org.apache.maven.plugins:maven-install-plugin:maven-plugin:0.1-stub-SNAPSHOT in source directory core-it-support/core-it-plugins/maven-it-plugin-core-stubs/maven-install-plugin/src/main/java
[withMaven] openTasksPublisher - Scan Tasks for Maven artifact org.apache.maven.plugins:maven-jar-plugin:maven-plugin:0.1-stub-SNAPSHOT in source directory core-it-support/core-it-plugins/maven-it-plugin-core-stubs/maven-jar-plugin/src/main/java
[withMaven] openTasksPublisher - Scan Tasks for Maven artifact org.apache.maven.plugins:maven-javadoc-plugin:maven-plugin:0.1-stub-SNAPSHOT in source directory core-it-support/core-it-plugins/maven-it-plugin-core-stubs/maven-javadoc-plugin/src/main/java
[withMaven] openTasksPublisher - Scan Tasks for Maven artifact org.apache.maven.plugins:maven-plugin-plugin:maven-plugin:0.1-stub-SNAPSHOT in source directory core-it-support/core-it-plugins/maven-it-plugin-core-stubs/maven-plugin-plugin/src/main/java
[withMaven] openTasksPublisher - Scan Tasks for Maven artifact org.apache.maven.plugins:maven-rar-plugin:maven-plugin:0.1-stub-SNAPSHOT in source directory core-it-support/core-it-plugins/maven-it-plugin-core-stubs/maven-rar-plugin/src/main/java
[withMaven] openTasksPublisher - Scan Tasks for Maven artifact org.apache.maven.plugins:maven-resources-plugin:maven-plugin:0.1-stub-SNAPSHOT in source directory core-it-support/core-it-plugins/maven-it-plugin-core-stubs/maven-resources-plugin/src/main/java
[withMaven] openTasksPublisher - Scan Tasks for Maven artifact org.apache.maven.plugins:maven-site-plugin:maven-plugin:0.1-stub-SNAPSHOT in source directory core-it-support/core-it-plugins/maven-it-plugin-core-stubs/maven-site-plugin/src/main/java
[withMaven] openTasksPublisher - Scan Tasks for Maven artifact org.apache.maven.plugins:maven-source-plugin:maven-plugin:0.1-stub-SNAPSHOT in source directory core-it-support/core-it-plugins/maven-it-plugin-core-stubs/maven-source-plugin/src/main/java
[withMaven] openTasksPublisher - Scan Tasks for Maven artifact org.apache.maven.plugins:maven-surefire-plugin:maven-plugin:0.1-stub-SNAPSHOT in source directory core-it-support/core-it-plugins/maven-it-plugin-core-stubs/maven-surefire-plugin/src/main/java
[withMaven] openTasksPublisher - Scan Tasks for Maven artifact org.apache.maven.plugins:maven-war-plugin:maven-plugin:0.1-stub-SNAPSHOT in source directory core-it-support/core-it-plugins/maven-it-plugin-core-stubs/maven-war-plugin/src/main/java
[withMaven] openTasksPublisher - Scan Tasks for Maven artifact org.apache.maven.its.plugins:maven-it-plugin-dependency-collection:maven-plugin:2.1-SNAPSHOT in source directory core-it-support/core-it-plugins/maven-it-plugin-dependency-collection/src/main/java
[withMaven] openTasksPublisher - Scan Tasks for Maven artifact org.apache.maven.its.plugins:maven-it-plugin-dependency-resolution:maven-plugin:2.1-SNAPSHOT in source directory core-it-support/core-it-plugins/maven-it-plugin-dependency-resolution/src/main/java
[withMaven] openTasksPublisher - Scan Tasks for Maven artifact org.apache.maven.its.plugins:maven-it-plugin-expression:maven-plugin:2.1-SNAPSHOT in source directory core-it-support/core-it-plugins/maven-it-plugin-expression/src/main/java
[withMaven] openTasksPublisher - Scan Tasks for Maven artifact org.apache.maven.its.plugins:maven-it-plugin-error:maven-plugin:2.1-SNAPSHOT in source directory core-it-support/core-it-plugins/maven-it-plugin-error/src/main/java
[withMaven] openTasksPublisher - Scan Tasks for Maven artifact org.apache.maven.its:core-it-component:jar:2.1-SNAPSHOT in source directory core-it-support/core-it-component/src/main/java
[withMaven] openTasksPublisher - Scan Tasks for Maven artifact org.apache.maven.its.plugins:maven-it-plugin-extension-consumer:maven-plugin:2.1-SNAPSHOT in source directory core-it-support/core-it-plugins/maven-it-plugin-extension-consumer/src/main/java
[withMaven] openTasksPublisher - Scan Tasks for Maven artifact org.apache.maven.its.plugins:maven-it-plugin-extension-provider:maven-plugin:2.1-SNAPSHOT in source directory core-it-support/core-it-plugins/maven-it-plugin-extension-provider/src/main/java
[withMaven] openTasksPublisher - Scan Tasks for Maven artifact org.apache.maven.its.plugins:maven-it-plugin-fork:maven-plugin:2.1-SNAPSHOT in source directory core-it-support/core-it-plugins/maven-it-plugin-fork/src/main/java
[withMaven] openTasksPublisher - Scan Tasks for Maven artifact org.apache.maven.its.plugins:maven-it-plugin-invalid-descriptor:maven-plugin:2.1-SNAPSHOT in source directory core-it-support/core-it-plugins/maven-it-plugin-invalid-descriptor/src/main/java
[withMaven] openTasksPublisher - Scan Tasks for Maven artifact org.apache.maven.its.plugins:maven-it-plugin-log-file:maven-plugin:2.1-SNAPSHOT in source directory core-it-support/core-it-plugins/maven-it-plugin-log-file/src/main/java
[withMaven] openTasksPublisher - Scan Tasks for Maven artifact org.apache.maven.its:maven-it-helper:jar:2.1-SNAPSHOT in source directory core-it-support/maven-it-helper/src/main/java
[withMaven] openTasksPublisher - Scan Tasks for Maven artifact org.apache.maven.its.plugins:maven-it-plugin-model-interpolation:maven-plugin:2.1-SNAPSHOT in source directory core-it-support/core-it-plugins/maven-it-plugin-model-interpolation/src/main/java
[withMaven] openTasksPublisher - Scan Tasks for Maven artifact org.apache.maven.its.plugins:maven-it-plugin-no-default-comp:maven-plugin:2.1-SNAPSHOT in source directory core-it-support/core-it-plugins/maven-it-plugin-no-default-comp/src/main/java
[withMaven] openTasksPublisher - Scan Tasks for Maven artifact org.apache.maven.its.plugins:maven-it-plugin-no-project:maven-plugin:2.1-SNAPSHOT in source directory core-it-support/core-it-plugins/maven-it-plugin-no-project/src/main/java
[withMaven] openTasksPublisher - Scan Tasks for Maven artifact org.apache.maven.its.plugins:maven-it-plugin-online:maven-plugin:2.1-SNAPSHOT in source directory core-it-support/core-it-plugins/maven-it-plugin-online/src/main/java
[withMaven] openTasksPublisher - Scan Tasks for Maven artifact org.apache.maven.its.plugins:maven-it-plugin-optional-mojos:maven-plugin:2.1-SNAPSHOT in source directory core-it-support/core-it-plugins/maven-it-plugin-optional-mojos/src/main/java
[withMaven] openTasksPublisher - Scan Tasks for Maven artifact org.apache.maven.its.plugins:maven-it-plugin-packaging:maven-plugin:2.1-SNAPSHOT in source directory core-it-support/core-it-plugins/maven-it-plugin-packaging/src/main/java
[withMaven] openTasksPublisher - Scan Tasks for Maven artifact org.apache.maven.its.plugins:maven-it-plugin-parameter-implementation:maven-plugin:2.1-SNAPSHOT in source directory core-it-support/core-it-plugins/maven-it-plugin-parameter-implementation/src/main/java
[withMaven] openTasksPublisher - Scan Tasks for Maven artifact org.apache.maven.its.plugins:maven-it-plugin-plugin-dependency:maven-plugin:2.1-SNAPSHOT in source directory core-it-support/core-it-plugins/maven-it-plugin-plugin-dependency/src/main/java
[withMaven] openTasksPublisher - Scan Tasks for Maven artifact org.apache.maven.its.plugins:maven-it-plugin-project:maven-plugin:2.1-SNAPSHOT in source directory core-it-support/core-it-plugins/maven-it-plugin-project/src/main/java
[withMaven] openTasksPublisher - Scan Tasks for Maven artifact org.apache.maven.its.plugins:maven-it-plugin-project-interpolation:maven-plugin:2.1-SNAPSHOT in source directory core-it-support/core-it-plugins/maven-it-plugin-project-interpolation/src/main/java
[withMaven] openTasksPublisher - Scan Tasks for Maven artifact org.apache.maven.its.plugins:maven-it-plugin-setter:maven-plugin:2.1-SNAPSHOT in source directory core-it-support/core-it-plugins/maven-it-plugin-setter/src/main/java
[withMaven] openTasksPublisher - Scan Tasks for Maven artifact org.apache.maven.its.plugins:maven-it-plugin-singleton-component:maven-plugin:2.1-SNAPSHOT in source directory core-it-support/core-it-plugins/maven-it-plugin-singleton-component/src/main/java
[withMaven] openTasksPublisher - Scan Tasks for Maven artifact org.apache.maven.its.plugins:maven-it-plugin-site:maven-plugin:2.1-SNAPSHOT in source directory core-it-support/core-it-plugins/maven-it-plugin-site/src/main/java
[withMaven] openTasksPublisher - Scan Tasks for Maven artifact org.apache.maven.its.plugins:maven-it-plugin-toolchain:maven-plugin:2.1-SNAPSHOT in source directory core-it-support/core-it-plugins/maven-it-plugin-toolchain/src/main/java
[withMaven] openTasksPublisher - Scan Tasks for Maven artifact org.apache.maven.its.plugins:maven-it-plugin-touch:maven-plugin:2.1-SNAPSHOT in source directory core-it-support/core-it-plugins/maven-it-plugin-touch/src/main/java
[withMaven] openTasksPublisher - Scan Tasks for Maven artifact org.apache.maven.its.plugins:maven-it-plugin-uses-properties:maven-plugin:2.1-SNAPSHOT in source directory core-it-support/core-it-plugins/maven-it-plugin-uses-properties/src/main/java
[withMaven] openTasksPublisher - Scan Tasks for Maven artifact org.apache.maven.its.plugins:maven-it-plugin-uses-wagon:maven-plugin:2.1-SNAPSHOT in source directory core-it-support/core-it-plugins/maven-it-plugin-uses-wagon/src/main/java
[withMaven] openTasksPublisher - Scan Tasks for Maven artifact org.apache.maven.its.plugins:maven-it-plugin-all:maven-plugin:2.1-SNAPSHOT in source directory core-it-support/core-it-plugins/maven-it-plugin-all/src/main/java
[withMaven] openTasksPublisher - Scan Tasks for Maven artifact org.apache.maven.its.plugins:maven-it-plugin-plexus-utils-11:maven-plugin:2.1-SNAPSHOT in source directory core-it-support/core-it-plugins/maven-it-plugin-plexus-utils-11/src/main/java
[withMaven] openTasksPublisher - Scan Tasks for Maven artifact org.apache.maven.its.plugins:maven-it-plugin-plexus-utils-new:maven-plugin:2.1-SNAPSHOT in source directory core-it-support/core-it-plugins/maven-it-plugin-plexus-utils-new/src/main/java
[withMaven] openTasksPublisher - Scan Tasks for Maven artifact org.apache.maven.its.plugins:maven-it-plugin-plexus-component-api:maven-plugin:2.1-SNAPSHOT in source directory core-it-support/core-it-plugins/maven-it-plugin-plexus-component-api/src/main/java
[withMaven] openTasksPublisher - Scan Tasks for Maven artifact org.apache.maven.its.plugins:maven-it-plugin-log4j:maven-plugin:2.1-SNAPSHOT in source directory core-it-support/core-it-plugins/maven-it-plugin-log4j/src/main/java
[withMaven] openTasksPublisher - Scan Tasks for Maven artifact org.apache.maven.its.plugins:maven-it-plugin-extension1:maven-plugin:2.1-SNAPSHOT in source directory core-it-support/core-it-plugins/maven-it-plugin-extension1/src/main/java
[withMaven] openTasksPublisher - Scan Tasks for Maven artifact org.apache.maven.its.plugins:maven-it-plugin-extension2:maven-plugin:2.1-SNAPSHOT in source directory core-it-support/core-it-plugins/maven-it-plugin-extension2/src/main/java
[withMaven] openTasksPublisher - Scan Tasks for Maven artifact org.apache.maven.its.plugins:maven-it-plugin-plexus-lifecycle:maven-plugin:2.1-SNAPSHOT in source directory core-it-support/core-it-plugins/maven-it-plugin-plexus-lifecycle/src/main/java
[withMaven] openTasksPublisher - Scan Tasks for Maven artifact org.apache.maven.its.plugins:maven-it-plugin-settings:maven-plugin:2.1-SNAPSHOT in source directory core-it-support/core-it-plugins/maven-it-plugin-settings/src/main/java
[withMaven] openTasksPublisher - Scan Tasks for Maven artifact org.apache.maven.its.plugins:mng-5805-pkg-type-mojo-configuration-plugin:maven-plugin:2.1-SNAPSHOT in source directory core-it-support/core-it-plugins/mng5805-plugin/src/main/java
[withMaven] openTasksPublisher - Scan Tasks for Maven artifact org.apache.maven.its.plugins:mng-5805-pkg-type-mojo-configuration-plugin-dep:jar:2.1-SNAPSHOT in source directory core-it-support/core-it-plugins/mng5805-plugin-dep/src/main/java
[withMaven] openTasksPublisher - Scan Tasks for Maven artifact org.apache.maven.its.plugins:mng-5958-pkg-type-extension:jar:2.1-SNAPSHOT in source directory core-it-support/core-it-plugins/mng5958-extension/src/main/java
[withMaven] openTasksPublisher - Scan Tasks for Maven artifact org.apache.maven.its:core-it-toolchain:jar:2.1-SNAPSHOT in source directory core-it-support/core-it-toolchain/src/main/java
[withMaven] openTasksPublisher - Scan Tasks for Maven artifact org.apache.maven.its:core-it-wagon:jar:2.1-SNAPSHOT in source directory core-it-support/core-it-wagon/src/main/java
[TASKS] Scanning folder '/home/jenkins/jenkins-slave/workspace/box_maven_jenkins-buld-error-wip/test' for files matching the pattern 'core-it-support/core-it-plugins/maven-it-plugin-active-collection/src/main/java/**/*,core-it-support/core-it-plugins/maven-it-plugin-artifact/src/main/java/**/*,core-it-support/core-it-plugins/maven-it-plugin-class-loader/dep-a/src/main/java/**/*,core-it-support/core-it-plugins/maven-it-plugin-class-loader/dep-b/src/main/java/**/*,core-it-support/core-it-plugins/maven-it-plugin-class-loader/maven-it-plugin-class-loader/src/main/java/**/*,core-it-support/core-it-plugins/maven-it-plugin-configuration/src/main/java/**/*,core-it-support/core-it-plugins/maven-it-plugin-context-passing/src/main/java/**/*,core-it-support/core-it-plugins/maven-it-plugin-core-stubs/maven-clean-plugin/src/main/java/**/*,core-it-support/core-it-plugins/maven-it-plugin-core-stubs/maven-compiler-plugin/src/main/java/**/*,core-it-support/core-it-plugins/maven-it-plugin-core-stubs/maven-deploy-plugin/src/main/java/**/*,core-it-support/core-it-plugins/maven-it-plugin-core-stubs/maven-ear-plugin/src/main/java/**/*,core-it-support/core-it-plugins/maven-it-plugin-core-stubs/maven-ejb-plugin/src/main/java/**/*,core-it-support/core-it-plugins/maven-it-plugin-core-stubs/maven-install-plugin/src/main/java/**/*,core-it-support/core-it-plugins/maven-it-plugin-core-stubs/maven-jar-plugin/src/main/java/**/*,core-it-support/core-it-plugins/maven-it-plugin-core-stubs/maven-javadoc-plugin/src/main/java/**/*,core-it-support/core-it-plugins/maven-it-plugin-core-stubs/maven-plugin-plugin/src/main/java/**/*,core-it-support/core-it-plugins/maven-it-plugin-core-stubs/maven-rar-plugin/src/main/java/**/*,core-it-support/core-it-plugins/maven-it-plugin-core-stubs/maven-resources-plugin/src/main/java/**/*,core-it-support/core-it-plugins/maven-it-plugin-core-stubs/maven-site-plugin/src/main/java/**/*,core-it-support/core-it-plugins/maven-it-plugin-core-stubs/maven-source-plugin/src/main/java/**/*,core-it-support/core-it-plugins/maven-it-plugin-core-stubs/maven-surefire-plugin/src/main/java/**/*,core-it-support/core-it-plugins/maven-it-plugin-core-stubs/maven-war-plugin/src/main/java/**/*,core-it-support/core-it-plugins/maven-it-plugin-dependency-collection/src/main/java/**/*,core-it-support/core-it-plugins/maven-it-plugin-dependency-resolution/src/main/java/**/*,core-it-support/core-it-plugins/maven-it-plugin-expression/src/main/java/**/*,core-it-support/core-it-plugins/maven-it-plugin-error/src/main/java/**/*,core-it-support/core-it-component/src/main/java/**/*,core-it-support/core-it-plugins/maven-it-plugin-extension-consumer/src/main/java/**/*,core-it-support/core-it-plugins/maven-it-plugin-extension-provider/src/main/java/**/*,core-it-support/core-it-plugins/maven-it-plugin-fork/src/main/java/**/*,core-it-support/core-it-plugins/maven-it-plugin-invalid-descriptor/src/main/java/**/*,core-it-support/core-it-plugins/maven-it-plugin-log-file/src/main/java/**/*,core-it-support/maven-it-helper/src/main/java/**/*,core-it-support/core-it-plugins/maven-it-plugin-model-interpolation/src/main/java/**/*,core-it-support/core-it-plugins/maven-it-plugin-no-default-comp/src/main/java/**/*,core-it-support/core-it-plugins/maven-it-plugin-no-project/src/main/java/**/*,core-it-support/core-it-plugins/maven-it-plugin-online/src/main/java/**/*,core-it-support/core-it-plugins/maven-it-plugin-optional-mojos/src/main/java/**/*,core-it-support/core-it-plugins/maven-it-plugin-packaging/src/main/java/**/*,core-it-support/core-it-plugins/maven-it-plugin-parameter-implementation/src/main/java/**/*,core-it-support/core-it-plugins/maven-it-plugin-plugin-dependency/src/main/java/**/*,core-it-support/core-it-plugins/maven-it-plugin-project/src/main/java/**/*,core-it-support/core-it-plugins/maven-it-plugin-project-interpolation/src/main/java/**/*,core-it-support/core-it-plugins/maven-it-plugin-setter/src/main/java/**/*,core-it-support/core-it-plugins/maven-it-plugin-singleton-component/src/main/java/**/*,core-it-support/core-it-plugins/maven-it-plugin-site/src/main/java/**/*,core-it-support/core-it-plugins/maven-it-plugin-toolchain/src/main/java/**/*,core-it-support/core-it-plugins/maven-it-plugin-touch/src/main/java/**/*,core-it-support/core-it-plugins/maven-it-plugin-uses-properties/src/main/java/**/*,core-it-support/core-it-plugins/maven-it-plugin-uses-wagon/src/main/java/**/*,core-it-support/core-it-plugins/maven-it-plugin-all/src/main/java/**/*,core-it-support/core-it-plugins/maven-it-plugin-plexus-utils-11/src/main/java/**/*,core-it-support/core-it-plugins/maven-it-plugin-plexus-utils-new/src/main/java/**/*,core-it-support/core-it-plugins/maven-it-plugin-plexus-component-api/src/main/java/**/*,core-it-support/core-it-plugins/maven-it-plugin-log4j/src/main/java/**/*,core-it-support/core-it-plugins/maven-it-plugin-extension1/src/main/java/**/*,core-it-support/core-it-plugins/maven-it-plugin-extension2/src/main/java/**/*,core-it-support/core-it-plugins/maven-it-plugin-plexus-lifecycle/src/main/java/**/*,core-it-support/core-it-plugins/maven-it-plugin-settings/src/main/java/**/*,core-it-support/core-it-plugins/mng5805-plugin/src/main/java/**/*,core-it-support/core-it-plugins/mng5805-plugin-dep/src/main/java/**/*,core-it-support/core-it-plugins/mng5958-extension/src/main/java/**/*,core-it-support/core-it-toolchain/src/main/java/**/*,core-it-support/core-it-wagon/src/main/java/**/*' - excludes: null
[TASKS] Found 164 files to scan for tasks
[TASKS] Found 0 open tasks.
Skipping warnings blame since pipelines do not have an SCM link.%n
[withMaven] Publishers: Pipeline Graph Publisher: 31 ms, Generated Artifacts Publisher: 336646 ms, Invoker Publisher: 10 ms, Junit Publisher: 278436 ms, Concordion Publisher: 8 ms, Dependencies Fingerprint Publisher: 2452 ms, Findbugs Publisher: 4 ms, JGiven Publisher: 3 ms, Jacoco Publisher: 4 ms, SpotBugs Publisher: 2 ms, Open Task Scanner Publisher: 11926 ms
[Pipeline] // withMaven
[withMaven] openTasksPublisher - Scan Tasks for Maven artifact org.apache.maven.its.plugins:maven-it-plugin-active-collection:maven-plugin:2.1-SNAPSHOT in source directory core-it-support/core-it-plugins/maven-it-plugin-active-collection/src/main/java
[withMaven] openTasksPublisher - Scan Tasks for Maven artifact org.apache.maven.its.plugins:maven-it-plugin-artifact:maven-plugin:2.1-SNAPSHOT in source directory core-it-support/core-it-plugins/maven-it-plugin-artifact/src/main/java
[withMaven] openTasksPublisher - Scan Tasks for Maven artifact org.apache.maven.its.plugins.class-loader:dep-a:jar:2.1-SNAPSHOT in source directory core-it-support/core-it-plugins/maven-it-plugin-class-loader/dep-a/src/main/java
[withMaven] openTasksPublisher - Scan Tasks for Maven artifact org.apache.maven.its.plugins.class-loader:dep-b:jar:2.1-SNAPSHOT in source directory core-it-support/core-it-plugins/maven-it-plugin-class-loader/dep-b/src/main/java
[withMaven] openTasksPublisher - Scan Tasks for Maven artifact org.apache.maven.its.plugins:maven-it-plugin-class-loader:maven-plugin:2.1-SNAPSHOT in source directory core-it-support/core-it-plugins/maven-it-plugin-class-loader/maven-it-plugin-class-loader/src/main/java
[withMaven] openTasksPublisher - Scan Tasks for Maven artifact org.apache.maven.its.plugins:maven-it-plugin-configuration:maven-plugin:2.1-SNAPSHOT in source directory core-it-support/core-it-plugins/maven-it-plugin-configuration/src/main/java
[withMaven] openTasksPublisher - Scan Tasks for Maven artifact org.apache.maven.its.plugins:maven-it-plugin-context-passing:maven-plugin:2.1-SNAPSHOT in source directory core-it-support/core-it-plugins/maven-it-plugin-context-passing/src/main/java
[withMaven] openTasksPublisher - Scan Tasks for Maven artifact org.apache.maven.plugins:maven-clean-plugin:maven-plugin:0.1-stub-SNAPSHOT in source directory core-it-support/core-it-plugins/maven-it-plugin-core-stubs/maven-clean-plugin/src/main/java
[withMaven] openTasksPublisher - Scan Tasks for Maven artifact org.apache.maven.plugins:maven-compiler-plugin:maven-plugin:0.1-stub-SNAPSHOT in source directory core-it-support/core-it-plugins/maven-it-plugin-core-stubs/maven-compiler-plugin/src/main/java
[withMaven] openTasksPublisher - Scan Tasks for Maven artifact org.apache.maven.plugins:maven-deploy-plugin:maven-plugin:0.1-stub-SNAPSHOT in source directory core-it-support/core-it-plugins/maven-it-plugin-core-stubs/maven-deploy-plugin/src/main/java
[withMaven] openTasksPublisher - Scan Tasks for Maven artifact org.apache.maven.plugins:maven-ear-plugin:maven-plugin:0.1-stub-SNAPSHOT in source directory core-it-support/core-it-plugins/maven-it-plugin-core-stubs/maven-ear-plugin/src/main/java
[withMaven] openTasksPublisher - Scan Tasks for Maven artifact org.apache.maven.plugins:maven-ejb-plugin:maven-plugin:0.1-stub-SNAPSHOT in source directory core-it-support/core-it-plugins/maven-it-plugin-core-stubs/maven-ejb-plugin/src/main/java
[withMaven] openTasksPublisher - Scan Tasks for Maven artifact org.apache.maven.plugins:maven-install-plugin:maven-plugin:0.1-stub-SNAPSHOT in source directory core-it-support/core-it-plugins/maven-it-plugin-core-stubs/maven-install-plugin/src/main/java
[withMaven] openTasksPublisher - Scan Tasks for Maven artifact org.apache.maven.plugins:maven-jar-plugin:maven-plugin:0.1-stub-SNAPSHOT in source directory core-it-support/core-it-plugins/maven-it-plugin-core-stubs/maven-jar-plugin/src/main/java
[withMaven] openTasksPublisher - Scan Tasks for Maven artifact org.apache.maven.plugins:maven-javadoc-plugin:maven-plugin:0.1-stub-SNAPSHOT in source directory core-it-support/core-it-plugins/maven-it-plugin-core-stubs/maven-javadoc-plugin/src/main/java
[withMaven] openTasksPublisher - Scan Tasks for Maven artifact org.apache.maven.plugins:maven-plugin-plugin:maven-plugin:0.1-stub-SNAPSHOT in source directory core-it-support/core-it-plugins/maven-it-plugin-core-stubs/maven-plugin-plugin/src/main/java
[withMaven] openTasksPublisher - Scan Tasks for Maven artifact org.apache.maven.plugins:maven-rar-plugin:maven-plugin:0.1-stub-SNAPSHOT in source directory core-it-support/core-it-plugins/maven-it-plugin-core-stubs/maven-rar-plugin/src/main/java
[withMaven] openTasksPublisher - Scan Tasks for Maven artifact org.apache.maven.plugins:maven-resources-plugin:maven-plugin:0.1-stub-SNAPSHOT in source directory core-it-support/core-it-plugins/maven-it-plugin-core-stubs/maven-resources-plugin/src/main/java
[withMaven] openTasksPublisher - Scan Tasks for Maven artifact org.apache.maven.plugins:maven-site-plugin:maven-plugin:0.1-stub-SNAPSHOT in source directory core-it-support/core-it-plugins/maven-it-plugin-core-stubs/maven-site-plugin/src/main/java
[withMaven] openTasksPublisher - Scan Tasks for Maven artifact org.apache.maven.plugins:maven-source-plugin:maven-plugin:0.1-stub-SNAPSHOT in source directory core-it-support/core-it-plugins/maven-it-plugin-core-stubs/maven-source-plugin/src/main/java
[withMaven] openTasksPublisher - Scan Tasks for Maven artifact org.apache.maven.plugins:maven-surefire-plugin:maven-plugin:0.1-stub-SNAPSHOT in source directory core-it-support/core-it-plugins/maven-it-plugin-core-stubs/maven-surefire-plugin/src/main/java
[withMaven] openTasksPublisher - Scan Tasks for Maven artifact org.apache.maven.plugins:maven-war-plugin:maven-plugin:0.1-stub-SNAPSHOT in source directory core-it-support/core-it-plugins/maven-it-plugin-core-stubs/maven-war-plugin/src/main/java
[withMaven] openTasksPublisher - Scan Tasks for Maven artifact org.apache.maven.its.plugins:maven-it-plugin-dependency-collection:maven-plugin:2.1-SNAPSHOT in source directory core-it-support/core-it-plugins/maven-it-plugin-dependency-collection/src/main/java
[withMaven] openTasksPublisher - Scan Tasks for Maven artifact org.apache.maven.its.plugins:maven-it-plugin-dependency-resolution:maven-plugin:2.1-SNAPSHOT in source directory core-it-support/core-it-plugins/maven-it-plugin-dependency-resolution/src/main/java
[withMaven] openTasksPublisher - Scan Tasks for Maven artifact org.apache.maven.its.plugins:maven-it-plugin-expression:maven-plugin:2.1-SNAPSHOT in source directory core-it-support/core-it-plugins/maven-it-plugin-expression/src/main/java
[withMaven] openTasksPublisher - Scan Tasks for Maven artifact org.apache.maven.its.plugins:maven-it-plugin-error:maven-plugin:2.1-SNAPSHOT in source directory core-it-support/core-it-plugins/maven-it-plugin-error/src/main/java
[withMaven] openTasksPublisher - Scan Tasks for Maven artifact org.apache.maven.its:core-it-component:jar:2.1-SNAPSHOT in source directory core-it-support/core-it-component/src/main/java
[withMaven] openTasksPublisher - Scan Tasks for Maven artifact org.apache.maven.its.plugins:maven-it-plugin-extension-consumer:maven-plugin:2.1-SNAPSHOT in source directory core-it-support/core-it-plugins/maven-it-plugin-extension-consumer/src/main/java
[withMaven] openTasksPublisher - Scan Tasks for Maven artifact org.apache.maven.its.plugins:maven-it-plugin-extension-provider:maven-plugin:2.1-SNAPSHOT in source directory core-it-support/core-it-plugins/maven-it-plugin-extension-provider/src/main/java
[withMaven] openTasksPublisher - Scan Tasks for Maven artifact org.apache.maven.its.plugins:maven-it-plugin-fork:maven-plugin:2.1-SNAPSHOT in source directory core-it-support/core-it-plugins/maven-it-plugin-fork/src/main/java
[withMaven] openTasksPublisher - Scan Tasks for Maven artifact org.apache.maven.its.plugins:maven-it-plugin-invalid-descriptor:maven-plugin:2.1-SNAPSHOT in source directory core-it-support/core-it-plugins/maven-it-plugin-invalid-descriptor/src/main/java
[withMaven] openTasksPublisher - Scan Tasks for Maven artifact org.apache.maven.its.plugins:maven-it-plugin-log-file:maven-plugin:2.1-SNAPSHOT in source directory core-it-support/core-it-plugins/maven-it-plugin-log-file/src/main/java
[withMaven] openTasksPublisher - Scan Tasks for Maven artifact org.apache.maven.its:maven-it-helper:jar:2.1-SNAPSHOT in source directory core-it-support/maven-it-helper/src/main/java
[withMaven] openTasksPublisher - Scan Tasks for Maven artifact org.apache.maven.its.plugins:maven-it-plugin-model-interpolation:maven-plugin:2.1-SNAPSHOT in source directory core-it-support/core-it-plugins/maven-it-plugin-model-interpolation/src/main/java
[withMaven] openTasksPublisher - Scan Tasks for Maven artifact org.apache.maven.its.plugins:maven-it-plugin-no-default-comp:maven-plugin:2.1-SNAPSHOT in source directory core-it-support/core-it-plugins/maven-it-plugin-no-default-comp/src/main/java
[withMaven] openTasksPublisher - Scan Tasks for Maven artifact org.apache.maven.its.plugins:maven-it-plugin-no-project:maven-plugin:2.1-SNAPSHOT in source directory core-it-support/core-it-plugins/maven-it-plugin-no-project/src/main/java
[withMaven] openTasksPublisher - Scan Tasks for Maven artifact org.apache.maven.its.plugins:maven-it-plugin-online:maven-plugin:2.1-SNAPSHOT in source directory core-it-support/core-it-plugins/maven-it-plugin-online/src/main/java
[withMaven] openTasksPublisher - Scan Tasks for Maven artifact org.apache.maven.its.plugins:maven-it-plugin-optional-mojos:maven-plugin:2.1-SNAPSHOT in source directory core-it-support/core-it-plugins/maven-it-plugin-optional-mojos/src/main/java
[withMaven] openTasksPublisher - Scan Tasks for Maven artifact org.apache.maven.its.plugins:maven-it-plugin-packaging:maven-plugin:2.1-SNAPSHOT in source directory core-it-support/core-it-plugins/maven-it-plugin-packaging/src/main/java
[withMaven] openTasksPublisher - Scan Tasks for Maven artifact org.apache.maven.its.plugins:maven-it-plugin-parameter-implementation:maven-plugin:2.1-SNAPSHOT in source directory core-it-support/core-it-plugins/maven-it-plugin-parameter-implementation/src/main/java
[withMaven] openTasksPublisher - Scan Tasks for Maven artifact org.apache.maven.its.plugins:maven-it-plugin-plugin-dependency:maven-plugin:2.1-SNAPSHOT in source directory core-it-support/core-it-plugins/maven-it-plugin-plugin-dependency/src/main/java
[withMaven] openTasksPublisher - Scan Tasks for Maven artifact org.apache.maven.its.plugins:maven-it-plugin-project:maven-plugin:2.1-SNAPSHOT in source directory core-it-support/core-it-plugins/maven-it-plugin-project/src/main/java
[withMaven] openTasksPublisher - Scan Tasks for Maven artifact org.apache.maven.its.plugins:maven-it-plugin-project-interpolation:maven-plugin:2.1-SNAPSHOT in source directory core-it-support/core-it-plugins/maven-it-plugin-project-interpolation/src/main/java
[withMaven] openTasksPublisher - Scan Tasks for Maven artifact org.apache.maven.its.plugins:maven-it-plugin-setter:maven-plugin:2.1-SNAPSHOT in source directory core-it-support/core-it-plugins/maven-it-plugin-setter/src/main/java
[withMaven] openTasksPublisher - Scan Tasks for Maven artifact org.apache.maven.its.plugins:maven-it-plugin-singleton-component:maven-plugin:2.1-SNAPSHOT in source directory core-it-support/core-it-plugins/maven-it-plugin-singleton-component/src/main/java
[withMaven] openTasksPublisher - Scan Tasks for Maven artifact org.apache.maven.its.plugins:maven-it-plugin-site:maven-plugin:2.1-SNAPSHOT in source directory core-it-support/core-it-plugins/maven-it-plugin-site/src/main/java
[withMaven] openTasksPublisher - Scan Tasks for Maven artifact org.apache.maven.its.plugins:maven-it-plugin-toolchain:maven-plugin:2.1-SNAPSHOT in source directory core-it-support/core-it-plugins/maven-it-plugin-toolchain/src/main/java
[withMaven] openTasksPublisher - Scan Tasks for Maven artifact org.apache.maven.its.plugins:maven-it-plugin-touch:maven-plugin:2.1-SNAPSHOT in source directory core-it-support/core-it-plugins/maven-it-plugin-touch/src/main/java
[withMaven] openTasksPublisher - Scan Tasks for Maven artifact org.apache.maven.its.plugins:maven-it-plugin-uses-properties:maven-plugin:2.1-SNAPSHOT in source directory core-it-support/core-it-plugins/maven-it-plugin-uses-properties/src/main/java
[withMaven] openTasksPublisher - Scan Tasks for Maven artifact org.apache.maven.its.plugins:maven-it-plugin-uses-wagon:maven-plugin:2.1-SNAPSHOT in source directory core-it-support/core-it-plugins/maven-it-plugin-uses-wagon/src/main/java
[withMaven] openTasksPublisher - Scan Tasks for Maven artifact org.apache.maven.its.plugins:maven-it-plugin-all:maven-plugin:2.1-SNAPSHOT in source directory core-it-support/core-it-plugins/maven-it-plugin-all/src/main/java
[withMaven] openTasksPublisher - Scan Tasks for Maven artifact org.apache.maven.its.plugins:maven-it-plugin-plexus-utils-11:maven-plugin:2.1-SNAPSHOT in source directory core-it-support/core-it-plugins/maven-it-plugin-plexus-utils-11/src/main/java
[withMaven] openTasksPublisher - Scan Tasks for Maven artifact org.apache.maven.its.plugins:maven-it-plugin-plexus-utils-new:maven-plugin:2.1-SNAPSHOT in source directory core-it-support/core-it-plugins/maven-it-plugin-plexus-utils-new/src/main/java
[withMaven] openTasksPublisher - Scan Tasks for Maven artifact org.apache.maven.its.plugins:maven-it-plugin-plexus-component-api:maven-plugin:2.1-SNAPSHOT in source directory core-it-support/core-it-plugins/maven-it-plugin-plexus-component-api/src/main/java
[withMaven] openTasksPublisher - Scan Tasks for Maven artifact org.apache.maven.its.plugins:maven-it-plugin-log4j:maven-plugin:2.1-SNAPSHOT in source directory core-it-support/core-it-plugins/maven-it-plugin-log4j/src/main/java
[withMaven] openTasksPublisher - Scan Tasks for Maven artifact org.apache.maven.its.plugins:maven-it-plugin-extension1:maven-plugin:2.1-SNAPSHOT in source directory core-it-support/core-it-plugins/maven-it-plugin-extension1/src/main/java
[withMaven] openTasksPublisher - Scan Tasks for Maven artifact org.apache.maven.its.plugins:maven-it-plugin-extension2:maven-plugin:2.1-SNAPSHOT in source directory core-it-support/core-it-plugins/maven-it-plugin-extension2/src/main/java
[withMaven] openTasksPublisher - Scan Tasks for Maven artifact org.apache.maven.its.plugins:maven-it-plugin-plexus-lifecycle:maven-plugin:2.1-SNAPSHOT in source directory core-it-support/core-it-plugins/maven-it-plugin-plexus-lifecycle/src/main/java
[withMaven] openTasksPublisher - Scan Tasks for Maven artifact org.apache.maven.its.plugins:maven-it-plugin-settings:maven-plugin:2.1-SNAPSHOT in source directory core-it-support/core-it-plugins/maven-it-plugin-settings/src/main/java
[withMaven] openTasksPublisher - Scan Tasks for Maven artifact org.apache.maven.its.plugins:mng-5805-pkg-type-mojo-configuration-plugin:maven-plugin:2.1-SNAPSHOT in source directory core-it-support/core-it-plugins/mng5805-plugin/src/main/java
[withMaven] openTasksPublisher - Scan Tasks for Maven artifact org.apache.maven.its.plugins:mng-5805-pkg-type-mojo-configuration-plugin-dep:jar:2.1-SNAPSHOT in source directory core-it-support/core-it-plugins/mng5805-plugin-dep/src/main/java
[withMaven] openTasksPublisher - Scan Tasks for Maven artifact org.apache.maven.its.plugins:mng-5958-pkg-type-extension:jar:2.1-SNAPSHOT in source directory core-it-support/core-it-plugins/mng5958-extension/src/main/java
[withMaven] openTasksPublisher - Scan Tasks for Maven artifact org.apache.maven.its:core-it-toolchain:jar:2.1-SNAPSHOT in source directory core-it-support/core-it-toolchain/src/main/java
[withMaven] openTasksPublisher - Scan Tasks for Maven artifact org.apache.maven.its:core-it-wagon:jar:2.1-SNAPSHOT in source directory core-it-support/core-it-wagon/src/main/java
[TASKS] Scanning folder '/home/jenkins/jenkins-slave/workspace/box_maven_jenkins-buld-error-wip/test' for files matching the pattern 'core-it-support/core-it-plugins/maven-it-plugin-active-collection/src/main/java/**/*,core-it-support/core-it-plugins/maven-it-plugin-artifact/src/main/java/**/*,core-it-support/core-it-plugins/maven-it-plugin-class-loader/dep-a/src/main/java/**/*,core-it-support/core-it-plugins/maven-it-plugin-class-loader/dep-b/src/main/java/**/*,core-it-support/core-it-plugins/maven-it-plugin-class-loader/maven-it-plugin-class-loader/src/main/java/**/*,core-it-support/core-it-plugins/maven-it-plugin-configuration/src/main/java/**/*,core-it-support/core-it-plugins/maven-it-plugin-context-passing/src/main/java/**/*,core-it-support/core-it-plugins/maven-it-plugin-core-stubs/maven-clean-plugin/src/main/java/**/*,core-it-support/core-it-plugins/maven-it-plugin-core-stubs/maven-compiler-plugin/src/main/java/**/*,core-it-support/core-it-plugins/maven-it-plugin-core-stubs/maven-deploy-plugin/src/main/java/**/*,core-it-support/core-it-plugins/maven-it-plugin-core-stubs/maven-ear-plugin/src/main/java/**/*,core-it-support/core-it-plugins/maven-it-plugin-core-stubs/maven-ejb-plugin/src/main/java/**/*,core-it-support/core-it-plugins/maven-it-plugin-core-stubs/maven-install-plugin/src/main/java/**/*,core-it-support/core-it-plugins/maven-it-plugin-core-stubs/maven-jar-plugin/src/main/java/**/*,core-it-support/core-it-plugins/maven-it-plugin-core-stubs/maven-javadoc-plugin/src/main/java/**/*,core-it-support/core-it-plugins/maven-it-plugin-core-stubs/maven-plugin-plugin/src/main/java/**/*,core-it-support/core-it-plugins/maven-it-plugin-core-stubs/maven-rar-plugin/src/main/java/**/*,core-it-support/core-it-plugins/maven-it-plugin-core-stubs/maven-resources-plugin/src/main/java/**/*,core-it-support/core-it-plugins/maven-it-plugin-core-stubs/maven-site-plugin/src/main/java/**/*,core-it-support/core-it-plugins/maven-it-plugin-core-stubs/maven-source-plugin/src/main/java/**/*,core-it-support/core-it-plugins/maven-it-plugin-core-stubs/maven-surefire-plugin/src/main/java/**/*,core-it-support/core-it-plugins/maven-it-plugin-core-stubs/maven-war-plugin/src/main/java/**/*,core-it-support/core-it-plugins/maven-it-plugin-dependency-collection/src/main/java/**/*,core-it-support/core-it-plugins/maven-it-plugin-dependency-resolution/src/main/java/**/*,core-it-support/core-it-plugins/maven-it-plugin-expression/src/main/java/**/*,core-it-support/core-it-plugins/maven-it-plugin-error/src/main/java/**/*,core-it-support/core-it-component/src/main/java/**/*,core-it-support/core-it-plugins/maven-it-plugin-extension-consumer/src/main/java/**/*,core-it-support/core-it-plugins/maven-it-plugin-extension-provider/src/main/java/**/*,core-it-support/core-it-plugins/maven-it-plugin-fork/src/main/java/**/*,core-it-support/core-it-plugins/maven-it-plugin-invalid-descriptor/src/main/java/**/*,core-it-support/core-it-plugins/maven-it-plugin-log-file/src/main/java/**/*,core-it-support/maven-it-helper/src/main/java/**/*,core-it-support/core-it-plugins/maven-it-plugin-model-interpolation/src/main/java/**/*,core-it-support/core-it-plugins/maven-it-plugin-no-default-comp/src/main/java/**/*,core-it-support/core-it-plugins/maven-it-plugin-no-project/src/main/java/**/*,core-it-support/core-it-plugins/maven-it-plugin-online/src/main/java/**/*,core-it-support/core-it-plugins/maven-it-plugin-optional-mojos/src/main/java/**/*,core-it-support/core-it-plugins/maven-it-plugin-packaging/src/main/java/**/*,core-it-support/core-it-plugins/maven-it-plugin-parameter-implementation/src/main/java/**/*,core-it-support/core-it-plugins/maven-it-plugin-plugin-dependency/src/main/java/**/*,core-it-support/core-it-plugins/maven-it-plugin-project/src/main/java/**/*,core-it-support/core-it-plugins/maven-it-plugin-project-interpolation/src/main/java/**/*,core-it-support/core-it-plugins/maven-it-plugin-setter/src/main/java/**/*,core-it-support/core-it-plugins/maven-it-plugin-singleton-component/src/main/java/**/*,core-it-support/core-it-plugins/maven-it-plugin-site/src/main/java/**/*,core-it-support/core-it-plugins/maven-it-plugin-toolchain/src/main/java/**/*,core-it-support/core-it-plugins/maven-it-plugin-touch/src/main/java/**/*,core-it-support/core-it-plugins/maven-it-plugin-uses-properties/src/main/java/**/*,core-it-support/core-it-plugins/maven-it-plugin-uses-wagon/src/main/java/**/*,core-it-support/core-it-plugins/maven-it-plugin-all/src/main/java/**/*,core-it-support/core-it-plugins/maven-it-plugin-plexus-utils-11/src/main/java/**/*,core-it-support/core-it-plugins/maven-it-plugin-plexus-utils-new/src/main/java/**/*,core-it-support/core-it-plugins/maven-it-plugin-plexus-component-api/src/main/java/**/*,core-it-support/core-it-plugins/maven-it-plugin-log4j/src/main/java/**/*,core-it-support/core-it-plugins/maven-it-plugin-extension1/src/main/java/**/*,core-it-support/core-it-plugins/maven-it-plugin-extension2/src/main/java/**/*,core-it-support/core-it-plugins/maven-it-plugin-plexus-lifecycle/src/main/java/**/*,core-it-support/core-it-plugins/maven-it-plugin-settings/src/main/java/**/*,core-it-support/core-it-plugins/mng5805-plugin/src/main/java/**/*,core-it-support/core-it-plugins/mng5805-plugin-dep/src/main/java/**/*,core-it-support/core-it-plugins/mng5958-extension/src/main/java/**/*,core-it-support/core-it-toolchain/src/main/java/**/*,core-it-support/core-it-wagon/src/main/java/**/*' - excludes: null
[TASKS] Found 164 files to scan for tasks
[TASKS] Found 0 open tasks.
Skipping warnings blame since pipelines do not have an SCM link.%n
[withMaven] Publishers: Pipeline Graph Publisher: 32 ms, Generated Artifacts Publisher: 59854 ms, Invoker Publisher: 10 ms, Junit Publisher: 554780 ms, Concordion Publisher: 9 ms, Dependencies Fingerprint Publisher: 2469 ms, Findbugs Publisher: 4 ms, JGiven Publisher: 3 ms, Jacoco Publisher: 4 ms, SpotBugs Publisher: 4 ms, Open Task Scanner Publisher: 11888 ms
[Pipeline] deleteDir
[Pipeline] // withMaven
[Pipeline] deleteDir
[Pipeline] }
[Pipeline] // dir
[Pipeline] }
[Pipeline] // stage
[Pipeline] }
[Pipeline] // node
[Pipeline] }
[Pipeline] }
[Pipeline] // dir
[Pipeline] }
[Pipeline] // stage
[Pipeline] }
[Pipeline] // node
[Pipeline] }
[withMaven] openTasksPublisher - Scan Tasks for Maven artifact org.apache.maven.its.plugins:maven-it-plugin-active-collection:maven-plugin:2.1-SNAPSHOT in source directory core-it-support/core-it-plugins/maven-it-plugin-active-collection/src/main/java
[withMaven] openTasksPublisher - Scan Tasks for Maven artifact org.apache.maven.its.plugins:maven-it-plugin-artifact:maven-plugin:2.1-SNAPSHOT in source directory core-it-support/core-it-plugins/maven-it-plugin-artifact/src/main/java
[withMaven] openTasksPublisher - Scan Tasks for Maven artifact org.apache.maven.its.plugins.class-loader:dep-a:jar:2.1-SNAPSHOT in source directory core-it-support/core-it-plugins/maven-it-plugin-class-loader/dep-a/src/main/java
[withMaven] openTasksPublisher - Scan Tasks for Maven artifact org.apache.maven.its.plugins.class-loader:dep-b:jar:2.1-SNAPSHOT in source directory core-it-support/core-it-plugins/maven-it-plugin-class-loader/dep-b/src/main/java
[withMaven] openTasksPublisher - Scan Tasks for Maven artifact org.apache.maven.its.plugins:maven-it-plugin-class-loader:maven-plugin:2.1-SNAPSHOT in source directory core-it-support/core-it-plugins/maven-it-plugin-class-loader/maven-it-plugin-class-loader/src/main/java
[withMaven] openTasksPublisher - Scan Tasks for Maven artifact org.apache.maven.its.plugins:maven-it-plugin-configuration:maven-plugin:2.1-SNAPSHOT in source directory core-it-support/core-it-plugins/maven-it-plugin-configuration/src/main/java
[withMaven] openTasksPublisher - Scan Tasks for Maven artifact org.apache.maven.its.plugins:maven-it-plugin-context-passing:maven-plugin:2.1-SNAPSHOT in source directory core-it-support/core-it-plugins/maven-it-plugin-context-passing/src/main/java
[withMaven] openTasksPublisher - Scan Tasks for Maven artifact org.apache.maven.plugins:maven-clean-plugin:maven-plugin:0.1-stub-SNAPSHOT in source directory core-it-support/core-it-plugins/maven-it-plugin-core-stubs/maven-clean-plugin/src/main/java
[withMaven] openTasksPublisher - Scan Tasks for Maven artifact org.apache.maven.plugins:maven-compiler-plugin:maven-plugin:0.1-stub-SNAPSHOT in source directory core-it-support/core-it-plugins/maven-it-plugin-core-stubs/maven-compiler-plugin/src/main/java
[withMaven] openTasksPublisher - Scan Tasks for Maven artifact org.apache.maven.plugins:maven-deploy-plugin:maven-plugin:0.1-stub-SNAPSHOT in source directory core-it-support/core-it-plugins/maven-it-plugin-core-stubs/maven-deploy-plugin/src/main/java
[withMaven] openTasksPublisher - Scan Tasks for Maven artifact org.apache.maven.plugins:maven-ear-plugin:maven-plugin:0.1-stub-SNAPSHOT in source directory core-it-support/core-it-plugins/maven-it-plugin-core-stubs/maven-ear-plugin/src/main/java
[withMaven] openTasksPublisher - Scan Tasks for Maven artifact org.apache.maven.plugins:maven-ejb-plugin:maven-plugin:0.1-stub-SNAPSHOT in source directory core-it-support/core-it-plugins/maven-it-plugin-core-stubs/maven-ejb-plugin/src/main/java
[withMaven] openTasksPublisher - Scan Tasks for Maven artifact org.apache.maven.plugins:maven-install-plugin:maven-plugin:0.1-stub-SNAPSHOT in source directory core-it-support/core-it-plugins/maven-it-plugin-core-stubs/maven-install-plugin/src/main/java
[withMaven] openTasksPublisher - Scan Tasks for Maven artifact org.apache.maven.plugins:maven-jar-plugin:maven-plugin:0.1-stub-SNAPSHOT in source directory core-it-support/core-it-plugins/maven-it-plugin-core-stubs/maven-jar-plugin/src/main/java
[withMaven] openTasksPublisher - Scan Tasks for Maven artifact org.apache.maven.plugins:maven-javadoc-plugin:maven-plugin:0.1-stub-SNAPSHOT in source directory core-it-support/core-it-plugins/maven-it-plugin-core-stubs/maven-javadoc-plugin/src/main/java
[withMaven] openTasksPublisher - Scan Tasks for Maven artifact org.apache.maven.plugins:maven-plugin-plugin:maven-plugin:0.1-stub-SNAPSHOT in source directory core-it-support/core-it-plugins/maven-it-plugin-core-stubs/maven-plugin-plugin/src/main/java
[withMaven] openTasksPublisher - Scan Tasks for Maven artifact org.apache.maven.plugins:maven-rar-plugin:maven-plugin:0.1-stub-SNAPSHOT in source directory core-it-support/core-it-plugins/maven-it-plugin-core-stubs/maven-rar-plugin/src/main/java
[withMaven] openTasksPublisher - Scan Tasks for Maven artifact org.apache.maven.plugins:maven-resources-plugin:maven-plugin:0.1-stub-SNAPSHOT in source directory core-it-support/core-it-plugins/maven-it-plugin-core-stubs/maven-resources-plugin/src/main/java
[withMaven] openTasksPublisher - Scan Tasks for Maven artifact org.apache.maven.plugins:maven-site-plugin:maven-plugin:0.1-stub-SNAPSHOT in source directory core-it-support/core-it-plugins/maven-it-plugin-core-stubs/maven-site-plugin/src/main/java
[withMaven] openTasksPublisher - Scan Tasks for Maven artifact org.apache.maven.plugins:maven-source-plugin:maven-plugin:0.1-stub-SNAPSHOT in source directory core-it-support/core-it-plugins/maven-it-plugin-core-stubs/maven-source-plugin/src/main/java
[withMaven] openTasksPublisher - Scan Tasks for Maven artifact org.apache.maven.plugins:maven-surefire-plugin:maven-plugin:0.1-stub-SNAPSHOT in source directory core-it-support/core-it-plugins/maven-it-plugin-core-stubs/maven-surefire-plugin/src/main/java
[withMaven] openTasksPublisher - Scan Tasks for Maven artifact org.apache.maven.plugins:maven-war-plugin:maven-plugin:0.1-stub-SNAPSHOT in source directory core-it-support/core-it-plugins/maven-it-plugin-core-stubs/maven-war-plugin/src/main/java
[withMaven] openTasksPublisher - Scan Tasks for Maven artifact org.apache.maven.its.plugins:maven-it-plugin-dependency-collection:maven-plugin:2.1-SNAPSHOT in source directory core-it-support/core-it-plugins/maven-it-plugin-dependency-collection/src/main/java
[withMaven] openTasksPublisher - Scan Tasks for Maven artifact org.apache.maven.its.plugins:maven-it-plugin-dependency-resolution:maven-plugin:2.1-SNAPSHOT in source directory core-it-support/core-it-plugins/maven-it-plugin-dependency-resolution/src/main/java
[withMaven] openTasksPublisher - Scan Tasks for Maven artifact org.apache.maven.its.plugins:maven-it-plugin-expression:maven-plugin:2.1-SNAPSHOT in source directory core-it-support/core-it-plugins/maven-it-plugin-expression/src/main/java
[withMaven] openTasksPublisher - Scan Tasks for Maven artifact org.apache.maven.its.plugins:maven-it-plugin-error:maven-plugin:2.1-SNAPSHOT in source directory core-it-support/core-it-plugins/maven-it-plugin-error/src/main/java
[withMaven] openTasksPublisher - Scan Tasks for Maven artifact org.apache.maven.its:core-it-component:jar:2.1-SNAPSHOT in source directory core-it-support/core-it-component/src/main/java
[withMaven] openTasksPublisher - Scan Tasks for Maven artifact org.apache.maven.its.plugins:maven-it-plugin-extension-consumer:maven-plugin:2.1-SNAPSHOT in source directory core-it-support/core-it-plugins/maven-it-plugin-extension-consumer/src/main/java
[withMaven] openTasksPublisher - Scan Tasks for Maven artifact org.apache.maven.its.plugins:maven-it-plugin-extension-provider:maven-plugin:2.1-SNAPSHOT in source directory core-it-support/core-it-plugins/maven-it-plugin-extension-provider/src/main/java
[withMaven] openTasksPublisher - Scan Tasks for Maven artifact org.apache.maven.its.plugins:maven-it-plugin-fork:maven-plugin:2.1-SNAPSHOT in source directory core-it-support/core-it-plugins/maven-it-plugin-fork/src/main/java
[withMaven] openTasksPublisher - Scan Tasks for Maven artifact org.apache.maven.its.plugins:maven-it-plugin-invalid-descriptor:maven-plugin:2.1-SNAPSHOT in source directory core-it-support/core-it-plugins/maven-it-plugin-invalid-descriptor/src/main/java
[withMaven] openTasksPublisher - Scan Tasks for Maven artifact org.apache.maven.its.plugins:maven-it-plugin-log-file:maven-plugin:2.1-SNAPSHOT in source directory core-it-support/core-it-plugins/maven-it-plugin-log-file/src/main/java
[withMaven] openTasksPublisher - Scan Tasks for Maven artifact org.apache.maven.its:maven-it-helper:jar:2.1-SNAPSHOT in source directory core-it-support/maven-it-helper/src/main/java
[withMaven] openTasksPublisher - Scan Tasks for Maven artifact org.apache.maven.its.plugins:maven-it-plugin-model-interpolation:maven-plugin:2.1-SNAPSHOT in source directory core-it-support/core-it-plugins/maven-it-plugin-model-interpolation/src/main/java
[withMaven] openTasksPublisher - Scan Tasks for Maven artifact org.apache.maven.its.plugins:maven-it-plugin-no-default-comp:maven-plugin:2.1-SNAPSHOT in source directory core-it-support/core-it-plugins/maven-it-plugin-no-default-comp/src/main/java
[withMaven] openTasksPublisher - Scan Tasks for Maven artifact org.apache.maven.its.plugins:maven-it-plugin-no-project:maven-plugin:2.1-SNAPSHOT in source directory core-it-support/core-it-plugins/maven-it-plugin-no-project/src/main/java
[withMaven] openTasksPublisher - Scan Tasks for Maven artifact org.apache.maven.its.plugins:maven-it-plugin-online:maven-plugin:2.1-SNAPSHOT in source directory core-it-support/core-it-plugins/maven-it-plugin-online/src/main/java
[withMaven] openTasksPublisher - Scan Tasks for Maven artifact org.apache.maven.its.plugins:maven-it-plugin-optional-mojos:maven-plugin:2.1-SNAPSHOT in source directory core-it-support/core-it-plugins/maven-it-plugin-optional-mojos/src/main/java
[withMaven] openTasksPublisher - Scan Tasks for Maven artifact org.apache.maven.its.plugins:maven-it-plugin-packaging:maven-plugin:2.1-SNAPSHOT in source directory core-it-support/core-it-plugins/maven-it-plugin-packaging/src/main/java
[withMaven] openTasksPublisher - Scan Tasks for Maven artifact org.apache.maven.its.plugins:maven-it-plugin-parameter-implementation:maven-plugin:2.1-SNAPSHOT in source directory core-it-support/core-it-plugins/maven-it-plugin-parameter-implementation/src/main/java
[withMaven] openTasksPublisher - Scan Tasks for Maven artifact org.apache.maven.its.plugins:maven-it-plugin-plugin-dependency:maven-plugin:2.1-SNAPSHOT in source directory core-it-support/core-it-plugins/maven-it-plugin-plugin-dependency/src/main/java
[withMaven] openTasksPublisher - Scan Tasks for Maven artifact org.apache.maven.its.plugins:maven-it-plugin-project:maven-plugin:2.1-SNAPSHOT in source directory core-it-support/core-it-plugins/maven-it-plugin-project/src/main/java
[withMaven] openTasksPublisher - Scan Tasks for Maven artifact org.apache.maven.its.plugins:maven-it-plugin-project-interpolation:maven-plugin:2.1-SNAPSHOT in source directory core-it-support/core-it-plugins/maven-it-plugin-project-interpolation/src/main/java
[withMaven] openTasksPublisher - Scan Tasks for Maven artifact org.apache.maven.its.plugins:maven-it-plugin-setter:maven-plugin:2.1-SNAPSHOT in source directory core-it-support/core-it-plugins/maven-it-plugin-setter/src/main/java
[withMaven] openTasksPublisher - Scan Tasks for Maven artifact org.apache.maven.its.plugins:maven-it-plugin-singleton-component:maven-plugin:2.1-SNAPSHOT in source directory core-it-support/core-it-plugins/maven-it-plugin-singleton-component/src/main/java
[withMaven] openTasksPublisher - Scan Tasks for Maven artifact org.apache.maven.its.plugins:maven-it-plugin-site:maven-plugin:2.1-SNAPSHOT in source directory core-it-support/core-it-plugins/maven-it-plugin-site/src/main/java
[withMaven] openTasksPublisher - Scan Tasks for Maven artifact org.apache.maven.its.plugins:maven-it-plugin-toolchain:maven-plugin:2.1-SNAPSHOT in source directory core-it-support/core-it-plugins/maven-it-plugin-toolchain/src/main/java
[withMaven] openTasksPublisher - Scan Tasks for Maven artifact org.apache.maven.its.plugins:maven-it-plugin-touch:maven-plugin:2.1-SNAPSHOT in source directory core-it-support/core-it-plugins/maven-it-plugin-touch/src/main/java
[withMaven] openTasksPublisher - Scan Tasks for Maven artifact org.apache.maven.its.plugins:maven-it-plugin-uses-properties:maven-plugin:2.1-SNAPSHOT in source directory core-it-support/core-it-plugins/maven-it-plugin-uses-properties/src/main/java
[withMaven] openTasksPublisher - Scan Tasks for Maven artifact org.apache.maven.its.plugins:maven-it-plugin-uses-wagon:maven-plugin:2.1-SNAPSHOT in source directory core-it-support/core-it-plugins/maven-it-plugin-uses-wagon/src/main/java
[withMaven] openTasksPublisher - Scan Tasks for Maven artifact org.apache.maven.its.plugins:maven-it-plugin-all:maven-plugin:2.1-SNAPSHOT in source directory core-it-support/core-it-plugins/maven-it-plugin-all/src/main/java
[withMaven] openTasksPublisher - Scan Tasks for Maven artifact org.apache.maven.its.plugins:maven-it-plugin-plexus-utils-11:maven-plugin:2.1-SNAPSHOT in source directory core-it-support/core-it-plugins/maven-it-plugin-plexus-utils-11/src/main/java
[withMaven] openTasksPublisher - Scan Tasks for Maven artifact org.apache.maven.its.plugins:maven-it-plugin-plexus-utils-new:maven-plugin:2.1-SNAPSHOT in source directory core-it-support/core-it-plugins/maven-it-plugin-plexus-utils-new/src/main/java
[withMaven] openTasksPublisher - Scan Tasks for Maven artifact org.apache.maven.its.plugins:maven-it-plugin-plexus-component-api:maven-plugin:2.1-SNAPSHOT in source directory core-it-support/core-it-plugins/maven-it-plugin-plexus-component-api/src/main/java
[withMaven] openTasksPublisher - Scan Tasks for Maven artifact org.apache.maven.its.plugins:maven-it-plugin-log4j:maven-plugin:2.1-SNAPSHOT in source directory core-it-support/core-it-plugins/maven-it-plugin-log4j/src/main/java
[withMaven] openTasksPublisher - Scan Tasks for Maven artifact org.apache.maven.its.plugins:maven-it-plugin-extension1:maven-plugin:2.1-SNAPSHOT in source directory core-it-support/core-it-plugins/maven-it-plugin-extension1/src/main/java
[withMaven] openTasksPublisher - Scan Tasks for Maven artifact org.apache.maven.its.plugins:maven-it-plugin-extension2:maven-plugin:2.1-SNAPSHOT in source directory core-it-support/core-it-plugins/maven-it-plugin-extension2/src/main/java
[withMaven] openTasksPublisher - Scan Tasks for Maven artifact org.apache.maven.its.plugins:maven-it-plugin-plexus-lifecycle:maven-plugin:2.1-SNAPSHOT in source directory core-it-support/core-it-plugins/maven-it-plugin-plexus-lifecycle/src/main/java
[withMaven] openTasksPublisher - Scan Tasks for Maven artifact org.apache.maven.its.plugins:maven-it-plugin-settings:maven-plugin:2.1-SNAPSHOT in source directory core-it-support/core-it-plugins/maven-it-plugin-settings/src/main/java
[withMaven] openTasksPublisher - Scan Tasks for Maven artifact org.apache.maven.its.plugins:mng-5805-pkg-type-mojo-configuration-plugin:maven-plugin:2.1-SNAPSHOT in source directory core-it-support/core-it-plugins/mng5805-plugin/src/main/java
[withMaven] openTasksPublisher - Scan Tasks for Maven artifact org.apache.maven.its.plugins:mng-5805-pkg-type-mojo-configuration-plugin-dep:jar:2.1-SNAPSHOT in source directory core-it-support/core-it-plugins/mng5805-plugin-dep/src/main/java
[withMaven] openTasksPublisher - Scan Tasks for Maven artifact org.apache.maven.its.plugins:mng-5958-pkg-type-extension:jar:2.1-SNAPSHOT in source directory core-it-support/core-it-plugins/mng5958-extension/src/main/java
[withMaven] openTasksPublisher - Scan Tasks for Maven artifact org.apache.maven.its:core-it-toolchain:jar:2.1-SNAPSHOT in source directory core-it-support/core-it-toolchain/src/main/java
[withMaven] openTasksPublisher - Scan Tasks for Maven artifact org.apache.maven.its:core-it-wagon:jar:2.1-SNAPSHOT in source directory core-it-support/core-it-wagon/src/main/java
[TASKS] Scanning folder '/home/jenkins/jenkins-slave/workspace/box_maven_jenkins-buld-error-wip/test' for files matching the pattern 'core-it-support/core-it-plugins/maven-it-plugin-active-collection/src/main/java/**/*,core-it-support/core-it-plugins/maven-it-plugin-artifact/src/main/java/**/*,core-it-support/core-it-plugins/maven-it-plugin-class-loader/dep-a/src/main/java/**/*,core-it-support/core-it-plugins/maven-it-plugin-class-loader/dep-b/src/main/java/**/*,core-it-support/core-it-plugins/maven-it-plugin-class-loader/maven-it-plugin-class-loader/src/main/java/**/*,core-it-support/core-it-plugins/maven-it-plugin-configuration/src/main/java/**/*,core-it-support/core-it-plugins/maven-it-plugin-context-passing/src/main/java/**/*,core-it-support/core-it-plugins/maven-it-plugin-core-stubs/maven-clean-plugin/src/main/java/**/*,core-it-support/core-it-plugins/maven-it-plugin-core-stubs/maven-compiler-plugin/src/main/java/**/*,core-it-support/core-it-plugins/maven-it-plugin-core-stubs/maven-deploy-plugin/src/main/java/**/*,core-it-support/core-it-plugins/maven-it-plugin-core-stubs/maven-ear-plugin/src/main/java/**/*,core-it-support/core-it-plugins/maven-it-plugin-core-stubs/maven-ejb-plugin/src/main/java/**/*,core-it-support/core-it-plugins/maven-it-plugin-core-stubs/maven-install-plugin/src/main/java/**/*,core-it-support/core-it-plugins/maven-it-plugin-core-stubs/maven-jar-plugin/src/main/java/**/*,core-it-support/core-it-plugins/maven-it-plugin-core-stubs/maven-javadoc-plugin/src/main/java/**/*,core-it-support/core-it-plugins/maven-it-plugin-core-stubs/maven-plugin-plugin/src/main/java/**/*,core-it-support/core-it-plugins/maven-it-plugin-core-stubs/maven-rar-plugin/src/main/java/**/*,core-it-support/core-it-plugins/maven-it-plugin-core-stubs/maven-resources-plugin/src/main/java/**/*,core-it-support/core-it-plugins/maven-it-plugin-core-stubs/maven-site-plugin/src/main/java/**/*,core-it-support/core-it-plugins/maven-it-plugin-core-stubs/maven-source-plugin/src/main/java/**/*,core-it-support/core-it-plugins/maven-it-plugin-core-stubs/maven-surefire-plugin/src/main/java/**/*,core-it-support/core-it-plugins/maven-it-plugin-core-stubs/maven-war-plugin/src/main/java/**/*,core-it-support/core-it-plugins/maven-it-plugin-dependency-collection/src/main/java/**/*,core-it-support/core-it-plugins/maven-it-plugin-dependency-resolution/src/main/java/**/*,core-it-support/core-it-plugins/maven-it-plugin-expression/src/main/java/**/*,core-it-support/core-it-plugins/maven-it-plugin-error/src/main/java/**/*,core-it-support/core-it-component/src/main/java/**/*,core-it-support/core-it-plugins/maven-it-plugin-extension-consumer/src/main/java/**/*,core-it-support/core-it-plugins/maven-it-plugin-extension-provider/src/main/java/**/*,core-it-support/core-it-plugins/maven-it-plugin-fork/src/main/java/**/*,core-it-support/core-it-plugins/maven-it-plugin-invalid-descriptor/src/main/java/**/*,core-it-support/core-it-plugins/maven-it-plugin-log-file/src/main/java/**/*,core-it-support/maven-it-helper/src/main/java/**/*,core-it-support/core-it-plugins/maven-it-plugin-model-interpolation/src/main/java/**/*,core-it-support/core-it-plugins/maven-it-plugin-no-default-comp/src/main/java/**/*,core-it-support/core-it-plugins/maven-it-plugin-no-project/src/main/java/**/*,core-it-support/core-it-plugins/maven-it-plugin-online/src/main/java/**/*,core-it-support/core-it-plugins/maven-it-plugin-optional-mojos/src/main/java/**/*,core-it-support/core-it-plugins/maven-it-plugin-packaging/src/main/java/**/*,core-it-support/core-it-plugins/maven-it-plugin-parameter-implementation/src/main/java/**/*,core-it-support/core-it-plugins/maven-it-plugin-plugin-dependency/src/main/java/**/*,core-it-support/core-it-plugins/maven-it-plugin-project/src/main/java/**/*,core-it-support/core-it-plugins/maven-it-plugin-project-interpolation/src/main/java/**/*,core-it-support/core-it-plugins/maven-it-plugin-setter/src/main/java/**/*,core-it-support/core-it-plugins/maven-it-plugin-singleton-component/src/main/java/**/*,core-it-support/core-it-plugins/maven-it-plugin-site/src/main/java/**/*,core-it-support/core-it-plugins/maven-it-plugin-toolchain/src/main/java/**/*,core-it-support/core-it-plugins/maven-it-plugin-touch/src/main/java/**/*,core-it-support/core-it-plugins/maven-it-plugin-uses-properties/src/main/java/**/*,core-it-support/core-it-plugins/maven-it-plugin-uses-wagon/src/main/java/**/*,core-it-support/core-it-plugins/maven-it-plugin-all/src/main/java/**/*,core-it-support/core-it-plugins/maven-it-plugin-plexus-utils-11/src/main/java/**/*,core-it-support/core-it-plugins/maven-it-plugin-plexus-utils-new/src/main/java/**/*,core-it-support/core-it-plugins/maven-it-plugin-plexus-component-api/src/main/java/**/*,core-it-support/core-it-plugins/maven-it-plugin-log4j/src/main/java/**/*,core-it-support/core-it-plugins/maven-it-plugin-extension1/src/main/java/**/*,core-it-support/core-it-plugins/maven-it-plugin-extension2/src/main/java/**/*,core-it-support/core-it-plugins/maven-it-plugin-plexus-lifecycle/src/main/java/**/*,core-it-support/core-it-plugins/maven-it-plugin-settings/src/main/java/**/*,core-it-support/core-it-plugins/mng5805-plugin/src/main/java/**/*,core-it-support/core-it-plugins/mng5805-plugin-dep/src/main/java/**/*,core-it-support/core-it-plugins/mng5958-extension/src/main/java/**/*,core-it-support/core-it-toolchain/src/main/java/**/*,core-it-support/core-it-wagon/src/main/java/**/*' - excludes: null
[TASKS] Found 164 files to scan for tasks
[TASKS] Found 0 open tasks.
Skipping warnings blame since pipelines do not have an SCM link.%n
[withMaven] Publishers: Pipeline Graph Publisher: 27 ms, Generated Artifacts Publisher: 311530 ms, Invoker Publisher: 10 ms, Junit Publisher: 838496 ms, Concordion Publisher: 16 ms, Dependencies Fingerprint Publisher: 2492 ms, Findbugs Publisher: 4 ms, JGiven Publisher: 3 ms, Jacoco Publisher: 4 ms, SpotBugs Publisher: 4 ms, Open Task Scanner Publisher: 12551 ms
[Pipeline] // withMaven
[Pipeline] deleteDir
[Pipeline] }
[Pipeline] // dir
[Pipeline] }
[Pipeline] // stage
[Pipeline] }
[Pipeline] // node
[Pipeline] }
[Pipeline] // parallel
[Pipeline] stage
[Pipeline] { (Notifications)
[Pipeline] echo
Build result: UNSTABLE
[Pipeline] jiraIssueSelector
[Pipeline] emailext
Mime
  • Unnamed multipart/mixed (inline, None, 0 bytes)
View raw message