maven-notifications mailing list archives

Site index · List index
Message view « Date » · « Thread »
Top « Date » · « Thread »
From Apache Jenkins Server <jenk...@builds.apache.org>
Subject Build unstable in Jenkins: Maven TLP » maven-resolver » buildfix-1-thread #1
Date Sun, 14 Jul 2019 14:27:07 GMT
See https://builds.apache.org/job/maven-box/job/maven-resolver/job/buildfix-1-thread/1/

No changes.

88 tests failed.
FAILED:  org.eclipse.aether.internal.impl.collect.DefaultDependencyCollectorTest.linux-jdk8 / Build linux-jdk8 / testDuplicates

Error Message:
illegal coordinates for child

Stack Trace:
java.lang.IllegalArgumentException: illegal coordinates for child
	at org.eclipse.aether.internal.impl.collect.DefaultDependencyCollectorTest.path(DefaultDependencyCollectorTest.java:176)
	at org.eclipse.aether.internal.impl.collect.DefaultDependencyCollectorTest.dep(DefaultDependencyCollectorTest.java:159)
	at org.eclipse.aether.internal.impl.collect.DefaultDependencyCollectorTest.testDuplicates(DefaultDependencyCollectorTest.java:249)
Caused by: java.lang.IndexOutOfBoundsException: Index: 0, Size: 0
	at org.eclipse.aether.internal.impl.collect.DefaultDependencyCollectorTest.path(DefaultDependencyCollectorTest.java:169)
	at org.eclipse.aether.internal.impl.collect.DefaultDependencyCollectorTest.dep(DefaultDependencyCollectorTest.java:159)
	at org.eclipse.aether.internal.impl.collect.DefaultDependencyCollectorTest.testDuplicates(DefaultDependencyCollectorTest.java:249)


FAILED:  org.eclipse.aether.internal.impl.collect.DefaultDependencyCollectorTest.linux-jdk8 / Build linux-jdk8 / testPartialResultOnError

Error Message:
path: [subtree:comparison:ext:error (), duplicate:transitive:ext:dependency (compile)], expected: [gid:aid:ext:ver (compile), gid:aid2:ext:ver (compile)], actual: [] expected:<2> but was:<0>

Stack Trace:
java.lang.AssertionError: path: [subtree:comparison:ext:error (), duplicate:transitive:ext:dependency (compile)], expected: [gid:aid:ext:ver (compile), gid:aid2:ext:ver (compile)], actual: [] expected:<2> but was:<0>
	at org.eclipse.aether.internal.impl.collect.DefaultDependencyCollectorTest.assertEqualSubtree(DefaultDependencyCollectorTest.java:143)
	at org.eclipse.aether.internal.impl.collect.DefaultDependencyCollectorTest.assertEqualSubtree(DefaultDependencyCollectorTest.java:151)
	at org.eclipse.aether.internal.impl.collect.DefaultDependencyCollectorTest.assertEqualSubtree(DefaultDependencyCollectorTest.java:121)
	at org.eclipse.aether.internal.impl.collect.DefaultDependencyCollectorTest.testPartialResultOnError(DefaultDependencyCollectorTest.java:357)


FAILED:  org.eclipse.aether.internal.impl.collect.DefaultDependencyCollectorTest.linux-jdk8 / Build linux-jdk8 / testEqualSubtree

Error Message:
path: [subtree:comparison:ext:ver (), duplicate:transitive:ext:dependency (compile)], expected: [gid:aid:ext:ver (compile), gid:aid2:ext:ver (compile)], actual: [] expected:<2> but was:<0>

Stack Trace:
java.lang.AssertionError: path: [subtree:comparison:ext:ver (), duplicate:transitive:ext:dependency (compile)], expected: [gid:aid:ext:ver (compile), gid:aid2:ext:ver (compile)], actual: [] expected:<2> but was:<0>
	at org.eclipse.aether.internal.impl.collect.DefaultDependencyCollectorTest.assertEqualSubtree(DefaultDependencyCollectorTest.java:143)
	at org.eclipse.aether.internal.impl.collect.DefaultDependencyCollectorTest.assertEqualSubtree(DefaultDependencyCollectorTest.java:151)
	at org.eclipse.aether.internal.impl.collect.DefaultDependencyCollectorTest.assertEqualSubtree(DefaultDependencyCollectorTest.java:121)
	at org.eclipse.aether.internal.impl.collect.DefaultDependencyCollectorTest.testEqualSubtree(DefaultDependencyCollectorTest.java:262)


FAILED:  org.eclipse.aether.internal.impl.collect.DefaultDependencyCollectorTest.linux-jdk8 / Build linux-jdk8 / testDependencyManagement_DefaultDependencyManager

Error Message:
path: [gid:root:ext:ver (compile), gid:direct:ext:managed-by-dominant-request (compile)], expected: [gid:transitive-1:ext:managed-by-root (compile)], actual: [] expected:<1> but was:<0>

Stack Trace:
java.lang.AssertionError: path: [gid:root:ext:ver (compile), gid:direct:ext:managed-by-dominant-request (compile)], expected: [gid:transitive-1:ext:managed-by-root (compile)], actual: [] expected:<1> but was:<0>
	at org.eclipse.aether.internal.impl.collect.DefaultDependencyCollectorTest.assertEqualSubtree(DefaultDependencyCollectorTest.java:143)
	at org.eclipse.aether.internal.impl.collect.DefaultDependencyCollectorTest.assertEqualSubtree(DefaultDependencyCollectorTest.java:151)
	at org.eclipse.aether.internal.impl.collect.DefaultDependencyCollectorTest.assertEqualSubtree(DefaultDependencyCollectorTest.java:121)
	at org.eclipse.aether.internal.impl.collect.DefaultDependencyCollectorTest.testDependencyManagement_DefaultDependencyManager(DefaultDependencyCollectorTest.java:529)


FAILED:  org.eclipse.aether.internal.impl.collect.DefaultDependencyCollectorTest.linux-jdk8 / Build linux-jdk8 / testCollectMultipleDependencies

Error Message:
expected:<1> but was:<0>

Stack Trace:
java.lang.AssertionError: expected:<1> but was:<0>
	at org.eclipse.aether.internal.impl.collect.DefaultDependencyCollectorTest.testCollectMultipleDependencies(DefaultDependencyCollectorTest.java:375)


FAILED:  org.eclipse.aether.internal.impl.collect.DefaultDependencyCollectorTest.linux-jdk8 / Build linux-jdk8 / testCyclicProjects

Error Message:
illegal coordinates for child

Stack Trace:
java.lang.IllegalArgumentException: illegal coordinates for child
	at org.eclipse.aether.internal.impl.collect.DefaultDependencyCollectorTest.path(DefaultDependencyCollectorTest.java:176)
	at org.eclipse.aether.internal.impl.collect.DefaultDependencyCollectorTest.testCyclicProjects(DefaultDependencyCollectorTest.java:294)
Caused by: java.lang.IndexOutOfBoundsException: Index: 0, Size: 0
	at org.eclipse.aether.internal.impl.collect.DefaultDependencyCollectorTest.path(DefaultDependencyCollectorTest.java:169)
	at org.eclipse.aether.internal.impl.collect.DefaultDependencyCollectorTest.testCyclicProjects(DefaultDependencyCollectorTest.java:294)


FAILED:  org.eclipse.aether.internal.impl.collect.DefaultDependencyCollectorTest.linux-jdk8 / Build linux-jdk8 / testCyclicDependencies

Error Message:
path: [cycle:root:jar:1 (), cycle:a:jar:1 (compile)], expected: [cycle:b:jar:1 (compile)], actual: [] expected:<1> but was:<0>

Stack Trace:
java.lang.AssertionError: path: [cycle:root:jar:1 (), cycle:a:jar:1 (compile)], expected: [cycle:b:jar:1 (compile)], actual: [] expected:<1> but was:<0>
	at org.eclipse.aether.internal.impl.collect.DefaultDependencyCollectorTest.assertEqualSubtree(DefaultDependencyCollectorTest.java:143)
	at org.eclipse.aether.internal.impl.collect.DefaultDependencyCollectorTest.assertEqualSubtree(DefaultDependencyCollectorTest.java:151)
	at org.eclipse.aether.internal.impl.collect.DefaultDependencyCollectorTest.assertEqualSubtree(DefaultDependencyCollectorTest.java:121)
	at org.eclipse.aether.internal.impl.collect.DefaultDependencyCollectorTest.testCyclicDependencies(DefaultDependencyCollectorTest.java:272)


FAILED:  org.eclipse.aether.internal.impl.collect.DefaultDependencyCollectorTest.linux-jdk8 / Build linux-jdk8 / testCyclicProjects_ConsiderLabelOfRootlessGraph

Error Message:
Index: 0, Size: 0

Stack Trace:
java.lang.IndexOutOfBoundsException: Index: 0, Size: 0
	at org.eclipse.aether.internal.impl.collect.DefaultDependencyCollectorTest.testCyclicProjects_ConsiderLabelOfRootlessGraph(DefaultDependencyCollectorTest.java:321)


FAILED:  org.eclipse.aether.internal.impl.collect.DefaultDependencyCollectorTest.linux-jdk8 / Build linux-jdk8 / testDependencyManagement_TransitiveDependencyManager

Error Message:
path: [gid:root:ext:ver (compile), gid:direct:ext:ver (compile)], expected: [gid:transitive-1:ext:managed-by-root (compile)], actual: [] expected:<1> but was:<0>

Stack Trace:
java.lang.AssertionError: path: [gid:root:ext:ver (compile), gid:direct:ext:ver (compile)], expected: [gid:transitive-1:ext:managed-by-root (compile)], actual: [] expected:<1> but was:<0>
	at org.eclipse.aether.internal.impl.collect.DefaultDependencyCollectorTest.assertEqualSubtree(DefaultDependencyCollectorTest.java:143)
	at org.eclipse.aether.internal.impl.collect.DefaultDependencyCollectorTest.assertEqualSubtree(DefaultDependencyCollectorTest.java:151)
	at org.eclipse.aether.internal.impl.collect.DefaultDependencyCollectorTest.assertEqualSubtree(DefaultDependencyCollectorTest.java:121)
	at org.eclipse.aether.internal.impl.collect.DefaultDependencyCollectorTest.testDependencyManagement_TransitiveDependencyManager(DefaultDependencyCollectorTest.java:500)


FAILED:  org.eclipse.aether.internal.impl.collect.DefaultDependencyCollectorTest.linux-jdk8 / Build linux-jdk8 / testDependencyManagement

Error Message:
illegal coordinates for child

Stack Trace:
java.lang.IllegalArgumentException: illegal coordinates for child
	at org.eclipse.aether.internal.impl.collect.DefaultDependencyCollectorTest.path(DefaultDependencyCollectorTest.java:176)
	at org.eclipse.aether.internal.impl.collect.DefaultDependencyCollectorTest.dep(DefaultDependencyCollectorTest.java:159)
	at org.eclipse.aether.internal.impl.collect.DefaultDependencyCollectorTest.testDependencyManagement(DefaultDependencyCollectorTest.java:456)
Caused by: java.lang.IndexOutOfBoundsException: Index: 1, Size: 0
	at org.eclipse.aether.internal.impl.collect.DefaultDependencyCollectorTest.path(DefaultDependencyCollectorTest.java:169)
	at org.eclipse.aether.internal.impl.collect.DefaultDependencyCollectorTest.dep(DefaultDependencyCollectorTest.java:159)
	at org.eclipse.aether.internal.impl.collect.DefaultDependencyCollectorTest.testDependencyManagement(DefaultDependencyCollectorTest.java:456)


FAILED:  org.eclipse.aether.internal.impl.collect.DefaultDependencyCollectorTest.linux-jdk8 / Build linux-jdk8 / testManagedVersionScope

Error Message:
expected:<1> but was:<0>

Stack Trace:
java.lang.AssertionError: expected:<1> but was:<0>
	at org.eclipse.aether.internal.impl.collect.DefaultDependencyCollectorTest.testManagedVersionScope(DefaultDependencyCollectorTest.java:432)


FAILED:  org.eclipse.aether.internal.impl.collect.DefaultDependencyCollectorTest.linux-jdk11 / Build linux-jdk11 / testDuplicates

Error Message:
illegal coordinates for child

Stack Trace:
java.lang.IllegalArgumentException: illegal coordinates for child
	at org.eclipse.aether.internal.impl.collect.DefaultDependencyCollectorTest.path(DefaultDependencyCollectorTest.java:176)
	at org.eclipse.aether.internal.impl.collect.DefaultDependencyCollectorTest.dep(DefaultDependencyCollectorTest.java:159)
	at org.eclipse.aether.internal.impl.collect.DefaultDependencyCollectorTest.testDuplicates(DefaultDependencyCollectorTest.java:249)
Caused by: java.lang.IndexOutOfBoundsException: Index 0 out of bounds for length 0
	at org.eclipse.aether.internal.impl.collect.DefaultDependencyCollectorTest.path(DefaultDependencyCollectorTest.java:169)
	at org.eclipse.aether.internal.impl.collect.DefaultDependencyCollectorTest.dep(DefaultDependencyCollectorTest.java:159)
	at org.eclipse.aether.internal.impl.collect.DefaultDependencyCollectorTest.testDuplicates(DefaultDependencyCollectorTest.java:249)


FAILED:  org.eclipse.aether.internal.impl.collect.DefaultDependencyCollectorTest.linux-jdk11 / Build linux-jdk11 / testPartialResultOnError

Error Message:
path: [subtree:comparison:ext:error (), duplicate:transitive:ext:dependency (compile)], expected: [gid:aid:ext:ver (compile), gid:aid2:ext:ver (compile)], actual: [] expected:<2> but was:<0>

Stack Trace:
java.lang.AssertionError: path: [subtree:comparison:ext:error (), duplicate:transitive:ext:dependency (compile)], expected: [gid:aid:ext:ver (compile), gid:aid2:ext:ver (compile)], actual: [] expected:<2> but was:<0>
	at org.eclipse.aether.internal.impl.collect.DefaultDependencyCollectorTest.assertEqualSubtree(DefaultDependencyCollectorTest.java:143)
	at org.eclipse.aether.internal.impl.collect.DefaultDependencyCollectorTest.assertEqualSubtree(DefaultDependencyCollectorTest.java:151)
	at org.eclipse.aether.internal.impl.collect.DefaultDependencyCollectorTest.assertEqualSubtree(DefaultDependencyCollectorTest.java:121)
	at org.eclipse.aether.internal.impl.collect.DefaultDependencyCollectorTest.testPartialResultOnError(DefaultDependencyCollectorTest.java:357)


FAILED:  org.eclipse.aether.internal.impl.collect.DefaultDependencyCollectorTest.linux-jdk11 / Build linux-jdk11 / testEqualSubtree

Error Message:
path: [subtree:comparison:ext:ver (), duplicate:transitive:ext:dependency (compile)], expected: [gid:aid:ext:ver (compile), gid:aid2:ext:ver (compile)], actual: [] expected:<2> but was:<0>

Stack Trace:
java.lang.AssertionError: path: [subtree:comparison:ext:ver (), duplicate:transitive:ext:dependency (compile)], expected: [gid:aid:ext:ver (compile), gid:aid2:ext:ver (compile)], actual: [] expected:<2> but was:<0>
	at org.eclipse.aether.internal.impl.collect.DefaultDependencyCollectorTest.assertEqualSubtree(DefaultDependencyCollectorTest.java:143)
	at org.eclipse.aether.internal.impl.collect.DefaultDependencyCollectorTest.assertEqualSubtree(DefaultDependencyCollectorTest.java:151)
	at org.eclipse.aether.internal.impl.collect.DefaultDependencyCollectorTest.assertEqualSubtree(DefaultDependencyCollectorTest.java:121)
	at org.eclipse.aether.internal.impl.collect.DefaultDependencyCollectorTest.testEqualSubtree(DefaultDependencyCollectorTest.java:262)


FAILED:  org.eclipse.aether.internal.impl.collect.DefaultDependencyCollectorTest.linux-jdk11 / Build linux-jdk11 / testDependencyManagement_DefaultDependencyManager

Error Message:
path: [gid:root:ext:ver (compile), gid:direct:ext:managed-by-dominant-request (compile)], expected: [gid:transitive-1:ext:managed-by-root (compile)], actual: [] expected:<1> but was:<0>

Stack Trace:
java.lang.AssertionError: path: [gid:root:ext:ver (compile), gid:direct:ext:managed-by-dominant-request (compile)], expected: [gid:transitive-1:ext:managed-by-root (compile)], actual: [] expected:<1> but was:<0>
	at org.eclipse.aether.internal.impl.collect.DefaultDependencyCollectorTest.assertEqualSubtree(DefaultDependencyCollectorTest.java:143)
	at org.eclipse.aether.internal.impl.collect.DefaultDependencyCollectorTest.assertEqualSubtree(DefaultDependencyCollectorTest.java:151)
	at org.eclipse.aether.internal.impl.collect.DefaultDependencyCollectorTest.assertEqualSubtree(DefaultDependencyCollectorTest.java:121)
	at org.eclipse.aether.internal.impl.collect.DefaultDependencyCollectorTest.testDependencyManagement_DefaultDependencyManager(DefaultDependencyCollectorTest.java:529)


FAILED:  org.eclipse.aether.internal.impl.collect.DefaultDependencyCollectorTest.linux-jdk11 / Build linux-jdk11 / testCollectMultipleDependencies

Error Message:
expected:<1> but was:<0>

Stack Trace:
java.lang.AssertionError: expected:<1> but was:<0>
	at org.eclipse.aether.internal.impl.collect.DefaultDependencyCollectorTest.testCollectMultipleDependencies(DefaultDependencyCollectorTest.java:375)


FAILED:  org.eclipse.aether.internal.impl.collect.DefaultDependencyCollectorTest.linux-jdk11 / Build linux-jdk11 / testCyclicProjects

Error Message:
illegal coordinates for child

Stack Trace:
java.lang.IllegalArgumentException: illegal coordinates for child
	at org.eclipse.aether.internal.impl.collect.DefaultDependencyCollectorTest.path(DefaultDependencyCollectorTest.java:176)
	at org.eclipse.aether.internal.impl.collect.DefaultDependencyCollectorTest.testCyclicProjects(DefaultDependencyCollectorTest.java:294)
Caused by: java.lang.IndexOutOfBoundsException: Index 0 out of bounds for length 0
	at org.eclipse.aether.internal.impl.collect.DefaultDependencyCollectorTest.path(DefaultDependencyCollectorTest.java:169)
	at org.eclipse.aether.internal.impl.collect.DefaultDependencyCollectorTest.testCyclicProjects(DefaultDependencyCollectorTest.java:294)


FAILED:  org.eclipse.aether.internal.impl.collect.DefaultDependencyCollectorTest.linux-jdk11 / Build linux-jdk11 / testCyclicDependencies

Error Message:
path: [cycle:root:jar:1 (), cycle:a:jar:1 (compile)], expected: [cycle:b:jar:1 (compile)], actual: [] expected:<1> but was:<0>

Stack Trace:
java.lang.AssertionError: path: [cycle:root:jar:1 (), cycle:a:jar:1 (compile)], expected: [cycle:b:jar:1 (compile)], actual: [] expected:<1> but was:<0>
	at org.eclipse.aether.internal.impl.collect.DefaultDependencyCollectorTest.assertEqualSubtree(DefaultDependencyCollectorTest.java:143)
	at org.eclipse.aether.internal.impl.collect.DefaultDependencyCollectorTest.assertEqualSubtree(DefaultDependencyCollectorTest.java:151)
	at org.eclipse.aether.internal.impl.collect.DefaultDependencyCollectorTest.assertEqualSubtree(DefaultDependencyCollectorTest.java:121)
	at org.eclipse.aether.internal.impl.collect.DefaultDependencyCollectorTest.testCyclicDependencies(DefaultDependencyCollectorTest.java:272)


FAILED:  org.eclipse.aether.internal.impl.collect.DefaultDependencyCollectorTest.linux-jdk11 / Build linux-jdk11 / testCyclicProjects_ConsiderLabelOfRootlessGraph

Error Message:
Index 0 out of bounds for length 0

Stack Trace:
java.lang.IndexOutOfBoundsException: Index 0 out of bounds for length 0
	at org.eclipse.aether.internal.impl.collect.DefaultDependencyCollectorTest.testCyclicProjects_ConsiderLabelOfRootlessGraph(DefaultDependencyCollectorTest.java:321)


FAILED:  org.eclipse.aether.internal.impl.collect.DefaultDependencyCollectorTest.linux-jdk11 / Build linux-jdk11 / testDependencyManagement_TransitiveDependencyManager

Error Message:
path: [gid:root:ext:ver (compile), gid:direct:ext:ver (compile)], expected: [gid:transitive-1:ext:managed-by-root (compile)], actual: [] expected:<1> but was:<0>

Stack Trace:
java.lang.AssertionError: path: [gid:root:ext:ver (compile), gid:direct:ext:ver (compile)], expected: [gid:transitive-1:ext:managed-by-root (compile)], actual: [] expected:<1> but was:<0>
	at org.eclipse.aether.internal.impl.collect.DefaultDependencyCollectorTest.assertEqualSubtree(DefaultDependencyCollectorTest.java:143)
	at org.eclipse.aether.internal.impl.collect.DefaultDependencyCollectorTest.assertEqualSubtree(DefaultDependencyCollectorTest.java:151)
	at org.eclipse.aether.internal.impl.collect.DefaultDependencyCollectorTest.assertEqualSubtree(DefaultDependencyCollectorTest.java:121)
	at org.eclipse.aether.internal.impl.collect.DefaultDependencyCollectorTest.testDependencyManagement_TransitiveDependencyManager(DefaultDependencyCollectorTest.java:500)


FAILED:  org.eclipse.aether.internal.impl.collect.DefaultDependencyCollectorTest.linux-jdk11 / Build linux-jdk11 / testDependencyManagement

Error Message:
illegal coordinates for child

Stack Trace:
java.lang.IllegalArgumentException: illegal coordinates for child
	at org.eclipse.aether.internal.impl.collect.DefaultDependencyCollectorTest.path(DefaultDependencyCollectorTest.java:176)
	at org.eclipse.aether.internal.impl.collect.DefaultDependencyCollectorTest.dep(DefaultDependencyCollectorTest.java:159)
	at org.eclipse.aether.internal.impl.collect.DefaultDependencyCollectorTest.testDependencyManagement(DefaultDependencyCollectorTest.java:456)
Caused by: java.lang.IndexOutOfBoundsException: Index 1 out of bounds for length 0
	at org.eclipse.aether.internal.impl.collect.DefaultDependencyCollectorTest.path(DefaultDependencyCollectorTest.java:169)
	at org.eclipse.aether.internal.impl.collect.DefaultDependencyCollectorTest.dep(DefaultDependencyCollectorTest.java:159)
	at org.eclipse.aether.internal.impl.collect.DefaultDependencyCollectorTest.testDependencyManagement(DefaultDependencyCollectorTest.java:456)


FAILED:  org.eclipse.aether.internal.impl.collect.DefaultDependencyCollectorTest.linux-jdk11 / Build linux-jdk11 / testManagedVersionScope

Error Message:
expected:<1> but was:<0>

Stack Trace:
java.lang.AssertionError: expected:<1> but was:<0>
	at org.eclipse.aether.internal.impl.collect.DefaultDependencyCollectorTest.testManagedVersionScope(DefaultDependencyCollectorTest.java:432)


FAILED:  org.eclipse.aether.internal.impl.collect.DefaultDependencyCollectorTest.linux-jdk12 / Build linux-jdk12 / testDuplicates

Error Message:
illegal coordinates for child

Stack Trace:
java.lang.IllegalArgumentException: illegal coordinates for child
	at org.eclipse.aether.internal.impl.collect.DefaultDependencyCollectorTest.path(DefaultDependencyCollectorTest.java:176)
	at org.eclipse.aether.internal.impl.collect.DefaultDependencyCollectorTest.dep(DefaultDependencyCollectorTest.java:159)
	at org.eclipse.aether.internal.impl.collect.DefaultDependencyCollectorTest.testDuplicates(DefaultDependencyCollectorTest.java:249)
Caused by: java.lang.IndexOutOfBoundsException: Index 0 out of bounds for length 0
	at org.eclipse.aether.internal.impl.collect.DefaultDependencyCollectorTest.path(DefaultDependencyCollectorTest.java:169)
	at org.eclipse.aether.internal.impl.collect.DefaultDependencyCollectorTest.dep(DefaultDependencyCollectorTest.java:159)
	at org.eclipse.aether.internal.impl.collect.DefaultDependencyCollectorTest.testDuplicates(DefaultDependencyCollectorTest.java:249)


FAILED:  org.eclipse.aether.internal.impl.collect.DefaultDependencyCollectorTest.linux-jdk12 / Build linux-jdk12 / testPartialResultOnError

Error Message:
path: [subtree:comparison:ext:error (), duplicate:transitive:ext:dependency (compile)], expected: [gid:aid:ext:ver (compile), gid:aid2:ext:ver (compile)], actual: [] expected:<2> but was:<0>

Stack Trace:
java.lang.AssertionError: path: [subtree:comparison:ext:error (), duplicate:transitive:ext:dependency (compile)], expected: [gid:aid:ext:ver (compile), gid:aid2:ext:ver (compile)], actual: [] expected:<2> but was:<0>
	at org.eclipse.aether.internal.impl.collect.DefaultDependencyCollectorTest.assertEqualSubtree(DefaultDependencyCollectorTest.java:143)
	at org.eclipse.aether.internal.impl.collect.DefaultDependencyCollectorTest.assertEqualSubtree(DefaultDependencyCollectorTest.java:151)
	at org.eclipse.aether.internal.impl.collect.DefaultDependencyCollectorTest.assertEqualSubtree(DefaultDependencyCollectorTest.java:121)
	at org.eclipse.aether.internal.impl.collect.DefaultDependencyCollectorTest.testPartialResultOnError(DefaultDependencyCollectorTest.java:357)


FAILED:  org.eclipse.aether.internal.impl.collect.DefaultDependencyCollectorTest.linux-jdk12 / Build linux-jdk12 / testEqualSubtree

Error Message:
path: [subtree:comparison:ext:ver (), duplicate:transitive:ext:dependency (compile)], expected: [gid:aid:ext:ver (compile), gid:aid2:ext:ver (compile)], actual: [] expected:<2> but was:<0>

Stack Trace:
java.lang.AssertionError: path: [subtree:comparison:ext:ver (), duplicate:transitive:ext:dependency (compile)], expected: [gid:aid:ext:ver (compile), gid:aid2:ext:ver (compile)], actual: [] expected:<2> but was:<0>
	at org.eclipse.aether.internal.impl.collect.DefaultDependencyCollectorTest.assertEqualSubtree(DefaultDependencyCollectorTest.java:143)
	at org.eclipse.aether.internal.impl.collect.DefaultDependencyCollectorTest.assertEqualSubtree(DefaultDependencyCollectorTest.java:151)
	at org.eclipse.aether.internal.impl.collect.DefaultDependencyCollectorTest.assertEqualSubtree(DefaultDependencyCollectorTest.java:121)
	at org.eclipse.aether.internal.impl.collect.DefaultDependencyCollectorTest.testEqualSubtree(DefaultDependencyCollectorTest.java:262)


FAILED:  org.eclipse.aether.internal.impl.collect.DefaultDependencyCollectorTest.linux-jdk12 / Build linux-jdk12 / testDependencyManagement_DefaultDependencyManager

Error Message:
path: [gid:root:ext:ver (compile), gid:direct:ext:managed-by-dominant-request (compile)], expected: [gid:transitive-1:ext:managed-by-root (compile)], actual: [] expected:<1> but was:<0>

Stack Trace:
java.lang.AssertionError: path: [gid:root:ext:ver (compile), gid:direct:ext:managed-by-dominant-request (compile)], expected: [gid:transitive-1:ext:managed-by-root (compile)], actual: [] expected:<1> but was:<0>
	at org.eclipse.aether.internal.impl.collect.DefaultDependencyCollectorTest.assertEqualSubtree(DefaultDependencyCollectorTest.java:143)
	at org.eclipse.aether.internal.impl.collect.DefaultDependencyCollectorTest.assertEqualSubtree(DefaultDependencyCollectorTest.java:151)
	at org.eclipse.aether.internal.impl.collect.DefaultDependencyCollectorTest.assertEqualSubtree(DefaultDependencyCollectorTest.java:121)
	at org.eclipse.aether.internal.impl.collect.DefaultDependencyCollectorTest.testDependencyManagement_DefaultDependencyManager(DefaultDependencyCollectorTest.java:529)


FAILED:  org.eclipse.aether.internal.impl.collect.DefaultDependencyCollectorTest.linux-jdk12 / Build linux-jdk12 / testCollectMultipleDependencies

Error Message:
expected:<1> but was:<0>

Stack Trace:
java.lang.AssertionError: expected:<1> but was:<0>
	at org.eclipse.aether.internal.impl.collect.DefaultDependencyCollectorTest.testCollectMultipleDependencies(DefaultDependencyCollectorTest.java:375)


FAILED:  org.eclipse.aether.internal.impl.collect.DefaultDependencyCollectorTest.linux-jdk12 / Build linux-jdk12 / testCyclicProjects

Error Message:
illegal coordinates for child

Stack Trace:
java.lang.IllegalArgumentException: illegal coordinates for child
	at org.eclipse.aether.internal.impl.collect.DefaultDependencyCollectorTest.path(DefaultDependencyCollectorTest.java:176)
	at org.eclipse.aether.internal.impl.collect.DefaultDependencyCollectorTest.testCyclicProjects(DefaultDependencyCollectorTest.java:294)
Caused by: java.lang.IndexOutOfBoundsException: Index 0 out of bounds for length 0
	at org.eclipse.aether.internal.impl.collect.DefaultDependencyCollectorTest.path(DefaultDependencyCollectorTest.java:169)
	at org.eclipse.aether.internal.impl.collect.DefaultDependencyCollectorTest.testCyclicProjects(DefaultDependencyCollectorTest.java:294)


FAILED:  org.eclipse.aether.internal.impl.collect.DefaultDependencyCollectorTest.linux-jdk12 / Build linux-jdk12 / testCyclicDependencies

Error Message:
path: [cycle:root:jar:1 (), cycle:a:jar:1 (compile)], expected: [cycle:b:jar:1 (compile)], actual: [] expected:<1> but was:<0>

Stack Trace:
java.lang.AssertionError: path: [cycle:root:jar:1 (), cycle:a:jar:1 (compile)], expected: [cycle:b:jar:1 (compile)], actual: [] expected:<1> but was:<0>
	at org.eclipse.aether.internal.impl.collect.DefaultDependencyCollectorTest.assertEqualSubtree(DefaultDependencyCollectorTest.java:143)
	at org.eclipse.aether.internal.impl.collect.DefaultDependencyCollectorTest.assertEqualSubtree(DefaultDependencyCollectorTest.java:151)
	at org.eclipse.aether.internal.impl.collect.DefaultDependencyCollectorTest.assertEqualSubtree(DefaultDependencyCollectorTest.java:121)
	at org.eclipse.aether.internal.impl.collect.DefaultDependencyCollectorTest.testCyclicDependencies(DefaultDependencyCollectorTest.java:272)


FAILED:  org.eclipse.aether.internal.impl.collect.DefaultDependencyCollectorTest.linux-jdk12 / Build linux-jdk12 / testCyclicProjects_ConsiderLabelOfRootlessGraph

Error Message:
Index 0 out of bounds for length 0

Stack Trace:
java.lang.IndexOutOfBoundsException: Index 0 out of bounds for length 0
	at org.eclipse.aether.internal.impl.collect.DefaultDependencyCollectorTest.testCyclicProjects_ConsiderLabelOfRootlessGraph(DefaultDependencyCollectorTest.java:321)


FAILED:  org.eclipse.aether.internal.impl.collect.DefaultDependencyCollectorTest.linux-jdk12 / Build linux-jdk12 / testDependencyManagement_TransitiveDependencyManager

Error Message:
path: [gid:root:ext:ver (compile), gid:direct:ext:ver (compile)], expected: [gid:transitive-1:ext:managed-by-root (compile)], actual: [] expected:<1> but was:<0>

Stack Trace:
java.lang.AssertionError: path: [gid:root:ext:ver (compile), gid:direct:ext:ver (compile)], expected: [gid:transitive-1:ext:managed-by-root (compile)], actual: [] expected:<1> but was:<0>
	at org.eclipse.aether.internal.impl.collect.DefaultDependencyCollectorTest.assertEqualSubtree(DefaultDependencyCollectorTest.java:143)
	at org.eclipse.aether.internal.impl.collect.DefaultDependencyCollectorTest.assertEqualSubtree(DefaultDependencyCollectorTest.java:151)
	at org.eclipse.aether.internal.impl.collect.DefaultDependencyCollectorTest.assertEqualSubtree(DefaultDependencyCollectorTest.java:121)
	at org.eclipse.aether.internal.impl.collect.DefaultDependencyCollectorTest.testDependencyManagement_TransitiveDependencyManager(DefaultDependencyCollectorTest.java:500)


FAILED:  org.eclipse.aether.internal.impl.collect.DefaultDependencyCollectorTest.linux-jdk12 / Build linux-jdk12 / testDependencyManagement

Error Message:
illegal coordinates for child

Stack Trace:
java.lang.IllegalArgumentException: illegal coordinates for child
	at org.eclipse.aether.internal.impl.collect.DefaultDependencyCollectorTest.path(DefaultDependencyCollectorTest.java:176)
	at org.eclipse.aether.internal.impl.collect.DefaultDependencyCollectorTest.dep(DefaultDependencyCollectorTest.java:159)
	at org.eclipse.aether.internal.impl.collect.DefaultDependencyCollectorTest.testDependencyManagement(DefaultDependencyCollectorTest.java:456)
Caused by: java.lang.IndexOutOfBoundsException: Index 1 out of bounds for length 0
	at org.eclipse.aether.internal.impl.collect.DefaultDependencyCollectorTest.path(DefaultDependencyCollectorTest.java:169)
	at org.eclipse.aether.internal.impl.collect.DefaultDependencyCollectorTest.dep(DefaultDependencyCollectorTest.java:159)
	at org.eclipse.aether.internal.impl.collect.DefaultDependencyCollectorTest.testDependencyManagement(DefaultDependencyCollectorTest.java:456)


FAILED:  org.eclipse.aether.internal.impl.collect.DefaultDependencyCollectorTest.linux-jdk12 / Build linux-jdk12 / testManagedVersionScope

Error Message:
expected:<1> but was:<0>

Stack Trace:
java.lang.AssertionError: expected:<1> but was:<0>
	at org.eclipse.aether.internal.impl.collect.DefaultDependencyCollectorTest.testManagedVersionScope(DefaultDependencyCollectorTest.java:432)


FAILED:  org.eclipse.aether.internal.impl.collect.DefaultDependencyCollectorTest.linux-jdk7 / Build linux-jdk7 / testDuplicates

Error Message:
illegal coordinates for child

Stack Trace:
java.lang.IllegalArgumentException: illegal coordinates for child
	at org.eclipse.aether.internal.impl.collect.DefaultDependencyCollectorTest.path(DefaultDependencyCollectorTest.java:176)
	at org.eclipse.aether.internal.impl.collect.DefaultDependencyCollectorTest.dep(DefaultDependencyCollectorTest.java:159)
	at org.eclipse.aether.internal.impl.collect.DefaultDependencyCollectorTest.testDuplicates(DefaultDependencyCollectorTest.java:249)
Caused by: java.lang.IndexOutOfBoundsException: Index: 0, Size: 0
	at org.eclipse.aether.internal.impl.collect.DefaultDependencyCollectorTest.path(DefaultDependencyCollectorTest.java:169)
	at org.eclipse.aether.internal.impl.collect.DefaultDependencyCollectorTest.dep(DefaultDependencyCollectorTest.java:159)
	at org.eclipse.aether.internal.impl.collect.DefaultDependencyCollectorTest.testDuplicates(DefaultDependencyCollectorTest.java:249)


FAILED:  org.eclipse.aether.internal.impl.collect.DefaultDependencyCollectorTest.linux-jdk7 / Build linux-jdk7 / testPartialResultOnError

Error Message:
path: [subtree:comparison:ext:error (), duplicate:transitive:ext:dependency (compile)], expected: [gid:aid:ext:ver (compile), gid:aid2:ext:ver (compile)], actual: [] expected:<2> but was:<0>

Stack Trace:
java.lang.AssertionError: path: [subtree:comparison:ext:error (), duplicate:transitive:ext:dependency (compile)], expected: [gid:aid:ext:ver (compile), gid:aid2:ext:ver (compile)], actual: [] expected:<2> but was:<0>
	at org.eclipse.aether.internal.impl.collect.DefaultDependencyCollectorTest.assertEqualSubtree(DefaultDependencyCollectorTest.java:143)
	at org.eclipse.aether.internal.impl.collect.DefaultDependencyCollectorTest.assertEqualSubtree(DefaultDependencyCollectorTest.java:151)
	at org.eclipse.aether.internal.impl.collect.DefaultDependencyCollectorTest.assertEqualSubtree(DefaultDependencyCollectorTest.java:121)
	at org.eclipse.aether.internal.impl.collect.DefaultDependencyCollectorTest.testPartialResultOnError(DefaultDependencyCollectorTest.java:357)


FAILED:  org.eclipse.aether.internal.impl.collect.DefaultDependencyCollectorTest.linux-jdk7 / Build linux-jdk7 / testEqualSubtree

Error Message:
path: [subtree:comparison:ext:ver (), duplicate:transitive:ext:dependency (compile)], expected: [gid:aid:ext:ver (compile), gid:aid2:ext:ver (compile)], actual: [] expected:<2> but was:<0>

Stack Trace:
java.lang.AssertionError: path: [subtree:comparison:ext:ver (), duplicate:transitive:ext:dependency (compile)], expected: [gid:aid:ext:ver (compile), gid:aid2:ext:ver (compile)], actual: [] expected:<2> but was:<0>
	at org.eclipse.aether.internal.impl.collect.DefaultDependencyCollectorTest.assertEqualSubtree(DefaultDependencyCollectorTest.java:143)
	at org.eclipse.aether.internal.impl.collect.DefaultDependencyCollectorTest.assertEqualSubtree(DefaultDependencyCollectorTest.java:151)
	at org.eclipse.aether.internal.impl.collect.DefaultDependencyCollectorTest.assertEqualSubtree(DefaultDependencyCollectorTest.java:121)
	at org.eclipse.aether.internal.impl.collect.DefaultDependencyCollectorTest.testEqualSubtree(DefaultDependencyCollectorTest.java:262)


FAILED:  org.eclipse.aether.internal.impl.collect.DefaultDependencyCollectorTest.linux-jdk7 / Build linux-jdk7 / testDependencyManagement_DefaultDependencyManager

Error Message:
path: [gid:root:ext:ver (compile), gid:direct:ext:managed-by-dominant-request (compile)], expected: [gid:transitive-1:ext:managed-by-root (compile)], actual: [] expected:<1> but was:<0>

Stack Trace:
java.lang.AssertionError: path: [gid:root:ext:ver (compile), gid:direct:ext:managed-by-dominant-request (compile)], expected: [gid:transitive-1:ext:managed-by-root (compile)], actual: [] expected:<1> but was:<0>
	at org.eclipse.aether.internal.impl.collect.DefaultDependencyCollectorTest.assertEqualSubtree(DefaultDependencyCollectorTest.java:143)
	at org.eclipse.aether.internal.impl.collect.DefaultDependencyCollectorTest.assertEqualSubtree(DefaultDependencyCollectorTest.java:151)
	at org.eclipse.aether.internal.impl.collect.DefaultDependencyCollectorTest.assertEqualSubtree(DefaultDependencyCollectorTest.java:121)
	at org.eclipse.aether.internal.impl.collect.DefaultDependencyCollectorTest.testDependencyManagement_DefaultDependencyManager(DefaultDependencyCollectorTest.java:529)


FAILED:  org.eclipse.aether.internal.impl.collect.DefaultDependencyCollectorTest.linux-jdk7 / Build linux-jdk7 / testCollectMultipleDependencies

Error Message:
expected:<1> but was:<0>

Stack Trace:
java.lang.AssertionError: expected:<1> but was:<0>
	at org.eclipse.aether.internal.impl.collect.DefaultDependencyCollectorTest.testCollectMultipleDependencies(DefaultDependencyCollectorTest.java:375)


FAILED:  org.eclipse.aether.internal.impl.collect.DefaultDependencyCollectorTest.linux-jdk7 / Build linux-jdk7 / testCyclicProjects

Error Message:
illegal coordinates for child

Stack Trace:
java.lang.IllegalArgumentException: illegal coordinates for child
	at org.eclipse.aether.internal.impl.collect.DefaultDependencyCollectorTest.path(DefaultDependencyCollectorTest.java:176)
	at org.eclipse.aether.internal.impl.collect.DefaultDependencyCollectorTest.testCyclicProjects(DefaultDependencyCollectorTest.java:294)
Caused by: java.lang.IndexOutOfBoundsException: Index: 0, Size: 0
	at org.eclipse.aether.internal.impl.collect.DefaultDependencyCollectorTest.path(DefaultDependencyCollectorTest.java:169)
	at org.eclipse.aether.internal.impl.collect.DefaultDependencyCollectorTest.testCyclicProjects(DefaultDependencyCollectorTest.java:294)


FAILED:  org.eclipse.aether.internal.impl.collect.DefaultDependencyCollectorTest.linux-jdk7 / Build linux-jdk7 / testCyclicDependencies

Error Message:
path: [cycle:root:jar:1 (), cycle:a:jar:1 (compile)], expected: [cycle:b:jar:1 (compile)], actual: [] expected:<1> but was:<0>

Stack Trace:
java.lang.AssertionError: path: [cycle:root:jar:1 (), cycle:a:jar:1 (compile)], expected: [cycle:b:jar:1 (compile)], actual: [] expected:<1> but was:<0>
	at org.eclipse.aether.internal.impl.collect.DefaultDependencyCollectorTest.assertEqualSubtree(DefaultDependencyCollectorTest.java:143)
	at org.eclipse.aether.internal.impl.collect.DefaultDependencyCollectorTest.assertEqualSubtree(DefaultDependencyCollectorTest.java:151)
	at org.eclipse.aether.internal.impl.collect.DefaultDependencyCollectorTest.assertEqualSubtree(DefaultDependencyCollectorTest.java:121)
	at org.eclipse.aether.internal.impl.collect.DefaultDependencyCollectorTest.testCyclicDependencies(DefaultDependencyCollectorTest.java:272)


FAILED:  org.eclipse.aether.internal.impl.collect.DefaultDependencyCollectorTest.linux-jdk7 / Build linux-jdk7 / testCyclicProjects_ConsiderLabelOfRootlessGraph

Error Message:
Index: 0, Size: 0

Stack Trace:
java.lang.IndexOutOfBoundsException: Index: 0, Size: 0
	at org.eclipse.aether.internal.impl.collect.DefaultDependencyCollectorTest.testCyclicProjects_ConsiderLabelOfRootlessGraph(DefaultDependencyCollectorTest.java:321)


FAILED:  org.eclipse.aether.internal.impl.collect.DefaultDependencyCollectorTest.linux-jdk7 / Build linux-jdk7 / testDependencyManagement_TransitiveDependencyManager

Error Message:
path: [gid:root:ext:ver (compile), gid:direct:ext:ver (compile)], expected: [gid:transitive-1:ext:managed-by-root (compile)], actual: [] expected:<1> but was:<0>

Stack Trace:
java.lang.AssertionError: path: [gid:root:ext:ver (compile), gid:direct:ext:ver (compile)], expected: [gid:transitive-1:ext:managed-by-root (compile)], actual: [] expected:<1> but was:<0>
	at org.eclipse.aether.internal.impl.collect.DefaultDependencyCollectorTest.assertEqualSubtree(DefaultDependencyCollectorTest.java:143)
	at org.eclipse.aether.internal.impl.collect.DefaultDependencyCollectorTest.assertEqualSubtree(DefaultDependencyCollectorTest.java:151)
	at org.eclipse.aether.internal.impl.collect.DefaultDependencyCollectorTest.assertEqualSubtree(DefaultDependencyCollectorTest.java:121)
	at org.eclipse.aether.internal.impl.collect.DefaultDependencyCollectorTest.testDependencyManagement_TransitiveDependencyManager(DefaultDependencyCollectorTest.java:500)


FAILED:  org.eclipse.aether.internal.impl.collect.DefaultDependencyCollectorTest.linux-jdk7 / Build linux-jdk7 / testDependencyManagement

Error Message:
illegal coordinates for child

Stack Trace:
java.lang.IllegalArgumentException: illegal coordinates for child
	at org.eclipse.aether.internal.impl.collect.DefaultDependencyCollectorTest.path(DefaultDependencyCollectorTest.java:176)
	at org.eclipse.aether.internal.impl.collect.DefaultDependencyCollectorTest.dep(DefaultDependencyCollectorTest.java:159)
	at org.eclipse.aether.internal.impl.collect.DefaultDependencyCollectorTest.testDependencyManagement(DefaultDependencyCollectorTest.java:456)
Caused by: java.lang.IndexOutOfBoundsException: Index: 1, Size: 0
	at org.eclipse.aether.internal.impl.collect.DefaultDependencyCollectorTest.path(DefaultDependencyCollectorTest.java:169)
	at org.eclipse.aether.internal.impl.collect.DefaultDependencyCollectorTest.dep(DefaultDependencyCollectorTest.java:159)
	at org.eclipse.aether.internal.impl.collect.DefaultDependencyCollectorTest.testDependencyManagement(DefaultDependencyCollectorTest.java:456)


FAILED:  org.eclipse.aether.internal.impl.collect.DefaultDependencyCollectorTest.linux-jdk7 / Build linux-jdk7 / testManagedVersionScope

Error Message:
expected:<1> but was:<0>

Stack Trace:
java.lang.AssertionError: expected:<1> but was:<0>
	at org.eclipse.aether.internal.impl.collect.DefaultDependencyCollectorTest.testManagedVersionScope(DefaultDependencyCollectorTest.java:432)


FAILED:  org.eclipse.aether.internal.impl.collect.DefaultDependencyCollectorTest.windows-jdk8 / Build windows-jdk8 / testDuplicates

Error Message:
illegal coordinates for child

Stack Trace:
java.lang.IllegalArgumentException: illegal coordinates for child
	at org.eclipse.aether.internal.impl.collect.DefaultDependencyCollectorTest.path(DefaultDependencyCollectorTest.java:176)
	at org.eclipse.aether.internal.impl.collect.DefaultDependencyCollectorTest.dep(DefaultDependencyCollectorTest.java:159)
	at org.eclipse.aether.internal.impl.collect.DefaultDependencyCollectorTest.testDuplicates(DefaultDependencyCollectorTest.java:249)
Caused by: java.lang.IndexOutOfBoundsException: Index: 0, Size: 0
	at org.eclipse.aether.internal.impl.collect.DefaultDependencyCollectorTest.path(DefaultDependencyCollectorTest.java:169)
	at org.eclipse.aether.internal.impl.collect.DefaultDependencyCollectorTest.dep(DefaultDependencyCollectorTest.java:159)
	at org.eclipse.aether.internal.impl.collect.DefaultDependencyCollectorTest.testDuplicates(DefaultDependencyCollectorTest.java:249)


FAILED:  org.eclipse.aether.internal.impl.collect.DefaultDependencyCollectorTest.windows-jdk8 / Build windows-jdk8 / testPartialResultOnError

Error Message:
path: [subtree:comparison:ext:error (), duplicate:transitive:ext:dependency (compile)], expected: [gid:aid:ext:ver (compile), gid:aid2:ext:ver (compile)], actual: [] expected:<2> but was:<0>

Stack Trace:
java.lang.AssertionError: path: [subtree:comparison:ext:error (), duplicate:transitive:ext:dependency (compile)], expected: [gid:aid:ext:ver (compile), gid:aid2:ext:ver (compile)], actual: [] expected:<2> but was:<0>
	at org.eclipse.aether.internal.impl.collect.DefaultDependencyCollectorTest.assertEqualSubtree(DefaultDependencyCollectorTest.java:143)
	at org.eclipse.aether.internal.impl.collect.DefaultDependencyCollectorTest.assertEqualSubtree(DefaultDependencyCollectorTest.java:151)
	at org.eclipse.aether.internal.impl.collect.DefaultDependencyCollectorTest.assertEqualSubtree(DefaultDependencyCollectorTest.java:121)
	at org.eclipse.aether.internal.impl.collect.DefaultDependencyCollectorTest.testPartialResultOnError(DefaultDependencyCollectorTest.java:357)


FAILED:  org.eclipse.aether.internal.impl.collect.DefaultDependencyCollectorTest.windows-jdk8 / Build windows-jdk8 / testEqualSubtree

Error Message:
path: [subtree:comparison:ext:ver (), duplicate:transitive:ext:dependency (compile)], expected: [gid:aid:ext:ver (compile), gid:aid2:ext:ver (compile)], actual: [] expected:<2> but was:<0>

Stack Trace:
java.lang.AssertionError: path: [subtree:comparison:ext:ver (), duplicate:transitive:ext:dependency (compile)], expected: [gid:aid:ext:ver (compile), gid:aid2:ext:ver (compile)], actual: [] expected:<2> but was:<0>
	at org.eclipse.aether.internal.impl.collect.DefaultDependencyCollectorTest.assertEqualSubtree(DefaultDependencyCollectorTest.java:143)
	at org.eclipse.aether.internal.impl.collect.DefaultDependencyCollectorTest.assertEqualSubtree(DefaultDependencyCollectorTest.java:151)
	at org.eclipse.aether.internal.impl.collect.DefaultDependencyCollectorTest.assertEqualSubtree(DefaultDependencyCollectorTest.java:121)
	at org.eclipse.aether.internal.impl.collect.DefaultDependencyCollectorTest.testEqualSubtree(DefaultDependencyCollectorTest.java:262)


FAILED:  org.eclipse.aether.internal.impl.collect.DefaultDependencyCollectorTest.windows-jdk8 / Build windows-jdk8 / testDependencyManagement_DefaultDependencyManager

Error Message:
path: [gid:root:ext:ver (compile), gid:direct:ext:managed-by-dominant-request (compile)], expected: [gid:transitive-1:ext:managed-by-root (compile)], actual: [] expected:<1> but was:<0>

Stack Trace:
java.lang.AssertionError: path: [gid:root:ext:ver (compile), gid:direct:ext:managed-by-dominant-request (compile)], expected: [gid:transitive-1:ext:managed-by-root (compile)], actual: [] expected:<1> but was:<0>
	at org.eclipse.aether.internal.impl.collect.DefaultDependencyCollectorTest.assertEqualSubtree(DefaultDependencyCollectorTest.java:143)
	at org.eclipse.aether.internal.impl.collect.DefaultDependencyCollectorTest.assertEqualSubtree(DefaultDependencyCollectorTest.java:151)
	at org.eclipse.aether.internal.impl.collect.DefaultDependencyCollectorTest.assertEqualSubtree(DefaultDependencyCollectorTest.java:121)
	at org.eclipse.aether.internal.impl.collect.DefaultDependencyCollectorTest.testDependencyManagement_DefaultDependencyManager(DefaultDependencyCollectorTest.java:529)


FAILED:  org.eclipse.aether.internal.impl.collect.DefaultDependencyCollectorTest.windows-jdk8 / Build windows-jdk8 / testCollectMultipleDependencies

Error Message:
expected:<1> but was:<0>

Stack Trace:
java.lang.AssertionError: expected:<1> but was:<0>
	at org.eclipse.aether.internal.impl.collect.DefaultDependencyCollectorTest.testCollectMultipleDependencies(DefaultDependencyCollectorTest.java:375)


FAILED:  org.eclipse.aether.internal.impl.collect.DefaultDependencyCollectorTest.windows-jdk8 / Build windows-jdk8 / testCyclicProjects

Error Message:
illegal coordinates for child

Stack Trace:
java.lang.IllegalArgumentException: illegal coordinates for child
	at org.eclipse.aether.internal.impl.collect.DefaultDependencyCollectorTest.path(DefaultDependencyCollectorTest.java:176)
	at org.eclipse.aether.internal.impl.collect.DefaultDependencyCollectorTest.testCyclicProjects(DefaultDependencyCollectorTest.java:294)
Caused by: java.lang.IndexOutOfBoundsException: Index: 0, Size: 0
	at org.eclipse.aether.internal.impl.collect.DefaultDependencyCollectorTest.path(DefaultDependencyCollectorTest.java:169)
	at org.eclipse.aether.internal.impl.collect.DefaultDependencyCollectorTest.testCyclicProjects(DefaultDependencyCollectorTest.java:294)


FAILED:  org.eclipse.aether.internal.impl.collect.DefaultDependencyCollectorTest.windows-jdk8 / Build windows-jdk8 / testCyclicDependencies

Error Message:
path: [cycle:root:jar:1 (), cycle:a:jar:1 (compile)], expected: [cycle:b:jar:1 (compile)], actual: [] expected:<1> but was:<0>

Stack Trace:
java.lang.AssertionError: path: [cycle:root:jar:1 (), cycle:a:jar:1 (compile)], expected: [cycle:b:jar:1 (compile)], actual: [] expected:<1> but was:<0>
	at org.eclipse.aether.internal.impl.collect.DefaultDependencyCollectorTest.assertEqualSubtree(DefaultDependencyCollectorTest.java:143)
	at org.eclipse.aether.internal.impl.collect.DefaultDependencyCollectorTest.assertEqualSubtree(DefaultDependencyCollectorTest.java:151)
	at org.eclipse.aether.internal.impl.collect.DefaultDependencyCollectorTest.assertEqualSubtree(DefaultDependencyCollectorTest.java:121)
	at org.eclipse.aether.internal.impl.collect.DefaultDependencyCollectorTest.testCyclicDependencies(DefaultDependencyCollectorTest.java:272)


FAILED:  org.eclipse.aether.internal.impl.collect.DefaultDependencyCollectorTest.windows-jdk8 / Build windows-jdk8 / testCyclicProjects_ConsiderLabelOfRootlessGraph

Error Message:
Index: 0, Size: 0

Stack Trace:
java.lang.IndexOutOfBoundsException: Index: 0, Size: 0
	at org.eclipse.aether.internal.impl.collect.DefaultDependencyCollectorTest.testCyclicProjects_ConsiderLabelOfRootlessGraph(DefaultDependencyCollectorTest.java:321)


FAILED:  org.eclipse.aether.internal.impl.collect.DefaultDependencyCollectorTest.windows-jdk8 / Build windows-jdk8 / testDependencyManagement_TransitiveDependencyManager

Error Message:
path: [gid:root:ext:ver (compile), gid:direct:ext:ver (compile)], expected: [gid:transitive-1:ext:managed-by-root (compile)], actual: [] expected:<1> but was:<0>

Stack Trace:
java.lang.AssertionError: path: [gid:root:ext:ver (compile), gid:direct:ext:ver (compile)], expected: [gid:transitive-1:ext:managed-by-root (compile)], actual: [] expected:<1> but was:<0>
	at org.eclipse.aether.internal.impl.collect.DefaultDependencyCollectorTest.assertEqualSubtree(DefaultDependencyCollectorTest.java:143)
	at org.eclipse.aether.internal.impl.collect.DefaultDependencyCollectorTest.assertEqualSubtree(DefaultDependencyCollectorTest.java:151)
	at org.eclipse.aether.internal.impl.collect.DefaultDependencyCollectorTest.assertEqualSubtree(DefaultDependencyCollectorTest.java:121)
	at org.eclipse.aether.internal.impl.collect.DefaultDependencyCollectorTest.testDependencyManagement_TransitiveDependencyManager(DefaultDependencyCollectorTest.java:500)


FAILED:  org.eclipse.aether.internal.impl.collect.DefaultDependencyCollectorTest.windows-jdk8 / Build windows-jdk8 / testDependencyManagement

Error Message:
illegal coordinates for child

Stack Trace:
java.lang.IllegalArgumentException: illegal coordinates for child
	at org.eclipse.aether.internal.impl.collect.DefaultDependencyCollectorTest.path(DefaultDependencyCollectorTest.java:176)
	at org.eclipse.aether.internal.impl.collect.DefaultDependencyCollectorTest.dep(DefaultDependencyCollectorTest.java:159)
	at org.eclipse.aether.internal.impl.collect.DefaultDependencyCollectorTest.testDependencyManagement(DefaultDependencyCollectorTest.java:456)
Caused by: java.lang.IndexOutOfBoundsException: Index: 1, Size: 0
	at org.eclipse.aether.internal.impl.collect.DefaultDependencyCollectorTest.path(DefaultDependencyCollectorTest.java:169)
	at org.eclipse.aether.internal.impl.collect.DefaultDependencyCollectorTest.dep(DefaultDependencyCollectorTest.java:159)
	at org.eclipse.aether.internal.impl.collect.DefaultDependencyCollectorTest.testDependencyManagement(DefaultDependencyCollectorTest.java:456)


FAILED:  org.eclipse.aether.internal.impl.collect.DefaultDependencyCollectorTest.windows-jdk8 / Build windows-jdk8 / testManagedVersionScope

Error Message:
expected:<1> but was:<0>

Stack Trace:
java.lang.AssertionError: expected:<1> but was:<0>
	at org.eclipse.aether.internal.impl.collect.DefaultDependencyCollectorTest.testManagedVersionScope(DefaultDependencyCollectorTest.java:432)


FAILED:  org.eclipse.aether.internal.impl.collect.DefaultDependencyCollectorTest.windows-jdk12 / Build windows-jdk12 / testDuplicates

Error Message:
illegal coordinates for child

Stack Trace:
java.lang.IllegalArgumentException: illegal coordinates for child
	at org.eclipse.aether.internal.impl.collect.DefaultDependencyCollectorTest.path(DefaultDependencyCollectorTest.java:176)
	at org.eclipse.aether.internal.impl.collect.DefaultDependencyCollectorTest.dep(DefaultDependencyCollectorTest.java:159)
	at org.eclipse.aether.internal.impl.collect.DefaultDependencyCollectorTest.testDuplicates(DefaultDependencyCollectorTest.java:249)
Caused by: java.lang.IndexOutOfBoundsException: Index 0 out of bounds for length 0
	at org.eclipse.aether.internal.impl.collect.DefaultDependencyCollectorTest.path(DefaultDependencyCollectorTest.java:169)
	at org.eclipse.aether.internal.impl.collect.DefaultDependencyCollectorTest.dep(DefaultDependencyCollectorTest.java:159)
	at org.eclipse.aether.internal.impl.collect.DefaultDependencyCollectorTest.testDuplicates(DefaultDependencyCollectorTest.java:249)


FAILED:  org.eclipse.aether.internal.impl.collect.DefaultDependencyCollectorTest.windows-jdk12 / Build windows-jdk12 / testPartialResultOnError

Error Message:
path: [subtree:comparison:ext:error (), duplicate:transitive:ext:dependency (compile)], expected: [gid:aid:ext:ver (compile), gid:aid2:ext:ver (compile)], actual: [] expected:<2> but was:<0>

Stack Trace:
java.lang.AssertionError: path: [subtree:comparison:ext:error (), duplicate:transitive:ext:dependency (compile)], expected: [gid:aid:ext:ver (compile), gid:aid2:ext:ver (compile)], actual: [] expected:<2> but was:<0>
	at org.eclipse.aether.internal.impl.collect.DefaultDependencyCollectorTest.assertEqualSubtree(DefaultDependencyCollectorTest.java:143)
	at org.eclipse.aether.internal.impl.collect.DefaultDependencyCollectorTest.assertEqualSubtree(DefaultDependencyCollectorTest.java:151)
	at org.eclipse.aether.internal.impl.collect.DefaultDependencyCollectorTest.assertEqualSubtree(DefaultDependencyCollectorTest.java:121)
	at org.eclipse.aether.internal.impl.collect.DefaultDependencyCollectorTest.testPartialResultOnError(DefaultDependencyCollectorTest.java:357)


FAILED:  org.eclipse.aether.internal.impl.collect.DefaultDependencyCollectorTest.windows-jdk12 / Build windows-jdk12 / testEqualSubtree

Error Message:
path: [subtree:comparison:ext:ver (), duplicate:transitive:ext:dependency (compile)], expected: [gid:aid:ext:ver (compile), gid:aid2:ext:ver (compile)], actual: [] expected:<2> but was:<0>

Stack Trace:
java.lang.AssertionError: path: [subtree:comparison:ext:ver (), duplicate:transitive:ext:dependency (compile)], expected: [gid:aid:ext:ver (compile), gid:aid2:ext:ver (compile)], actual: [] expected:<2> but was:<0>
	at org.eclipse.aether.internal.impl.collect.DefaultDependencyCollectorTest.assertEqualSubtree(DefaultDependencyCollectorTest.java:143)
	at org.eclipse.aether.internal.impl.collect.DefaultDependencyCollectorTest.assertEqualSubtree(DefaultDependencyCollectorTest.java:151)
	at org.eclipse.aether.internal.impl.collect.DefaultDependencyCollectorTest.assertEqualSubtree(DefaultDependencyCollectorTest.java:121)
	at org.eclipse.aether.internal.impl.collect.DefaultDependencyCollectorTest.testEqualSubtree(DefaultDependencyCollectorTest.java:262)


FAILED:  org.eclipse.aether.internal.impl.collect.DefaultDependencyCollectorTest.windows-jdk12 / Build windows-jdk12 / testDependencyManagement_DefaultDependencyManager

Error Message:
path: [gid:root:ext:ver (compile), gid:direct:ext:managed-by-dominant-request (compile)], expected: [gid:transitive-1:ext:managed-by-root (compile)], actual: [] expected:<1> but was:<0>

Stack Trace:
java.lang.AssertionError: path: [gid:root:ext:ver (compile), gid:direct:ext:managed-by-dominant-request (compile)], expected: [gid:transitive-1:ext:managed-by-root (compile)], actual: [] expected:<1> but was:<0>
	at org.eclipse.aether.internal.impl.collect.DefaultDependencyCollectorTest.assertEqualSubtree(DefaultDependencyCollectorTest.java:143)
	at org.eclipse.aether.internal.impl.collect.DefaultDependencyCollectorTest.assertEqualSubtree(DefaultDependencyCollectorTest.java:151)
	at org.eclipse.aether.internal.impl.collect.DefaultDependencyCollectorTest.assertEqualSubtree(DefaultDependencyCollectorTest.java:121)
	at org.eclipse.aether.internal.impl.collect.DefaultDependencyCollectorTest.testDependencyManagement_DefaultDependencyManager(DefaultDependencyCollectorTest.java:529)


FAILED:  org.eclipse.aether.internal.impl.collect.DefaultDependencyCollectorTest.windows-jdk12 / Build windows-jdk12 / testCollectMultipleDependencies

Error Message:
expected:<1> but was:<0>

Stack Trace:
java.lang.AssertionError: expected:<1> but was:<0>
	at org.eclipse.aether.internal.impl.collect.DefaultDependencyCollectorTest.testCollectMultipleDependencies(DefaultDependencyCollectorTest.java:375)


FAILED:  org.eclipse.aether.internal.impl.collect.DefaultDependencyCollectorTest.windows-jdk12 / Build windows-jdk12 / testCyclicProjects

Error Message:
illegal coordinates for child

Stack Trace:
java.lang.IllegalArgumentException: illegal coordinates for child
	at org.eclipse.aether.internal.impl.collect.DefaultDependencyCollectorTest.path(DefaultDependencyCollectorTest.java:176)
	at org.eclipse.aether.internal.impl.collect.DefaultDependencyCollectorTest.testCyclicProjects(DefaultDependencyCollectorTest.java:294)
Caused by: java.lang.IndexOutOfBoundsException: Index 0 out of bounds for length 0
	at org.eclipse.aether.internal.impl.collect.DefaultDependencyCollectorTest.path(DefaultDependencyCollectorTest.java:169)
	at org.eclipse.aether.internal.impl.collect.DefaultDependencyCollectorTest.testCyclicProjects(DefaultDependencyCollectorTest.java:294)


FAILED:  org.eclipse.aether.internal.impl.collect.DefaultDependencyCollectorTest.windows-jdk12 / Build windows-jdk12 / testCyclicDependencies

Error Message:
path: [cycle:root:jar:1 (), cycle:a:jar:1 (compile)], expected: [cycle:b:jar:1 (compile)], actual: [] expected:<1> but was:<0>

Stack Trace:
java.lang.AssertionError: path: [cycle:root:jar:1 (), cycle:a:jar:1 (compile)], expected: [cycle:b:jar:1 (compile)], actual: [] expected:<1> but was:<0>
	at org.eclipse.aether.internal.impl.collect.DefaultDependencyCollectorTest.assertEqualSubtree(DefaultDependencyCollectorTest.java:143)
	at org.eclipse.aether.internal.impl.collect.DefaultDependencyCollectorTest.assertEqualSubtree(DefaultDependencyCollectorTest.java:151)
	at org.eclipse.aether.internal.impl.collect.DefaultDependencyCollectorTest.assertEqualSubtree(DefaultDependencyCollectorTest.java:121)
	at org.eclipse.aether.internal.impl.collect.DefaultDependencyCollectorTest.testCyclicDependencies(DefaultDependencyCollectorTest.java:272)


FAILED:  org.eclipse.aether.internal.impl.collect.DefaultDependencyCollectorTest.windows-jdk12 / Build windows-jdk12 / testCyclicProjects_ConsiderLabelOfRootlessGraph

Error Message:
Index 0 out of bounds for length 0

Stack Trace:
java.lang.IndexOutOfBoundsException: Index 0 out of bounds for length 0
	at org.eclipse.aether.internal.impl.collect.DefaultDependencyCollectorTest.testCyclicProjects_ConsiderLabelOfRootlessGraph(DefaultDependencyCollectorTest.java:321)


FAILED:  org.eclipse.aether.internal.impl.collect.DefaultDependencyCollectorTest.windows-jdk12 / Build windows-jdk12 / testDependencyManagement_TransitiveDependencyManager

Error Message:
path: [gid:root:ext:ver (compile), gid:direct:ext:ver (compile)], expected: [gid:transitive-1:ext:managed-by-root (compile)], actual: [] expected:<1> but was:<0>

Stack Trace:
java.lang.AssertionError: path: [gid:root:ext:ver (compile), gid:direct:ext:ver (compile)], expected: [gid:transitive-1:ext:managed-by-root (compile)], actual: [] expected:<1> but was:<0>
	at org.eclipse.aether.internal.impl.collect.DefaultDependencyCollectorTest.assertEqualSubtree(DefaultDependencyCollectorTest.java:143)
	at org.eclipse.aether.internal.impl.collect.DefaultDependencyCollectorTest.assertEqualSubtree(DefaultDependencyCollectorTest.java:151)
	at org.eclipse.aether.internal.impl.collect.DefaultDependencyCollectorTest.assertEqualSubtree(DefaultDependencyCollectorTest.java:121)
	at org.eclipse.aether.internal.impl.collect.DefaultDependencyCollectorTest.testDependencyManagement_TransitiveDependencyManager(DefaultDependencyCollectorTest.java:500)


FAILED:  org.eclipse.aether.internal.impl.collect.DefaultDependencyCollectorTest.windows-jdk12 / Build windows-jdk12 / testDependencyManagement

Error Message:
illegal coordinates for child

Stack Trace:
java.lang.IllegalArgumentException: illegal coordinates for child
	at org.eclipse.aether.internal.impl.collect.DefaultDependencyCollectorTest.path(DefaultDependencyCollectorTest.java:176)
	at org.eclipse.aether.internal.impl.collect.DefaultDependencyCollectorTest.dep(DefaultDependencyCollectorTest.java:159)
	at org.eclipse.aether.internal.impl.collect.DefaultDependencyCollectorTest.testDependencyManagement(DefaultDependencyCollectorTest.java:456)
Caused by: java.lang.IndexOutOfBoundsException: Index 1 out of bounds for length 0
	at org.eclipse.aether.internal.impl.collect.DefaultDependencyCollectorTest.path(DefaultDependencyCollectorTest.java:169)
	at org.eclipse.aether.internal.impl.collect.DefaultDependencyCollectorTest.dep(DefaultDependencyCollectorTest.java:159)
	at org.eclipse.aether.internal.impl.collect.DefaultDependencyCollectorTest.testDependencyManagement(DefaultDependencyCollectorTest.java:456)


FAILED:  org.eclipse.aether.internal.impl.collect.DefaultDependencyCollectorTest.windows-jdk12 / Build windows-jdk12 / testManagedVersionScope

Error Message:
expected:<1> but was:<0>

Stack Trace:
java.lang.AssertionError: expected:<1> but was:<0>
	at org.eclipse.aether.internal.impl.collect.DefaultDependencyCollectorTest.testManagedVersionScope(DefaultDependencyCollectorTest.java:432)


FAILED:  org.eclipse.aether.internal.impl.collect.DefaultDependencyCollectorTest.windows-jdk7 / Build windows-jdk7 / testDuplicates

Error Message:
illegal coordinates for child

Stack Trace:
java.lang.IllegalArgumentException: illegal coordinates for child
	at org.eclipse.aether.internal.impl.collect.DefaultDependencyCollectorTest.path(DefaultDependencyCollectorTest.java:176)
	at org.eclipse.aether.internal.impl.collect.DefaultDependencyCollectorTest.dep(DefaultDependencyCollectorTest.java:159)
	at org.eclipse.aether.internal.impl.collect.DefaultDependencyCollectorTest.testDuplicates(DefaultDependencyCollectorTest.java:249)
Caused by: java.lang.IndexOutOfBoundsException: Index: 0, Size: 0
	at org.eclipse.aether.internal.impl.collect.DefaultDependencyCollectorTest.path(DefaultDependencyCollectorTest.java:169)
	at org.eclipse.aether.internal.impl.collect.DefaultDependencyCollectorTest.dep(DefaultDependencyCollectorTest.java:159)
	at org.eclipse.aether.internal.impl.collect.DefaultDependencyCollectorTest.testDuplicates(DefaultDependencyCollectorTest.java:249)


FAILED:  org.eclipse.aether.internal.impl.collect.DefaultDependencyCollectorTest.windows-jdk7 / Build windows-jdk7 / testPartialResultOnError

Error Message:
path: [subtree:comparison:ext:error (), duplicate:transitive:ext:dependency (compile)], expected: [gid:aid:ext:ver (compile), gid:aid2:ext:ver (compile)], actual: [] expected:<2> but was:<0>

Stack Trace:
java.lang.AssertionError: path: [subtree:comparison:ext:error (), duplicate:transitive:ext:dependency (compile)], expected: [gid:aid:ext:ver (compile), gid:aid2:ext:ver (compile)], actual: [] expected:<2> but was:<0>
	at org.eclipse.aether.internal.impl.collect.DefaultDependencyCollectorTest.assertEqualSubtree(DefaultDependencyCollectorTest.java:143)
	at org.eclipse.aether.internal.impl.collect.DefaultDependencyCollectorTest.assertEqualSubtree(DefaultDependencyCollectorTest.java:151)
	at org.eclipse.aether.internal.impl.collect.DefaultDependencyCollectorTest.assertEqualSubtree(DefaultDependencyCollectorTest.java:121)
	at org.eclipse.aether.internal.impl.collect.DefaultDependencyCollectorTest.testPartialResultOnError(DefaultDependencyCollectorTest.java:357)


FAILED:  org.eclipse.aether.internal.impl.collect.DefaultDependencyCollectorTest.windows-jdk7 / Build windows-jdk7 / testEqualSubtree

Error Message:
path: [subtree:comparison:ext:ver (), duplicate:transitive:ext:dependency (compile)], expected: [gid:aid:ext:ver (compile), gid:aid2:ext:ver (compile)], actual: [] expected:<2> but was:<0>

Stack Trace:
java.lang.AssertionError: path: [subtree:comparison:ext:ver (), duplicate:transitive:ext:dependency (compile)], expected: [gid:aid:ext:ver (compile), gid:aid2:ext:ver (compile)], actual: [] expected:<2> but was:<0>
	at org.eclipse.aether.internal.impl.collect.DefaultDependencyCollectorTest.assertEqualSubtree(DefaultDependencyCollectorTest.java:143)
	at org.eclipse.aether.internal.impl.collect.DefaultDependencyCollectorTest.assertEqualSubtree(DefaultDependencyCollectorTest.java:151)
	at org.eclipse.aether.internal.impl.collect.DefaultDependencyCollectorTest.assertEqualSubtree(DefaultDependencyCollectorTest.java:121)
	at org.eclipse.aether.internal.impl.collect.DefaultDependencyCollectorTest.testEqualSubtree(DefaultDependencyCollectorTest.java:262)


FAILED:  org.eclipse.aether.internal.impl.collect.DefaultDependencyCollectorTest.windows-jdk7 / Build windows-jdk7 / testDependencyManagement_DefaultDependencyManager

Error Message:
path: [gid:root:ext:ver (compile), gid:direct:ext:managed-by-dominant-request (compile)], expected: [gid:transitive-1:ext:managed-by-root (compile)], actual: [] expected:<1> but was:<0>

Stack Trace:
java.lang.AssertionError: path: [gid:root:ext:ver (compile), gid:direct:ext:managed-by-dominant-request (compile)], expected: [gid:transitive-1:ext:managed-by-root (compile)], actual: [] expected:<1> but was:<0>
	at org.eclipse.aether.internal.impl.collect.DefaultDependencyCollectorTest.assertEqualSubtree(DefaultDependencyCollectorTest.java:143)
	at org.eclipse.aether.internal.impl.collect.DefaultDependencyCollectorTest.assertEqualSubtree(DefaultDependencyCollectorTest.java:151)
	at org.eclipse.aether.internal.impl.collect.DefaultDependencyCollectorTest.assertEqualSubtree(DefaultDependencyCollectorTest.java:121)
	at org.eclipse.aether.internal.impl.collect.DefaultDependencyCollectorTest.testDependencyManagement_DefaultDependencyManager(DefaultDependencyCollectorTest.java:529)


FAILED:  org.eclipse.aether.internal.impl.collect.DefaultDependencyCollectorTest.windows-jdk7 / Build windows-jdk7 / testCollectMultipleDependencies

Error Message:
expected:<1> but was:<0>

Stack Trace:
java.lang.AssertionError: expected:<1> but was:<0>
	at org.eclipse.aether.internal.impl.collect.DefaultDependencyCollectorTest.testCollectMultipleDependencies(DefaultDependencyCollectorTest.java:375)


FAILED:  org.eclipse.aether.internal.impl.collect.DefaultDependencyCollectorTest.windows-jdk7 / Build windows-jdk7 / testCyclicProjects

Error Message:
illegal coordinates for child

Stack Trace:
java.lang.IllegalArgumentException: illegal coordinates for child
	at org.eclipse.aether.internal.impl.collect.DefaultDependencyCollectorTest.path(DefaultDependencyCollectorTest.java:176)
	at org.eclipse.aether.internal.impl.collect.DefaultDependencyCollectorTest.testCyclicProjects(DefaultDependencyCollectorTest.java:294)
Caused by: java.lang.IndexOutOfBoundsException: Index: 0, Size: 0
	at org.eclipse.aether.internal.impl.collect.DefaultDependencyCollectorTest.path(DefaultDependencyCollectorTest.java:169)
	at org.eclipse.aether.internal.impl.collect.DefaultDependencyCollectorTest.testCyclicProjects(DefaultDependencyCollectorTest.java:294)


FAILED:  org.eclipse.aether.internal.impl.collect.DefaultDependencyCollectorTest.windows-jdk7 / Build windows-jdk7 / testCyclicDependencies

Error Message:
path: [cycle:root:jar:1 (), cycle:a:jar:1 (compile)], expected: [cycle:b:jar:1 (compile)], actual: [] expected:<1> but was:<0>

Stack Trace:
java.lang.AssertionError: path: [cycle:root:jar:1 (), cycle:a:jar:1 (compile)], expected: [cycle:b:jar:1 (compile)], actual: [] expected:<1> but was:<0>
	at org.eclipse.aether.internal.impl.collect.DefaultDependencyCollectorTest.assertEqualSubtree(DefaultDependencyCollectorTest.java:143)
	at org.eclipse.aether.internal.impl.collect.DefaultDependencyCollectorTest.assertEqualSubtree(DefaultDependencyCollectorTest.java:151)
	at org.eclipse.aether.internal.impl.collect.DefaultDependencyCollectorTest.assertEqualSubtree(DefaultDependencyCollectorTest.java:121)
	at org.eclipse.aether.internal.impl.collect.DefaultDependencyCollectorTest.testCyclicDependencies(DefaultDependencyCollectorTest.java:272)


FAILED:  org.eclipse.aether.internal.impl.collect.DefaultDependencyCollectorTest.windows-jdk7 / Build windows-jdk7 / testCyclicProjects_ConsiderLabelOfRootlessGraph

Error Message:
Index: 0, Size: 0

Stack Trace:
java.lang.IndexOutOfBoundsException: Index: 0, Size: 0
	at org.eclipse.aether.internal.impl.collect.DefaultDependencyCollectorTest.testCyclicProjects_ConsiderLabelOfRootlessGraph(DefaultDependencyCollectorTest.java:321)


FAILED:  org.eclipse.aether.internal.impl.collect.DefaultDependencyCollectorTest.windows-jdk7 / Build windows-jdk7 / testDependencyManagement_TransitiveDependencyManager

Error Message:
path: [gid:root:ext:ver (compile), gid:direct:ext:ver (compile)], expected: [gid:transitive-1:ext:managed-by-root (compile)], actual: [] expected:<1> but was:<0>

Stack Trace:
java.lang.AssertionError: path: [gid:root:ext:ver (compile), gid:direct:ext:ver (compile)], expected: [gid:transitive-1:ext:managed-by-root (compile)], actual: [] expected:<1> but was:<0>
	at org.eclipse.aether.internal.impl.collect.DefaultDependencyCollectorTest.assertEqualSubtree(DefaultDependencyCollectorTest.java:143)
	at org.eclipse.aether.internal.impl.collect.DefaultDependencyCollectorTest.assertEqualSubtree(DefaultDependencyCollectorTest.java:151)
	at org.eclipse.aether.internal.impl.collect.DefaultDependencyCollectorTest.assertEqualSubtree(DefaultDependencyCollectorTest.java:121)
	at org.eclipse.aether.internal.impl.collect.DefaultDependencyCollectorTest.testDependencyManagement_TransitiveDependencyManager(DefaultDependencyCollectorTest.java:500)


FAILED:  org.eclipse.aether.internal.impl.collect.DefaultDependencyCollectorTest.windows-jdk7 / Build windows-jdk7 / testDependencyManagement

Error Message:
illegal coordinates for child

Stack Trace:
java.lang.IllegalArgumentException: illegal coordinates for child
	at org.eclipse.aether.internal.impl.collect.DefaultDependencyCollectorTest.path(DefaultDependencyCollectorTest.java:176)
	at org.eclipse.aether.internal.impl.collect.DefaultDependencyCollectorTest.dep(DefaultDependencyCollectorTest.java:159)
	at org.eclipse.aether.internal.impl.collect.DefaultDependencyCollectorTest.testDependencyManagement(DefaultDependencyCollectorTest.java:456)
Caused by: java.lang.IndexOutOfBoundsException: Index: 1, Size: 0
	at org.eclipse.aether.internal.impl.collect.DefaultDependencyCollectorTest.path(DefaultDependencyCollectorTest.java:169)
	at org.eclipse.aether.internal.impl.collect.DefaultDependencyCollectorTest.dep(DefaultDependencyCollectorTest.java:159)
	at org.eclipse.aether.internal.impl.collect.DefaultDependencyCollectorTest.testDependencyManagement(DefaultDependencyCollectorTest.java:456)


FAILED:  org.eclipse.aether.internal.impl.collect.DefaultDependencyCollectorTest.windows-jdk7 / Build windows-jdk7 / testManagedVersionScope

Error Message:
expected:<1> but was:<0>

Stack Trace:
java.lang.AssertionError: expected:<1> but was:<0>
	at org.eclipse.aether.internal.impl.collect.DefaultDependencyCollectorTest.testManagedVersionScope(DefaultDependencyCollectorTest.java:432)


FAILED:  org.eclipse.aether.internal.impl.collect.DefaultDependencyCollectorTest.windows-jdk11 / Build windows-jdk11 / testDuplicates

Error Message:
illegal coordinates for child

Stack Trace:
java.lang.IllegalArgumentException: illegal coordinates for child
	at org.eclipse.aether.internal.impl.collect.DefaultDependencyCollectorTest.path(DefaultDependencyCollectorTest.java:176)
	at org.eclipse.aether.internal.impl.collect.DefaultDependencyCollectorTest.dep(DefaultDependencyCollectorTest.java:159)
	at org.eclipse.aether.internal.impl.collect.DefaultDependencyCollectorTest.testDuplicates(DefaultDependencyCollectorTest.java:249)
Caused by: java.lang.IndexOutOfBoundsException: Index 0 out of bounds for length 0
	at org.eclipse.aether.internal.impl.collect.DefaultDependencyCollectorTest.path(DefaultDependencyCollectorTest.java:169)
	at org.eclipse.aether.internal.impl.collect.DefaultDependencyCollectorTest.dep(DefaultDependencyCollectorTest.java:159)
	at org.eclipse.aether.internal.impl.collect.DefaultDependencyCollectorTest.testDuplicates(DefaultDependencyCollectorTest.java:249)


FAILED:  org.eclipse.aether.internal.impl.collect.DefaultDependencyCollectorTest.windows-jdk11 / Build windows-jdk11 / testPartialResultOnError

Error Message:
path: [subtree:comparison:ext:error (), duplicate:transitive:ext:dependency (compile)], expected: [gid:aid:ext:ver (compile), gid:aid2:ext:ver (compile)], actual: [] expected:<2> but was:<0>

Stack Trace:
java.lang.AssertionError: path: [subtree:comparison:ext:error (), duplicate:transitive:ext:dependency (compile)], expected: [gid:aid:ext:ver (compile), gid:aid2:ext:ver (compile)], actual: [] expected:<2> but was:<0>
	at org.eclipse.aether.internal.impl.collect.DefaultDependencyCollectorTest.assertEqualSubtree(DefaultDependencyCollectorTest.java:143)
	at org.eclipse.aether.internal.impl.collect.DefaultDependencyCollectorTest.assertEqualSubtree(DefaultDependencyCollectorTest.java:151)
	at org.eclipse.aether.internal.impl.collect.DefaultDependencyCollectorTest.assertEqualSubtree(DefaultDependencyCollectorTest.java:121)
	at org.eclipse.aether.internal.impl.collect.DefaultDependencyCollectorTest.testPartialResultOnError(DefaultDependencyCollectorTest.java:357)


FAILED:  org.eclipse.aether.internal.impl.collect.DefaultDependencyCollectorTest.windows-jdk11 / Build windows-jdk11 / testEqualSubtree

Error Message:
path: [subtree:comparison:ext:ver (), duplicate:transitive:ext:dependency (compile)], expected: [gid:aid:ext:ver (compile), gid:aid2:ext:ver (compile)], actual: [] expected:<2> but was:<0>

Stack Trace:
java.lang.AssertionError: path: [subtree:comparison:ext:ver (), duplicate:transitive:ext:dependency (compile)], expected: [gid:aid:ext:ver (compile), gid:aid2:ext:ver (compile)], actual: [] expected:<2> but was:<0>
	at org.eclipse.aether.internal.impl.collect.DefaultDependencyCollectorTest.assertEqualSubtree(DefaultDependencyCollectorTest.java:143)
	at org.eclipse.aether.internal.impl.collect.DefaultDependencyCollectorTest.assertEqualSubtree(DefaultDependencyCollectorTest.java:151)
	at org.eclipse.aether.internal.impl.collect.DefaultDependencyCollectorTest.assertEqualSubtree(DefaultDependencyCollectorTest.java:121)
	at org.eclipse.aether.internal.impl.collect.DefaultDependencyCollectorTest.testEqualSubtree(DefaultDependencyCollectorTest.java:262)


FAILED:  org.eclipse.aether.internal.impl.collect.DefaultDependencyCollectorTest.windows-jdk11 / Build windows-jdk11 / testDependencyManagement_DefaultDependencyManager

Error Message:
path: [gid:root:ext:ver (compile), gid:direct:ext:managed-by-dominant-request (compile)], expected: [gid:transitive-1:ext:managed-by-root (compile)], actual: [] expected:<1> but was:<0>

Stack Trace:
java.lang.AssertionError: path: [gid:root:ext:ver (compile), gid:direct:ext:managed-by-dominant-request (compile)], expected: [gid:transitive-1:ext:managed-by-root (compile)], actual: [] expected:<1> but was:<0>
	at org.eclipse.aether.internal.impl.collect.DefaultDependencyCollectorTest.assertEqualSubtree(DefaultDependencyCollectorTest.java:143)
	at org.eclipse.aether.internal.impl.collect.DefaultDependencyCollectorTest.assertEqualSubtree(DefaultDependencyCollectorTest.java:151)
	at org.eclipse.aether.internal.impl.collect.DefaultDependencyCollectorTest.assertEqualSubtree(DefaultDependencyCollectorTest.java:121)
	at org.eclipse.aether.internal.impl.collect.DefaultDependencyCollectorTest.testDependencyManagement_DefaultDependencyManager(DefaultDependencyCollectorTest.java:529)


FAILED:  org.eclipse.aether.internal.impl.collect.DefaultDependencyCollectorTest.windows-jdk11 / Build windows-jdk11 / testCollectMultipleDependencies

Error Message:
expected:<1> but was:<0>

Stack Trace:
java.lang.AssertionError: expected:<1> but was:<0>
	at org.eclipse.aether.internal.impl.collect.DefaultDependencyCollectorTest.testCollectMultipleDependencies(DefaultDependencyCollectorTest.java:375)


FAILED:  org.eclipse.aether.internal.impl.collect.DefaultDependencyCollectorTest.windows-jdk11 / Build windows-jdk11 / testCyclicProjects

Error Message:
illegal coordinates for child

Stack Trace:
java.lang.IllegalArgumentException: illegal coordinates for child
	at org.eclipse.aether.internal.impl.collect.DefaultDependencyCollectorTest.path(DefaultDependencyCollectorTest.java:176)
	at org.eclipse.aether.internal.impl.collect.DefaultDependencyCollectorTest.testCyclicProjects(DefaultDependencyCollectorTest.java:294)
Caused by: java.lang.IndexOutOfBoundsException: Index 0 out of bounds for length 0
	at org.eclipse.aether.internal.impl.collect.DefaultDependencyCollectorTest.path(DefaultDependencyCollectorTest.java:169)
	at org.eclipse.aether.internal.impl.collect.DefaultDependencyCollectorTest.testCyclicProjects(DefaultDependencyCollectorTest.java:294)


FAILED:  org.eclipse.aether.internal.impl.collect.DefaultDependencyCollectorTest.windows-jdk11 / Build windows-jdk11 / testCyclicDependencies

Error Message:
path: [cycle:root:jar:1 (), cycle:a:jar:1 (compile)], expected: [cycle:b:jar:1 (compile)], actual: [] expected:<1> but was:<0>

Stack Trace:
java.lang.AssertionError: path: [cycle:root:jar:1 (), cycle:a:jar:1 (compile)], expected: [cycle:b:jar:1 (compile)], actual: [] expected:<1> but was:<0>
	at org.eclipse.aether.internal.impl.collect.DefaultDependencyCollectorTest.assertEqualSubtree(DefaultDependencyCollectorTest.java:143)
	at org.eclipse.aether.internal.impl.collect.DefaultDependencyCollectorTest.assertEqualSubtree(DefaultDependencyCollectorTest.java:151)
	at org.eclipse.aether.internal.impl.collect.DefaultDependencyCollectorTest.assertEqualSubtree(DefaultDependencyCollectorTest.java:121)
	at org.eclipse.aether.internal.impl.collect.DefaultDependencyCollectorTest.testCyclicDependencies(DefaultDependencyCollectorTest.java:272)


FAILED:  org.eclipse.aether.internal.impl.collect.DefaultDependencyCollectorTest.windows-jdk11 / Build windows-jdk11 / testCyclicProjects_ConsiderLabelOfRootlessGraph

Error Message:
Index 0 out of bounds for length 0

Stack Trace:
java.lang.IndexOutOfBoundsException: Index 0 out of bounds for length 0
	at org.eclipse.aether.internal.impl.collect.DefaultDependencyCollectorTest.testCyclicProjects_ConsiderLabelOfRootlessGraph(DefaultDependencyCollectorTest.java:321)


FAILED:  org.eclipse.aether.internal.impl.collect.DefaultDependencyCollectorTest.windows-jdk11 / Build windows-jdk11 / testDependencyManagement_TransitiveDependencyManager

Error Message:
path: [gid:root:ext:ver (compile), gid:direct:ext:ver (compile)], expected: [gid:transitive-1:ext:managed-by-root (compile)], actual: [] expected:<1> but was:<0>

Stack Trace:
java.lang.AssertionError: path: [gid:root:ext:ver (compile), gid:direct:ext:ver (compile)], expected: [gid:transitive-1:ext:managed-by-root (compile)], actual: [] expected:<1> but was:<0>
	at org.eclipse.aether.internal.impl.collect.DefaultDependencyCollectorTest.assertEqualSubtree(DefaultDependencyCollectorTest.java:143)
	at org.eclipse.aether.internal.impl.collect.DefaultDependencyCollectorTest.assertEqualSubtree(DefaultDependencyCollectorTest.java:151)
	at org.eclipse.aether.internal.impl.collect.DefaultDependencyCollectorTest.assertEqualSubtree(DefaultDependencyCollectorTest.java:121)
	at org.eclipse.aether.internal.impl.collect.DefaultDependencyCollectorTest.testDependencyManagement_TransitiveDependencyManager(DefaultDependencyCollectorTest.java:500)


FAILED:  org.eclipse.aether.internal.impl.collect.DefaultDependencyCollectorTest.windows-jdk11 / Build windows-jdk11 / testDependencyManagement

Error Message:
illegal coordinates for child

Stack Trace:
java.lang.IllegalArgumentException: illegal coordinates for child
	at org.eclipse.aether.internal.impl.collect.DefaultDependencyCollectorTest.path(DefaultDependencyCollectorTest.java:176)
	at org.eclipse.aether.internal.impl.collect.DefaultDependencyCollectorTest.dep(DefaultDependencyCollectorTest.java:159)
	at org.eclipse.aether.internal.impl.collect.DefaultDependencyCollectorTest.testDependencyManagement(DefaultDependencyCollectorTest.java:456)
Caused by: java.lang.IndexOutOfBoundsException: Index 1 out of bounds for length 0
	at org.eclipse.aether.internal.impl.collect.DefaultDependencyCollectorTest.path(DefaultDependencyCollectorTest.java:169)
	at org.eclipse.aether.internal.impl.collect.DefaultDependencyCollectorTest.dep(DefaultDependencyCollectorTest.java:159)
	at org.eclipse.aether.internal.impl.collect.DefaultDependencyCollectorTest.testDependencyManagement(DefaultDependencyCollectorTest.java:456)


FAILED:  org.eclipse.aether.internal.impl.collect.DefaultDependencyCollectorTest.windows-jdk11 / Build windows-jdk11 / testManagedVersionScope

Error Message:
expected:<1> but was:<0>

Stack Trace:
java.lang.AssertionError: expected:<1> but was:<0>
	at org.eclipse.aether.internal.impl.collect.DefaultDependencyCollectorTest.testManagedVersionScope(DefaultDependencyCollectorTest.java:432)




Build log:
[...truncated 27444 lines...]
[INFO] Maven Artifact Resolver ............................ SUCCESS [ 44.062 s]
[INFO] Maven Artifact Resolver API ........................ SUCCESS [ 26.914 s]
[INFO] Maven Artifact Resolver SPI ........................ SUCCESS [  3.683 s]
[INFO] Maven Artifact Resolver Test Utilities ............. SUCCESS [  3.816 s]
[INFO] Maven Artifact Resolver Utilities .................. SUCCESS [  9.227 s]
[INFO] Maven Artifact Resolver Implementation ............. SUCCESS [ 25.965 s]
[INFO] Maven Artifact Resolver Connector Basic ............ SUCCESS [  9.001 s]
[INFO] Maven Artifact Resolver Transport Classpath ........ SUCCESS [  3.133 s]
[INFO] Maven Artifact Resolver Transport File ............. SUCCESS [  4.397 s]
[INFO] Maven Artifact Resolver Transport HTTP ............. SUCCESS [ 12.755 s]
[INFO] Maven Artifact Resolver Transport Wagon ............ SUCCESS [  7.109 s]
[INFO] Maven Artifact Resolver Demos ...................... SUCCESS [  0.346 s]
[INFO] Maven Artifact Resolver Demo Snippets .............. SUCCESS [  3.025 s]
[INFO] Maven Artifact Resolver Demo Maven Plugin .......... SUCCESS [ 15.467 s]
[INFO] ------------------------------------------------------------------------
[INFO] BUILD SUCCESS
[INFO] ------------------------------------------------------------------------
[INFO] Total time:  02:50 min
[INFO] Finished at: 2019-07-14T07:25:31-07:00
[INFO] ------------------------------------------------------------------------
[INFO] ------------------------------------------------------------------------
[INFO] Reactor Summary for Maven Artifact Resolver 1.4.1-SNAPSHOT:
[INFO] 
[INFO] Maven Artifact Resolver ............................ SUCCESS [ 43.890 s]
[INFO] Maven Artifact Resolver API ........................ SUCCESS [ 27.181 s]
[INFO] Maven Artifact Resolver SPI ........................ SUCCESS [  3.420 s]
[INFO] Maven Artifact Resolver Test Utilities ............. SUCCESS [  4.065 s]
[INFO] Maven Artifact Resolver Utilities .................. SUCCESS [  9.134 s]
[INFO] Maven Artifact Resolver Implementation ............. SUCCESS [ 26.066 s]
[INFO] Maven Artifact Resolver Connector Basic ............ SUCCESS [  8.980 s]
[INFO] Maven Artifact Resolver Transport Classpath ........ SUCCESS [  3.099 s]
[INFO] Maven Artifact Resolver Transport File ............. SUCCESS [  3.802 s]
[INFO] Maven Artifact Resolver Transport HTTP ............. SUCCESS [ 13.308 s]
[INFO] Maven Artifact Resolver Transport Wagon ............ SUCCESS [  6.962 s]
[INFO] Maven Artifact Resolver Demos ...................... SUCCESS [  0.397 s]
[INFO] Maven Artifact Resolver Demo Snippets .............. SUCCESS [  3.112 s]
[INFO] Maven Artifact Resolver Demo Maven Plugin .......... SUCCESS [ 15.455 s]
[INFO] ------------------------------------------------------------------------
[INFO] BUILD SUCCESS
[INFO] ------------------------------------------------------------------------
[INFO] Total time:  02:50 min
[INFO] Finished at: 2019-07-14T07:25:31-07:00
[INFO] ------------------------------------------------------------------------
[INFO] [jenkins-event-spy] Generated F:\jenkins\jenkins-slave\workspace\maven-resolver_buildfix-1-thread@tmp\withMaven492ba2b2\maven-spy-20190714-072240-2173538882869987703031.log
[INFO] [jenkins-event-spy] Generated F:\jenkins\jenkins-slave\workspace\maven-resolver_buildfix-1-thread@2@tmp\withMavenf2648460\maven-spy-20190714-072240-2389701723843036798610.log
[INFO]           resolve-artifact\pom.xml ......................... SUCCESS (5.7 s)
[INFO] -------------------------------------------------
[INFO] Build Summary:
[INFO]   Passed: 1, Failed: 0, Errors: 0, Skipped: 0
[INFO] -------------------------------------------------
[INFO] 
[INFO] --- maven-checkstyle-plugin:3.0.0:check (checkstyle-check) @ maven-resolver-demo-maven-plugin ---
[INFO] ------------------------------------------------------------------------
[INFO] Reactor Summary for Maven Artifact Resolver 1.4.1-SNAPSHOT:
[INFO] 
[INFO] Maven Artifact Resolver ............................ SUCCESS [ 45.978 s]
[INFO] Maven Artifact Resolver API ........................ SUCCESS [ 27.263 s]
[INFO] Maven Artifact Resolver SPI ........................ SUCCESS [  3.069 s]
[INFO] Maven Artifact Resolver Test Utilities ............. SUCCESS [  3.477 s]
[INFO] Maven Artifact Resolver Utilities .................. SUCCESS [  8.530 s]
[INFO] Maven Artifact Resolver Implementation ............. SUCCESS [ 25.511 s]
[INFO] Maven Artifact Resolver Connector Basic ............ SUCCESS [  8.759 s]
[INFO] Maven Artifact Resolver Transport Classpath ........ SUCCESS [  2.762 s]
[INFO] Maven Artifact Resolver Transport File ............. SUCCESS [  3.407 s]
[INFO] Maven Artifact Resolver Transport HTTP ............. SUCCESS [ 11.891 s]
[INFO] Maven Artifact Resolver Transport Wagon ............ SUCCESS [  6.739 s]
[INFO] Maven Artifact Resolver Demos ...................... SUCCESS [  0.302 s]
[INFO] Maven Artifact Resolver Demo Snippets .............. SUCCESS [  3.973 s]
[INFO] Maven Artifact Resolver Demo Maven Plugin .......... SUCCESS [ 15.900 s]
[INFO] ------------------------------------------------------------------------
[INFO] BUILD SUCCESS
[INFO] ------------------------------------------------------------------------
[INFO] Total time:  02:50 min
[INFO] Finished at: 2019-07-14T07:25:35-07:00
[INFO] ------------------------------------------------------------------------
[INFO] [jenkins-event-spy] Generated F:\jenkins\jenkins-slave\workspace\maven-resolver_buildfix-1-thread@tmp\withMavenaf3c49f8\maven-spy-20190714-072243-8836865302073906445900.log
Picked up JAVA_TOOL_OPTIONS: -Dmaven.ext.class.path="f:\jenkins\jenkins-slave\workspace\maven-resolver_buildfix-1-thread@tmp\withMavenaf3c49f8\pipeline-maven-spy.jar" -Dorg.jenkinsci.plugins.pipeline.maven.reportsFolder="f:\jenkins\jenkins-slave\workspace\maven-resolver_buildfix-1-thread@tmp\withMavenaf3c49f8" 
[Pipeline] }
[Pipeline] }
[Pipeline] // withMaven
[Pipeline] cleanWs
[Pipeline] }
[Pipeline] }
[Pipeline] }
[WS-CLEANUP] Deleting project workspace...
[WS-CLEANUP] Deferred wipeout is used...
[WS-CLEANUP] done
[withMaven] Publishers: Pipeline Graph Publisher: 35 ms, Invoker Publisher: 1126 ms, Junit Publisher: 96279 ms, Concordion Publisher: 1 ms, Dependencies Fingerprint Publisher: 9045 ms
[Pipeline] // stage
[Pipeline] // dir
[Pipeline] }
[Pipeline] }
[Pipeline] // dir
[Pipeline] // dir
[Pipeline] // dir
[Pipeline] // withMaven
[Pipeline] }
[withMaven] invokerPublisher - Archive invoker results for Maven artifact MavenArtifact{org.apache.maven.resolver:maven-resolver-demo-maven-plugin:maven-plugin:1.4.1-SNAPSHOT(version: 1.4.1-SNAPSHOT, snapshot:false) } generated by PluginInvocation{org.apache.maven.plugins:maven-invoker-plugin:3.0.1@run  integration-test}: m\maven-resolver-demos\maven-resolver-demo-maven-plugin\target\invoker-reports\*.xml
[Pipeline] cleanWs
[Pipeline] }
[Pipeline] }
[Pipeline] }
[Pipeline] // node
[Pipeline] }
[Pipeline] // stage
[withMaven] invokerPublisher - Archive invoker results for Maven artifact MavenArtifact{org.apache.maven.resolver:maven-resolver-demo-maven-plugin:maven-plugin:1.4.1-SNAPSHOT(version: 1.4.1-SNAPSHOT, snapshot:false) } generated by PluginInvocation{org.apache.maven.plugins:maven-invoker-plugin:3.0.1@run  integration-test}: m\maven-resolver-demos\maven-resolver-demo-maven-plugin\target\invoker-reports\*.xml
[Pipeline] }
[Pipeline] // node
[Pipeline] }
[withMaven] invokerPublisher - Archive invoker results for Maven artifact MavenArtifact{org.apache.maven.resolver:maven-resolver-demo-maven-plugin:maven-plugin:1.4.1-SNAPSHOT(version: 1.4.1-SNAPSHOT, snapshot:false) } generated by PluginInvocation{org.apache.maven.plugins:maven-invoker-plugin:3.0.1@run  integration-test}: m\maven-resolver-demos\maven-resolver-demo-maven-plugin\target\invoker-reports\*.xml
[withMaven] invokerPublisher - Archive invoker results for Maven artifact MavenArtifact{org.apache.maven.resolver:maven-resolver-demo-maven-plugin:maven-plugin:1.4.1-SNAPSHOT(version: 1.4.1-SNAPSHOT, snapshot:false) } generated by PluginInvocation{org.apache.maven.plugins:maven-invoker-plugin:3.0.1@run  integration-test}: m\maven-resolver-demos\maven-resolver-demo-maven-plugin\target\invoker-reports\*.xml
[WS-CLEANUP] Deleting project workspace...
[WS-CLEANUP] Deferred wipeout is used...
[withMaven] junitPublisher - Archive test results for Maven artifact org.apache.maven.resolver:maven-resolver-api:jar:1.4.1-SNAPSHOT generated by maven-surefire-plugin:test (default-test): m\maven-resolver-api\target\surefire-reports\*.xml
[withMaven] junitPublisher - Archive test results for Maven artifact org.apache.maven.resolver:maven-resolver-spi:jar:1.4.1-SNAPSHOT generated by maven-surefire-plugin:test (default-test): m\maven-resolver-spi\target\surefire-reports\*.xml
[withMaven] junitPublisher - Archive test results for Maven artifact org.apache.maven.resolver:maven-resolver-test-util:jar:1.4.1-SNAPSHOT generated by maven-surefire-plugin:test (default-test): m\maven-resolver-test-util\target\surefire-reports\*.xml
[withMaven] junitPublisher - Archive test results for Maven artifact org.apache.maven.resolver:maven-resolver-util:jar:1.4.1-SNAPSHOT generated by maven-surefire-plugin:test (default-test): m\maven-resolver-util\target\surefire-reports\*.xml
[withMaven] junitPublisher - Archive test results for Maven artifact org.apache.maven.resolver:maven-resolver-impl:jar:1.4.1-SNAPSHOT generated by maven-surefire-plugin:test (default-test): m\maven-resolver-impl\target\surefire-reports\*.xml
[withMaven] junitPublisher - Archive test results for Maven artifact org.apache.maven.resolver:maven-resolver-connector-basic:jar:1.4.1-SNAPSHOT generated by maven-surefire-plugin:test (default-test): m\maven-resolver-connector-basic\target\surefire-reports\*.xml
[withMaven] junitPublisher - Archive test results for Maven artifact org.apache.maven.resolver:maven-resolver-transport-classpath:jar:1.4.1-SNAPSHOT generated by maven-surefire-plugin:test (default-test): m\maven-resolver-transport-classpath\target\surefire-reports\*.xml
[withMaven] junitPublisher - Archive test results for Maven artifact org.apache.maven.resolver:maven-resolver-transport-file:jar:1.4.1-SNAPSHOT generated by maven-surefire-plugin:test (default-test): m\maven-resolver-transport-file\target\surefire-reports\*.xml
[withMaven] junitPublisher - Archive test results for Maven artifact org.apache.maven.resolver:maven-resolver-transport-http:jar:1.4.1-SNAPSHOT generated by maven-surefire-plugin:test (default-test): m\maven-resolver-transport-http\target\surefire-reports\*.xml
[withMaven] junitPublisher - Archive test results for Maven artifact org.apache.maven.resolver:maven-resolver-transport-wagon:jar:1.4.1-SNAPSHOT generated by maven-surefire-plugin:test (default-test): m\maven-resolver-transport-wagon\target\surefire-reports\*.xml
[withMaven] junitPublisher - Archive test results for Maven artifact org.apache.maven.resolver:maven-resolver-demo-snippets:jar:1.4.1-SNAPSHOT generated by maven-surefire-plugin:test (default-test): m\maven-resolver-demos\maven-resolver-demo-snippets\target\surefire-reports\*.xml
[withMaven] junitPublisher - Archive test results for Maven artifact org.apache.maven.resolver:maven-resolver-demo-maven-plugin:maven-plugin:1.4.1-SNAPSHOT generated by maven-surefire-plugin:test (default-test): m\maven-resolver-demos\maven-resolver-demo-maven-plugin\target\surefire-reports\*.xml
Recording test results
[WS-CLEANUP] done
[Pipeline] }
[Pipeline] // stage
[Pipeline] }
[withMaven] junitPublisher - Archive test results for Maven artifact org.apache.maven.resolver:maven-resolver-api:jar:1.4.1-SNAPSHOT generated by maven-surefire-plugin:test (default-test): m\maven-resolver-api\target\surefire-reports\*.xml
[withMaven] junitPublisher - Archive test results for Maven artifact org.apache.maven.resolver:maven-resolver-api:jar:1.4.1-SNAPSHOT generated by maven-surefire-plugin:test (default-test): m\maven-resolver-api\target\surefire-reports\*.xml
[withMaven] junitPublisher - Archive test results for Maven artifact org.apache.maven.resolver:maven-resolver-api:jar:1.4.1-SNAPSHOT generated by maven-surefire-plugin:test (default-test): m\maven-resolver-api\target\surefire-reports\*.xml
[withMaven] junitPublisher - Archive test results for Maven artifact org.apache.maven.resolver:maven-resolver-spi:jar:1.4.1-SNAPSHOT generated by maven-surefire-plugin:test (default-test): m\maven-resolver-spi\target\surefire-reports\*.xml
[withMaven] junitPublisher - Archive test results for Maven artifact org.apache.maven.resolver:maven-resolver-spi:jar:1.4.1-SNAPSHOT generated by maven-surefire-plugin:test (default-test): m\maven-resolver-spi\target\surefire-reports\*.xml
[withMaven] junitPublisher - Archive test results for Maven artifact org.apache.maven.resolver:maven-resolver-test-util:jar:1.4.1-SNAPSHOT generated by maven-surefire-plugin:test (default-test): m\maven-resolver-test-util\target\surefire-reports\*.xml[withMaven] junitPublisher - Archive test results for Maven artifact org.apache.maven.resolver:maven-resolver-test-util:jar:1.4.1-SNAPSHOT generated by maven-surefire-plugin:test (default-test): m\maven-resolver-test-util\target\surefire-reports\*.xml
[withMaven] junitPublisher - Archive test results for Maven artifact org.apache.maven.resolver:maven-resolver-spi:jar:1.4.1-SNAPSHOT generated by maven-surefire-plugin:test (default-test): m\maven-resolver-spi\target\surefire-reports\*.xml[withMaven] junitPublisher - Archive test results for Maven artifact org.apache.maven.resolver:maven-resolver-util:jar:1.4.1-SNAPSHOT generated by maven-surefire-plugin:test (default-test): m\maven-resolver-util\target\surefire-reports\*.xml

[withMaven] junitPublisher - Archive test results for Maven artifact org.apache.maven.resolver:maven-resolver-impl:jar:1.4.1-SNAPSHOT generated by maven-surefire-plugin:test (default-test): m\maven-resolver-impl\target\surefire-reports\*.xml

[withMaven] junitPublisher - Archive test results for Maven artifact org.apache.maven.resolver:maven-resolver-test-util:jar:1.4.1-SNAPSHOT generated by maven-surefire-plugin:test (default-test): m\maven-resolver-test-util\target\surefire-reports\*.xml
[withMaven] junitPublisher - Archive test results for Maven artifact org.apache.maven.resolver:maven-resolver-util:jar:1.4.1-SNAPSHOT generated by maven-surefire-plugin:test (default-test): m\maven-resolver-util\target\surefire-reports\*.xml
[withMaven] junitPublisher - Archive test results for Maven artifact org.apache.maven.resolver:maven-resolver-connector-basic:jar:1.4.1-SNAPSHOT generated by maven-surefire-plugin:test (default-test): m\maven-resolver-connector-basic\target\surefire-reports\*.xml[withMaven] junitPublisher - Archive test results for Maven artifact org.apache.maven.resolver:maven-resolver-impl:jar:1.4.1-SNAPSHOT generated by maven-surefire-plugin:test (default-test): m\maven-resolver-impl\target\surefire-reports\*.xml
[withMaven] junitPublisher - Archive test results for Maven artifact org.apache.maven.resolver:maven-resolver-util:jar:1.4.1-SNAPSHOT generated by maven-surefire-plugin:test (default-test): m\maven-resolver-util\target\surefire-reports\*.xml[withMaven] junitPublisher - Archive test results for Maven artifact org.apache.maven.resolver:maven-resolver-connector-basic:jar:1.4.1-SNAPSHOT generated by maven-surefire-plugin:test (default-test): m\maven-resolver-connector-basic\target\surefire-reports\*.xml

[withMaven] junitPublisher - Archive test results for Maven artifact org.apache.maven.resolver:maven-resolver-transport-classpath:jar:1.4.1-SNAPSHOT generated by maven-surefire-plugin:test (default-test): m\maven-resolver-transport-classpath\target\surefire-reports\*.xml

[withMaven] junitPublisher - Archive test results for Maven artifact org.apache.maven.resolver:maven-resolver-transport-file:jar:1.4.1-SNAPSHOT generated by maven-surefire-plugin:test (default-test): m\maven-resolver-transport-file\target\surefire-reports\*.xml
[withMaven] junitPublisher - Archive test results for Maven artifact org.apache.maven.resolver:maven-resolver-transport-classpath:jar:1.4.1-SNAPSHOT generated by maven-surefire-plugin:test (default-test): m\maven-resolver-transport-classpath\target\surefire-reports\*.xml
[withMaven] junitPublisher - Archive test results for Maven artifact org.apache.maven.resolver:maven-resolver-transport-http:jar:1.4.1-SNAPSHOT generated by maven-surefire-plugin:test (default-test): m\maven-resolver-transport-http\target\surefire-reports\*.xml[withMaven] junitPublisher - Archive test results for Maven artifact org.apache.maven.resolver:maven-resolver-transport-file:jar:1.4.1-SNAPSHOT generated by maven-surefire-plugin:test (default-test): m\maven-resolver-transport-file\target\surefire-reports\*.xml
[withMaven] junitPublisher - Archive test results for Maven artifact org.apache.maven.resolver:maven-resolver-impl:jar:1.4.1-SNAPSHOT generated by maven-surefire-plugin:test (default-test): m\maven-resolver-impl\target\surefire-reports\*.xml
[withMaven] junitPublisher - Archive test results for Maven artifact org.apache.maven.resolver:maven-resolver-transport-http:jar:1.4.1-SNAPSHOT generated by maven-surefire-plugin:test (default-test): m\maven-resolver-transport-http\target\surefire-reports\*.xml[withMaven] junitPublisher - Archive test results for Maven artifact org.apache.maven.resolver:maven-resolver-connector-basic:jar:1.4.1-SNAPSHOT generated by maven-surefire-plugin:test (default-test): m\maven-resolver-connector-basic\target\surefire-reports\*.xml

[withMaven] junitPublisher - Archive test results for Maven artifact org.apache.maven.resolver:maven-resolver-transport-classpath:jar:1.4.1-SNAPSHOT generated by maven-surefire-plugin:test (default-test): m\maven-resolver-transport-classpath\target\surefire-reports\*.xml
[withMaven] junitPublisher - Archive test results for Maven artifact org.apache.maven.resolver:maven-resolver-transport-wagon:jar:1.4.1-SNAPSHOT generated by maven-surefire-plugin:test (default-test): m\maven-resolver-transport-wagon\target\surefire-reports\*.xml
[withMaven] junitPublisher - Archive test results for Maven artifact org.apache.maven.resolver:maven-resolver-transport-file:jar:1.4.1-SNAPSHOT generated by maven-surefire-plugin:test (default-test): m\maven-resolver-transport-file\target\surefire-reports\*.xml[withMaven] junitPublisher - Archive test results for Maven artifact org.apache.maven.resolver:maven-resolver-demo-snippets:jar:1.4.1-SNAPSHOT generated by maven-surefire-plugin:test (default-test): m\maven-resolver-demos\maven-resolver-demo-snippets\target\surefire-reports\*.xml

[withMaven] junitPublisher - Archive test results for Maven artifact org.apache.maven.resolver:maven-resolver-demo-maven-plugin:maven-plugin:1.4.1-SNAPSHOT generated by maven-surefire-plugin:test (default-test): m\maven-resolver-demos\maven-resolver-demo-maven-plugin\target\surefire-reports\*.xml

[withMaven] junitPublisher - Archive test results for Maven artifact org.apache.maven.resolver:maven-resolver-transport-wagon:jar:1.4.1-SNAPSHOT generated by maven-surefire-plugin:test (default-test): m\maven-resolver-transport-wagon\target\surefire-reports\*.xml
[withMaven] junitPublisher - Archive test results for Maven artifact org.apache.maven.resolver:maven-resolver-transport-http:jar:1.4.1-SNAPSHOT generated by maven-surefire-plugin:test (default-test): m\maven-resolver-transport-http\target\surefire-reports\*.xml[withMaven] junitPublisher - Archive test results for Maven artifact org.apache.maven.resolver:maven-resolver-demo-snippets:jar:1.4.1-SNAPSHOT generated by maven-surefire-plugin:test (default-test): m\maven-resolver-demos\maven-resolver-demo-snippets\target\surefire-reports\*.xml

[withMaven] junitPublisher - Archive test results for Maven artifact org.apache.maven.resolver:maven-resolver-demo-maven-plugin:maven-plugin:1.4.1-SNAPSHOT generated by maven-surefire-plugin:test (default-test): m\maven-resolver-demos\maven-resolver-demo-maven-plugin\target\surefire-reports\*.xml
[withMaven] junitPublisher - Archive test results for Maven artifact org.apache.maven.resolver:maven-resolver-transport-wagon:jar:1.4.1-SNAPSHOT generated by maven-surefire-plugin:test (default-test): m\maven-resolver-transport-wagon\target\surefire-reports\*.xml
Recording test results[withMaven] junitPublisher - Archive test results for Maven artifact org.apache.maven.resolver:maven-resolver-demo-snippets:jar:1.4.1-SNAPSHOT generated by maven-surefire-plugin:test (default-test): m\maven-resolver-demos\maven-resolver-demo-snippets\target\surefire-reports\*.xml

[withMaven] junitPublisher - Archive test results for Maven artifact org.apache.maven.resolver:maven-resolver-demo-maven-plugin:maven-plugin:1.4.1-SNAPSHOT generated by maven-surefire-plugin:test (default-test): m\maven-resolver-demos\maven-resolver-demo-maven-plugin\target\surefire-reports\*.xml
Recording test results
Recording test results
[Pipeline] // node
[Pipeline] }
[withMaven] Publishers: Pipeline Graph Publisher: 6 ms, Invoker Publisher: 537 ms, Junit Publisher: 1941 ms, Concordion Publisher: 1 ms, Dependencies Fingerprint Publisher: 505 ms
[Pipeline] // withMaven
[Pipeline] cleanWs
[WS-CLEANUP] Deleting project workspace...
[WS-CLEANUP] Deferred wipeout is used...
[WS-CLEANUP] done
[withMaven] Publishers: Pipeline Graph Publisher: 25 ms, Invoker Publisher: 2310 ms, Junit Publisher: 2005 ms, Concordion Publisher: 1 ms, Dependencies Fingerprint Publisher: 368 ms
[withMaven] Publishers: Pipeline Graph Publisher: 6 ms, Invoker Publisher: 2387 ms, Junit Publisher: 3871 ms, Concordion Publisher: 1 ms, Dependencies Fingerprint Publisher: 369 ms
[Pipeline] // withMaven
[Pipeline] // withMaven
[Pipeline] cleanWs
[Pipeline] cleanWs
[WS-CLEANUP] Deleting project workspace...
[WS-CLEANUP] Deferred wipeout is used...
[Pipeline] }
[WS-CLEANUP] Deleting project workspace...
[WS-CLEANUP] Deferred wipeout is used...
[Pipeline] // stage
[Pipeline] }
[WS-CLEANUP] done
[WS-CLEANUP] done
[Pipeline] // node
[Pipeline] }
[Pipeline] }
[Pipeline] }
[Pipeline] // stage
[Pipeline] // stage
[Pipeline] }
[Pipeline] }
[Pipeline] // node
[Pipeline] // node
[Pipeline] }
[Pipeline] }
[withMaven] Publishers: Pipeline Graph Publisher: 26 ms, Invoker Publisher: 2307 ms, Junit Publisher: 5698 ms, Concordion Publisher: 1 ms, Dependencies Fingerprint Publisher: 447 ms
[Pipeline] // withMaven
[Pipeline] cleanWs
[WS-CLEANUP] Deleting project workspace...
[WS-CLEANUP] Deferred wipeout is used...
[WS-CLEANUP] done
[Pipeline] }
[Pipeline] // stage
[Pipeline] }
[Pipeline] // node
[Pipeline] }
[withMaven] openTasksPublisher - Scan Tasks for Maven artifact org.apache.maven.resolver:maven-resolver-api:jar:1.4.1-SNAPSHOT in source directory m/maven-resolver-api/src/main/java
[withMaven] openTasksPublisher - Scan Tasks for Maven artifact org.apache.maven.resolver:maven-resolver-spi:jar:1.4.1-SNAPSHOT in source directory m/maven-resolver-spi/src/main/java
[withMaven] openTasksPublisher - Scan Tasks for Maven artifact org.apache.maven.resolver:maven-resolver-test-util:jar:1.4.1-SNAPSHOT in source directory m/maven-resolver-test-util/src/main/java
[withMaven] openTasksPublisher - Scan Tasks for Maven artifact org.apache.maven.resolver:maven-resolver-util:jar:1.4.1-SNAPSHOT in source directory m/maven-resolver-util/src/main/java
[withMaven] openTasksPublisher - Scan Tasks for Maven artifact org.apache.maven.resolver:maven-resolver-impl:jar:1.4.1-SNAPSHOT in source directory m/maven-resolver-impl/src/main/java
[withMaven] openTasksPublisher - Scan Tasks for Maven artifact org.apache.maven.resolver:maven-resolver-connector-basic:jar:1.4.1-SNAPSHOT in source directory m/maven-resolver-connector-basic/src/main/java
[withMaven] openTasksPublisher - Scan Tasks for Maven artifact org.apache.maven.resolver:maven-resolver-transport-classpath:jar:1.4.1-SNAPSHOT in source directory m/maven-resolver-transport-classpath/src/main/java
[withMaven] openTasksPublisher - Scan Tasks for Maven artifact org.apache.maven.resolver:maven-resolver-transport-file:jar:1.4.1-SNAPSHOT in source directory m/maven-resolver-transport-file/src/main/java
[withMaven] openTasksPublisher - Scan Tasks for Maven artifact org.apache.maven.resolver:maven-resolver-transport-http:jar:1.4.1-SNAPSHOT in source directory m/maven-resolver-transport-http/src/main/java
[withMaven] openTasksPublisher - Scan Tasks for Maven artifact org.apache.maven.resolver:maven-resolver-transport-wagon:jar:1.4.1-SNAPSHOT in source directory m/maven-resolver-transport-wagon/src/main/java
[withMaven] openTasksPublisher - Scan Tasks for Maven artifact org.apache.maven.resolver:maven-resolver-demo-snippets:jar:1.4.1-SNAPSHOT in source directory m/maven-resolver-demos/maven-resolver-demo-snippets/src/main/java
[withMaven] openTasksPublisher - Scan Tasks for Maven artifact org.apache.maven.resolver:maven-resolver-demo-maven-plugin:maven-plugin:1.4.1-SNAPSHOT in source directory m/maven-resolver-demos/maven-resolver-demo-maven-plugin/src/main/java
[TASKS] Scanning folder '/home/jenkins/jenkins-slave/workspace/maven-resolver_buildfix-1-thread' for files matching the pattern 'm/maven-resolver-api/src/main/java/**/*,m/maven-resolver-spi/src/main/java/**/*,m/maven-resolver-test-util/src/main/java/**/*,m/maven-resolver-util/src/main/java/**/*,m/maven-resolver-impl/src/main/java/**/*,m/maven-resolver-connector-basic/src/main/java/**/*,m/maven-resolver-transport-classpath/src/main/java/**/*,m/maven-resolver-transport-file/src/main/java/**/*,m/maven-resolver-transport-http/src/main/java/**/*,m/maven-resolver-transport-wagon/src/main/java/**/*,m/maven-resolver-demos/maven-resolver-demo-snippets/src/main/java/**/*,m/maven-resolver-demos/maven-resolver-demo-maven-plugin/src/main/java/**/*' - excludes: null
[TASKS] Found 416 files to scan for tasks
[TASKS] Found 0 open tasks.
Skipping warnings blame since pipelines do not have an SCM link.%n
[withMaven] Publishers: Pipeline Graph Publisher: 32 ms, Generated Artifacts Publisher: 11089 ms, Invoker Publisher: 38896 ms, Junit Publisher: 95354 ms, Concordion Publisher: 1 ms, Dependencies Fingerprint Publisher: 8927 ms, Open Task Scanner Publisher: 2656 ms
[Pipeline] // withMaven
[Pipeline] cleanWs
[WS-CLEANUP] Deleting project workspace...
[WS-CLEANUP] Deferred wipeout is used...
[WS-CLEANUP] done
[Pipeline] }
[Pipeline] // stage
[Pipeline] }
[Pipeline] // node
[Pipeline] }
[Pipeline] // parallel
[Pipeline] stage
[Pipeline] { (Notifications)
[Pipeline] echo
Build result: UNSTABLE
[Pipeline] jiraIssueSelector
[Pipeline] emailext
Mime
  • Unnamed multipart/mixed (inline, None, 0 bytes)
View raw message