maven-notifications mailing list archives

Site index · List index
Message view « Date » · « Thread »
Top « Date » · « Thread »
From Apache Jenkins Server <jenk...@builds.apache.org>
Subject Build failed in Jenkins: Maven TLP » maven » buildfix #1
Date Sun, 14 Jul 2019 17:08:39 GMT
See https://builds.apache.org/job/maven-box/job/maven/job/buildfix/1/

No changes.

1 tests failed.
FAILED:  org.apache.maven.it.MavenITmng3379ParallelArtifactDownloadsTest.linux-jdk7 / Run ITs Linux Java 7 / testitMNG3379

Error Message:
Exit code was non-zero: 1; command line and log = 
/home/jenkins/jenkins-slave/workspace/maven-box_maven_buildfix/test/core-it-suite/target/apache-maven/bin/mvn --global-settings /home/jenkins/jenkins-slave/workspace/maven-box_maven_buildfix/test/core-it-suite/target/test-classes/settings.xml --settings settings.xml -e --batch-mode -Dmaven.repo.local=/home/jenkins/jenkins-slave/workspace/maven-box_maven_buildfix/test/it-local-repo validate
[INFO] [jenkins-event-spy] Jenkins Maven Event Spy is disabled
[INFO] Error stacktraces are turned on.
[INFO] Scanning for projects...
[INFO] 
[INFO] -----------------< org.apache.maven.its.mng3379:test >------------------
[INFO] Building Maven Integration Test :: MNG-3379 1
[INFO] --------------------------------[ jar ]---------------------------------
[INFO] Downloading from maven-core-it: file:///home/jenkins/jenkins-slave/workspace/maven-box_maven_buildfix/test/core-it-suite/target/test-classes/mng-3379/repo/org/apache/maven/its/mng3379/a/x/maven-metadata.xml
[INFO] Downloading from central: file:target/null/org/apache/maven/its/mng3379/a/x/maven-metadata.xml
[INFO] Downloading from central: file:target/null/org/apache/maven/its/mng3379/a/x/maven-metadata.xml
[INFO] Downloading from central: file:target/null/org/apache/maven/its/mng3379/a/x/maven-metadata.xml
[INFO] Downloading from central: file:target/null/org/apache/maven/its/mng3379/a/x/maven-metadata.xml
[INFO] Downloading from maven-core-it: file:///home/jenkins/jenkins-slave/workspace/maven-box_maven_buildfix/test/core-it-suite/target/test-classes/mng-3379/repo/org/apache/maven/its/mng3379/a/x/maven-metadata.xml
[INFO] Downloading from maven-core-it: file:///home/jenkins/jenkins-slave/workspace/maven-box_maven_buildfix/test/core-it-suite/target/test-classes/mng-3379/repo/org/apache/maven/its/mng3379/a/x/maven-metadata.xml
[INFO] Downloading from maven-core-it: file:///home/jenkins/jenkins-slave/workspace/maven-box_maven_buildfix/test/core-it-suite/target/test-classes/mng-3379/repo/org/apache/maven/its/mng3379/a/x/maven-metadata.xml
[INFO] Downloading from central: file:target/null/org/apache/maven/its/mng3379/b/x/maven-metadata.xml
[INFO] Downloaded from maven-core-it: file:///home/jenkins/jenkins-slave/workspace/maven-box_maven_buildfix/test/core-it-suite/target/test-classes/mng-3379/repo/org/apache/maven/its/mng3379/a/x/maven-metadata.xml (323 B at 323 kB/s)
[INFO] Downloading from maven-core-it: file:///home/jenkins/jenkins-slave/workspace/maven-box_maven_buildfix/test/core-it-suite/target/test-classes/mng-3379/repo/org/apache/maven/its/mng3379/b/x/maven-metadata.xml
[INFO] Downloading from central: file:target/null/org/apache/maven/its/mng3379/b/x/maven-metadata.xml
[INFO] Downloading from maven-core-it: file:///home/jenkins/jenkins-slave/workspace/maven-box_maven_buildfix/test/core-it-suite/target/test-classes/mng-3379/repo/org/apache/maven/its/mng3379/b/x/maven-metadata.xml
[INFO] Downloading from maven-core-it: file:///home/jenkins/jenkins-slave/workspace/maven-box_maven_buildfix/test/core-it-suite/target/test-classes/mng-3379/repo/org/apache/maven/its/mng3379/b/x/maven-metadata.xml
[INFO] Downloaded from maven-core-it: file:///home/jenkins/jenkins-slave/workspace/maven-box_maven_buildfix/test/core-it-suite/target/test-classes/mng-3379/repo/org/apache/maven/its/mng3379/b/x/maven-metadata.xml (323 B at 323 kB/s)
[INFO] Downloading from central: file:target/null/org/apache/maven/its/mng3379/b/x/maven-metadata.xml
[INFO] Downloading from central: file:target/null/org/apache/maven/its/mng3379/b/x/maven-metadata.xml
[INFO] Downloading from central: file:target/null/org/apache/maven/its/mng3379/c/x/maven-metadata.xml
[INFO] Downloading from maven-core-it: file:///home/jenkins/jenkins-slave/workspace/maven-box_maven_buildfix/test/core-it-suite/target/test-classes/mng-3379/repo/org/apache/maven/its/mng3379/c/x/maven-metadata.xml
[INFO] Downloading from maven-core-it: file:///home/jenkins/jenkins-slave/workspace/maven-box_maven_buildfix/test/core-it-suite/target/test-classes/mng-3379/repo/org/apache/maven/its/mng3379/d/x/maven-metadata.xml
[INFO] Downloading from central: file:target/null/org/apache/maven/its/mng3379/d/x/maven-metadata.xml
[INFO] Downloading from central: file:target/null/org/apache/maven/its/mng3379/c/x/maven-metadata.xml
[INFO] Downloaded from maven-core-it: file:///home/jenkins/jenkins-slave/workspace/maven-box_maven_buildfix/test/core-it-suite/target/test-classes/mng-3379/repo/org/apache/maven/its/mng3379/c/x/maven-metadata.xml (323 B at 323 kB/s)
[INFO] Downloaded from maven-core-it: file:///home/jenkins/jenkins-slave/workspace/maven-box_maven_buildfix/test/core-it-suite/target/test-classes/mng-3379/repo/org/apache/maven/its/mng3379/d/x/maven-metadata.xml (323 B at 323 kB/s)
[INFO] Downloading from central: file:target/null/org/apache/maven/its/mng3379/c/x/maven-metadata.xml
[INFO] Downloading from maven-core-it: file:///home/jenkins/jenkins-slave/workspace/maven-box_maven_buildfix/test/core-it-suite/target/test-classes/mng-3379/repo/org/apache/maven/its/mng3379/b/x/maven-metadata.xml
[INFO] Downloading from maven-core-it: file:///home/jenkins/jenkins-slave/workspace/maven-box_maven_buildfix/test/core-it-suite/target/test-classes/mng-3379/repo/org/apache/maven/its/mng3379/c/x/maven-metadata.xml
[INFO] Downloading from central: file:target/null/org/apache/maven/its/mng3379/c/x/maven-metadata.xml
[INFO] Downloading from maven-core-it: file:///home/jenkins/jenkins-slave/workspace/maven-box_maven_buildfix/test/core-it-suite/target/test-classes/mng-3379/repo/org/apache/maven/its/mng3379/c/x/maven-metadata.xml
[INFO] Downloading from central: file:target/null/org/apache/maven/its/mng3379/d/x/maven-metadata.xml
[INFO] Downloaded from maven-core-it: file:///home/jenkins/jenkins-slave/workspace/maven-box_maven_buildfix/test/core-it-suite/target/test-classes/mng-3379/repo/org/apache/maven/its/mng3379/a/x/maven-metadata.xml (323 B at 20 kB/s)
[INFO] Downloading from central: file:target/null/org/apache/maven/its/mng3379/d/x/maven-metadata.xml
[INFO] Downloaded from maven-core-it: file:///home/jenkins/jenkins-slave/workspace/maven-box_maven_buildfix/test/core-it-suite/target/test-classes/mng-3379/repo/org/apache/maven/its/mng3379/c/x/maven-metadata.xml (323 B at 65 kB/s)
[INFO] Downloaded from maven-core-it: file:///home/jenkins/jenkins-slave/workspace/maven-box_maven_buildfix/test/core-it-suite/target/test-classes/mng-3379/repo/org/apache/maven/its/mng3379/b/x/maven-metadata.xml (323 B at 25 kB/s)
[INFO] Downloaded from maven-core-it: file:///home/jenkins/jenkins-slave/workspace/maven-box_maven_buildfix/test/core-it-suite/target/test-classes/mng-3379/repo/org/apache/maven/its/mng3379/b/x/maven-metadata.xml (323 B at 54 kB/s)
[INFO] Downloaded from maven-core-it: file:///home/jenkins/jenkins-slave/workspace/maven-box_maven_buildfix/test/core-it-suite/target/test-classes/mng-3379/repo/org/apache/maven/its/mng3379/b/x/maven-metadata.xml (323 B at 25 kB/s)
[INFO] Downloaded from maven-core-it: file:///home/jenkins/jenkins-slave/workspace/maven-box_maven_buildfix/test/core-it-suite/target/test-classes/mng-3379/repo/org/apache/maven/its/mng3379/c/x/maven-metadata.xml (323 B at 46 kB/s)
[INFO] Downloading from maven-core-it: file:///home/jenkins/jenkins-slave/workspace/maven-box_maven_buildfix/test/core-it-suite/target/test-classes/mng-3379/repo/org/apache/maven/its/mng3379/c/x/maven-metadata.xml
[WARNING] The metadata /home/jenkins/jenkins-slave/workspace/maven-box_maven_buildfix/test/it-local-repo/org/apache/maven/its/mng3379/b/x/maven-metadata-maven-core-it.xml is invalid: input contained no data
[INFO] Downloading from maven-core-it: file:///home/jenkins/jenkins-slave/workspace/maven-box_maven_buildfix/test/core-it-suite/target/test-classes/mng-3379/repo/org/apache/maven/its/mng3379/d/x/0.2-SNAPSHOT/maven-metadata.xml
[INFO] Downloading from maven-core-it: file:///home/jenkins/jenkins-slave/workspace/maven-box_maven_buildfix/test/core-it-suite/target/test-classes/mng-3379/repo/org/apache/maven/its/mng3379/a/x/0.2-SNAPSHOT/maven-metadata.xml
[WARNING] The metadata /home/jenkins/jenkins-slave/workspace/maven-box_maven_buildfix/test/it-local-repo/org/apache/maven/its/mng3379/b/x/maven-metadata-maven-core-it.xml is invalid: input contained no data
[WARNING] The metadata /home/jenkins/jenkins-slave/workspace/maven-box_maven_buildfix/test/it-local-repo/org/apache/maven/its/mng3379/b/x/maven-metadata-maven-core-it.xml is invalid: input contained no data
[INFO] Downloading from maven-core-it: file:///home/jenkins/jenkins-slave/workspace/maven-box_maven_buildfix/test/core-it-suite/target/test-classes/mng-3379/repo/org/apache/maven/its/mng3379/a/x/0.2-SNAPSHOT/maven-metadata.xml
[INFO] Downloading from maven-core-it: file:///home/jenkins/jenkins-slave/workspace/maven-box_maven_buildfix/test/core-it-suite/target/test-classes/mng-3379/repo/org/apache/maven/its/mng3379/d/x/maven-metadata.xml
[WARNING] The metadata /home/jenkins/jenkins-slave/workspace/maven-box_maven_buildfix/test/it-local-repo/org/apache/maven/its/mng3379/b/x/maven-metadata-maven-core-it.xml is invalid: input contained no data
[INFO] Downloading from maven-core-it: file:///home/jenkins/jenkins-slave/workspace/maven-box_maven_buildfix/test/core-it-suite/target/test-classes/mng-3379/repo/org/apache/maven/its/mng3379/d/x/0.2-SNAPSHOT/maven-metadata.xml
[INFO] Downloaded from maven-core-it: file:///home/jenkins/jenkins-slave/workspace/maven-box_maven_buildfix/test/core-it-suite/target/test-classes/mng-3379/repo/org/apache/maven/its/mng3379/a/x/0.2-SNAPSHOT/maven-metadata.xml (365 B at 122 kB/s)
[INFO] Downloaded from maven-core-it: file:///home/jenkins/jenkins-slave/workspace/maven-box_maven_buildfix/test/core-it-suite/target/test-classes/mng-3379/repo/org/apache/maven/its/mng3379/c/x/maven-metadata.xml (323 B at 108 kB/s)
[INFO] Downloading from maven-core-it: file:///home/jenkins/jenkins-slave/workspace/maven-box_maven_buildfix/test/core-it-suite/target/test-classes/mng-3379/repo/org/apache/maven/its/mng3379/d/x/maven-metadata.xml
[INFO] Downloading from maven-core-it: file:///home/jenkins/jenkins-slave/workspace/maven-box_maven_buildfix/test/core-it-suite/target/test-classes/mng-3379/repo/org/apache/maven/its/mng3379/c/x/0.2-SNAPSHOT/maven-metadata.xml
[INFO] Downloading from maven-core-it: file:///home/jenkins/jenkins-slave/workspace/maven-box_maven_buildfix/test/core-it-suite/target/test-classes/mng-3379/repo/org/apache/maven/its/mng3379/c/x/0.2-SNAPSHOT/maven-metadata.xml
[INFO] Downloaded from maven-core-it: file:///home/jenkins/jenkins-slave/workspace/maven-box_maven_buildfix/test/core-it-suite/target/test-classes/mng-3379/repo/org/apache/maven/its/mng3379/d/x/0.2-SNAPSHOT/maven-metadata.xml (365 B at 73 kB/s)
[INFO] Downloading from maven-core-it: file:///home/jenkins/jenkins-slave/workspace/maven-box_maven_buildfix/test/core-it-suite/target/test-classes/mng-3379/repo/org/apache/maven/its/mng3379/c/x/0.2-SNAPSHOT/maven-metadata.xml
[INFO] Downloaded from maven-core-it: file:///home/jenkins/jenkins-slave/workspace/maven-box_maven_buildfix/test/core-it-suite/target/test-classes/mng-3379/repo/org/apache/maven/its/mng3379/d/x/maven-metadata.xml (323 B at 81 kB/s)
[INFO] Downloaded from maven-core-it: file:///home/jenkins/jenkins-slave/workspace/maven-box_maven_buildfix/test/core-it-suite/target/test-classes/mng-3379/repo/org/apache/maven/its/mng3379/c/x/0.2-SNAPSHOT/maven-metadata.xml (365 B at 182 kB/s)
[INFO] Downloading from maven-core-it: file:///home/jenkins/jenkins-slave/workspace/maven-box_maven_buildfix/test/core-it-suite/target/test-classes/mng-3379/repo/org/apache/maven/its/mng3379/a/x/0.2-SNAPSHOT/x-0.2-20100119.121141-1.pom
[INFO] Downloading from maven-core-it: file:///home/jenkins/jenkins-slave/workspace/maven-box_maven_buildfix/test/core-it-suite/target/test-classes/mng-3379/repo/org/apache/maven/its/mng3379/d/x/0.2-SNAPSHOT/x-0.2-20100119.121254-1.pom
[INFO] Downloading from maven-core-it: file:///home/jenkins/jenkins-slave/workspace/maven-box_maven_buildfix/test/core-it-suite/target/test-classes/mng-3379/repo/org/apache/maven/its/mng3379/c/x/0.2-SNAPSHOT/maven-metadata.xml
[INFO] Downloading from maven-core-it: file:///home/jenkins/jenkins-slave/workspace/maven-box_maven_buildfix/test/core-it-suite/target/test-classes/mng-3379/repo/org/apache/maven/its/mng3379/d/x/0.2-SNAPSHOT/x-0.2-20100119.121254-1.pom
[INFO] Downloaded from maven-core-it: file:///home/jenkins/jenkins-slave/workspace/maven-box_maven_buildfix/test/core-it-suite/target/test-classes/mng-3379/repo/org/apache/maven/its/mng3379/a/x/0.2-SNAPSHOT/x-0.2-20100119.121141-1.pom (2.3 kB at 2.3 MB/s)
[INFO] Downloaded from maven-core-it: file:///home/jenkins/jenkins-slave/workspace/maven-box_maven_buildfix/test/core-it-suite/target/test-classes/mng-3379/repo/org/apache/maven/its/mng3379/d/x/0.2-SNAPSHOT/x-0.2-20100119.121254-1.pom (2.3 kB at 2.3 MB/s)
[INFO] Downloaded from maven-core-it: file:///home/jenkins/jenkins-slave/workspace/maven-box_maven_buildfix/test/core-it-suite/target/test-classes/mng-3379/repo/org/apache/maven/its/mng3379/c/x/0.2-SNAPSHOT/maven-metadata.xml (365 B at 182 kB/s)
[INFO] Downloading from maven-core-it: file:///home/jenkins/jenkins-slave/workspace/maven-box_maven_buildfix/test/core-it-suite/target/test-classes/mng-3379/repo/org/apache/maven/its/mng3379/c/x/0.2-SNAPSHOT/x-0.2-20100119.121243-1.pom
[INFO] Downloaded from maven-core-it: file:///home/jenkins/jenkins-slave/workspace/maven-box_maven_buildfix/test/core-it-suite/target/test-classes/mng-3379/repo/org/apache/maven/its/mng3379/c/x/0.2-SNAPSHOT/x-0.2-20100119.121243-1.pom (2.3 kB at 2.3 MB/s)
[INFO] Downloading from maven-core-it: file:///home/jenkins/jenkins-slave/workspace/maven-box_maven_buildfix/test/core-it-suite/target/test-classes/mng-3379/repo/org/apache/maven/its/mng3379/c/x/0.2-SNAPSHOT/x-0.2-20100119.121243-1.pom
[INFO] Downloaded from maven-core-it: file:///home/jenkins/jenkins-slave/workspace/maven-box_maven_buildfix/test/core-it-suite/target/test-classes/mng-3379/repo/org/apache/maven/its/mng3379/c/x/0.2-SNAPSHOT/x-0.2-20100119.121243-1.pom (2.3 kB at 2.3 MB/s)
[INFO] Downloaded from maven-core-it: file:///home/jenkins/jenkins-slave/workspace/maven-box_maven_buildfix/test/core-it-suite/target/test-classes/mng-3379/repo/org/apache/maven/its/mng3379/a/x/maven-metadata.xml (323 B at 3.1 kB/s)
[INFO] Downloaded from maven-core-it: file:///home/jenkins/jenkins-slave/workspace/maven-box_maven_buildfix/test/core-it-suite/target/test-classes/mng-3379/repo/org/apache/maven/its/mng3379/a/x/0.2-SNAPSHOT/maven-metadata.xml (365 B at 3.6 kB/s)
[INFO] Downloaded from maven-core-it: file:///home/jenkins/jenkins-slave/workspace/maven-box_maven_buildfix/test/core-it-suite/target/test-classes/mng-3379/repo/org/apache/maven/its/mng3379/d/x/0.2-SNAPSHOT/maven-metadata.xml (365 B at 3.6 kB/s)
[INFO] Downloaded from maven-core-it: file:///home/jenkins/jenkins-slave/workspace/maven-box_maven_buildfix/test/core-it-suite/target/test-classes/mng-3379/repo/org/apache/maven/its/mng3379/c/x/0.2-SNAPSHOT/maven-metadata.xml (365 B at 3.6 kB/s)
[INFO] Downloaded from maven-core-it: file:///home/jenkins/jenkins-slave/workspace/maven-box_maven_buildfix/test/core-it-suite/target/test-classes/mng-3379/repo/org/apache/maven/its/mng3379/d/x/maven-metadata.xml (323 B at 3.1 kB/s)
[INFO] Downloaded from maven-core-it: file:///home/jenkins/jenkins-slave/workspace/maven-box_maven_buildfix/test/core-it-suite/target/test-classes/mng-3379/repo/org/apache/maven/its/mng3379/d/x/0.2-SNAPSHOT/x-0.2-20100119.121254-1.pom (2.3 kB at 22 kB/s)
[INFO] Downloaded from maven-core-it: file:///home/jenkins/jenkins-slave/workspace/maven-box_maven_buildfix/test/core-it-suite/target/test-classes/mng-3379/repo/org/apache/maven/its/mng3379/a/x/maven-metadata.xml (323 B at 1.6 kB/s)
[INFO] ------------------------------------------------------------------------
[INFO] BUILD FAILURE
[INFO] ------------------------------------------------------------------------
[INFO] Total time:  0.251 s
[INFO] Finished at: 2019-07-14T09:29:29Z
[INFO] ------------------------------------------------------------------------
[ERROR] NullPointerException
java.lang.NullPointerException
[ERROR] 
[ERROR] Re-run Maven using the -X switch to enable full debug logging.


Stack Trace:
org.apache.maven.it.VerificationException: 
Exit code was non-zero: 1; command line and log = 
/home/jenkins/jenkins-slave/workspace/maven-box_maven_buildfix/test/core-it-suite/target/apache-maven/bin/mvn --global-settings /home/jenkins/jenkins-slave/workspace/maven-box_maven_buildfix/test/core-it-suite/target/test-classes/settings.xml --settings settings.xml -e --batch-mode -Dmaven.repo.local=/home/jenkins/jenkins-slave/workspace/maven-box_maven_buildfix/test/it-local-repo validate
[INFO] [jenkins-event-spy] Jenkins Maven Event Spy is disabled
[INFO] Error stacktraces are turned on.
[INFO] Scanning for projects...
[INFO] 
[INFO] -----------------< org.apache.maven.its.mng3379:test >------------------
[INFO] Building Maven Integration Test :: MNG-3379 1
[INFO] --------------------------------[ jar ]---------------------------------
[INFO] Downloading from maven-core-it: file:///home/jenkins/jenkins-slave/workspace/maven-box_maven_buildfix/test/core-it-suite/target/test-classes/mng-3379/repo/org/apache/maven/its/mng3379/a/x/maven-metadata.xml
[INFO] Downloading from central: file:target/null/org/apache/maven/its/mng3379/a/x/maven-metadata.xml
[INFO] Downloading from central: file:target/null/org/apache/maven/its/mng3379/a/x/maven-metadata.xml
[INFO] Downloading from central: file:target/null/org/apache/maven/its/mng3379/a/x/maven-metadata.xml
[INFO] Downloading from central: file:target/null/org/apache/maven/its/mng3379/a/x/maven-metadata.xml
[INFO] Downloading from maven-core-it: file:///home/jenkins/jenkins-slave/workspace/maven-box_maven_buildfix/test/core-it-suite/target/test-classes/mng-3379/repo/org/apache/maven/its/mng3379/a/x/maven-metadata.xml
[INFO] Downloading from maven-core-it: file:///home/jenkins/jenkins-slave/workspace/maven-box_maven_buildfix/test/core-it-suite/target/test-classes/mng-3379/repo/org/apache/maven/its/mng3379/a/x/maven-metadata.xml
[INFO] Downloading from maven-core-it: file:///home/jenkins/jenkins-slave/workspace/maven-box_maven_buildfix/test/core-it-suite/target/test-classes/mng-3379/repo/org/apache/maven/its/mng3379/a/x/maven-metadata.xml
[INFO] Downloading from central: file:target/null/org/apache/maven/its/mng3379/b/x/maven-metadata.xml
[INFO] Downloaded from maven-core-it: file:///home/jenkins/jenkins-slave/workspace/maven-box_maven_buildfix/test/core-it-suite/target/test-classes/mng-3379/repo/org/apache/maven/its/mng3379/a/x/maven-metadata.xml (323 B at 323 kB/s)
[INFO] Downloading from maven-core-it: file:///home/jenkins/jenkins-slave/workspace/maven-box_maven_buildfix/test/core-it-suite/target/test-classes/mng-3379/repo/org/apache/maven/its/mng3379/b/x/maven-metadata.xml
[INFO] Downloading from central: file:target/null/org/apache/maven/its/mng3379/b/x/maven-metadata.xml
[INFO] Downloading from maven-core-it: file:///home/jenkins/jenkins-slave/workspace/maven-box_maven_buildfix/test/core-it-suite/target/test-classes/mng-3379/repo/org/apache/maven/its/mng3379/b/x/maven-metadata.xml
[INFO] Downloading from maven-core-it: file:///home/jenkins/jenkins-slave/workspace/maven-box_maven_buildfix/test/core-it-suite/target/test-classes/mng-3379/repo/org/apache/maven/its/mng3379/b/x/maven-metadata.xml
[INFO] Downloaded from maven-core-it: file:///home/jenkins/jenkins-slave/workspace/maven-box_maven_buildfix/test/core-it-suite/target/test-classes/mng-3379/repo/org/apache/maven/its/mng3379/b/x/maven-metadata.xml (323 B at 323 kB/s)
[INFO] Downloading from central: file:target/null/org/apache/maven/its/mng3379/b/x/maven-metadata.xml
[INFO] Downloading from central: file:target/null/org/apache/maven/its/mng3379/b/x/maven-metadata.xml
[INFO] Downloading from central: file:target/null/org/apache/maven/its/mng3379/c/x/maven-metadata.xml
[INFO] Downloading from maven-core-it: file:///home/jenkins/jenkins-slave/workspace/maven-box_maven_buildfix/test/core-it-suite/target/test-classes/mng-3379/repo/org/apache/maven/its/mng3379/c/x/maven-metadata.xml
[INFO] Downloading from maven-core-it: file:///home/jenkins/jenkins-slave/workspace/maven-box_maven_buildfix/test/core-it-suite/target/test-classes/mng-3379/repo/org/apache/maven/its/mng3379/d/x/maven-metadata.xml
[INFO] Downloading from central: file:target/null/org/apache/maven/its/mng3379/d/x/maven-metadata.xml
[INFO] Downloading from central: file:target/null/org/apache/maven/its/mng3379/c/x/maven-metadata.xml
[INFO] Downloaded from maven-core-it: file:///home/jenkins/jenkins-slave/workspace/maven-box_maven_buildfix/test/core-it-suite/target/test-classes/mng-3379/repo/org/apache/maven/its/mng3379/c/x/maven-metadata.xml (323 B at 323 kB/s)
[INFO] Downloaded from maven-core-it: file:///home/jenkins/jenkins-slave/workspace/maven-box_maven_buildfix/test/core-it-suite/target/test-classes/mng-3379/repo/org/apache/maven/its/mng3379/d/x/maven-metadata.xml (323 B at 323 kB/s)
[INFO] Downloading from central: file:target/null/org/apache/maven/its/mng3379/c/x/maven-metadata.xml
[INFO] Downloading from maven-core-it: file:///home/jenkins/jenkins-slave/workspace/maven-box_maven_buildfix/test/core-it-suite/target/test-classes/mng-3379/repo/org/apache/maven/its/mng3379/b/x/maven-metadata.xml
[INFO] Downloading from maven-core-it: file:///home/jenkins/jenkins-slave/workspace/maven-box_maven_buildfix/test/core-it-suite/target/test-classes/mng-3379/repo/org/apache/maven/its/mng3379/c/x/maven-metadata.xml
[INFO] Downloading from central: file:target/null/org/apache/maven/its/mng3379/c/x/maven-metadata.xml
[INFO] Downloading from maven-core-it: file:///home/jenkins/jenkins-slave/workspace/maven-box_maven_buildfix/test/core-it-suite/target/test-classes/mng-3379/repo/org/apache/maven/its/mng3379/c/x/maven-metadata.xml
[INFO] Downloading from central: file:target/null/org/apache/maven/its/mng3379/d/x/maven-metadata.xml
[INFO] Downloaded from maven-core-it: file:///home/jenkins/jenkins-slave/workspace/maven-box_maven_buildfix/test/core-it-suite/target/test-classes/mng-3379/repo/org/apache/maven/its/mng3379/a/x/maven-metadata.xml (323 B at 20 kB/s)
[INFO] Downloading from central: file:target/null/org/apache/maven/its/mng3379/d/x/maven-metadata.xml
[INFO] Downloaded from maven-core-it: file:///home/jenkins/jenkins-slave/workspace/maven-box_maven_buildfix/test/core-it-suite/target/test-classes/mng-3379/repo/org/apache/maven/its/mng3379/c/x/maven-metadata.xml (323 B at 65 kB/s)
[INFO] Downloaded from maven-core-it: file:///home/jenkins/jenkins-slave/workspace/maven-box_maven_buildfix/test/core-it-suite/target/test-classes/mng-3379/repo/org/apache/maven/its/mng3379/b/x/maven-metadata.xml (323 B at 25 kB/s)
[INFO] Downloaded from maven-core-it: file:///home/jenkins/jenkins-slave/workspace/maven-box_maven_buildfix/test/core-it-suite/target/test-classes/mng-3379/repo/org/apache/maven/its/mng3379/b/x/maven-metadata.xml (323 B at 54 kB/s)
[INFO] Downloaded from maven-core-it: file:///home/jenkins/jenkins-slave/workspace/maven-box_maven_buildfix/test/core-it-suite/target/test-classes/mng-3379/repo/org/apache/maven/its/mng3379/b/x/maven-metadata.xml (323 B at 25 kB/s)
[INFO] Downloaded from maven-core-it: file:///home/jenkins/jenkins-slave/workspace/maven-box_maven_buildfix/test/core-it-suite/target/test-classes/mng-3379/repo/org/apache/maven/its/mng3379/c/x/maven-metadata.xml (323 B at 46 kB/s)
[INFO] Downloading from maven-core-it: file:///home/jenkins/jenkins-slave/workspace/maven-box_maven_buildfix/test/core-it-suite/target/test-classes/mng-3379/repo/org/apache/maven/its/mng3379/c/x/maven-metadata.xml
[WARNING] The metadata /home/jenkins/jenkins-slave/workspace/maven-box_maven_buildfix/test/it-local-repo/org/apache/maven/its/mng3379/b/x/maven-metadata-maven-core-it.xml is invalid: input contained no data
[INFO] Downloading from maven-core-it: file:///home/jenkins/jenkins-slave/workspace/maven-box_maven_buildfix/test/core-it-suite/target/test-classes/mng-3379/repo/org/apache/maven/its/mng3379/d/x/0.2-SNAPSHOT/maven-metadata.xml
[INFO] Downloading from maven-core-it: file:///home/jenkins/jenkins-slave/workspace/maven-box_maven_buildfix/test/core-it-suite/target/test-classes/mng-3379/repo/org/apache/maven/its/mng3379/a/x/0.2-SNAPSHOT/maven-metadata.xml
[WARNING] The metadata /home/jenkins/jenkins-slave/workspace/maven-box_maven_buildfix/test/it-local-repo/org/apache/maven/its/mng3379/b/x/maven-metadata-maven-core-it.xml is invalid: input contained no data
[WARNING] The metadata /home/jenkins/jenkins-slave/workspace/maven-box_maven_buildfix/test/it-local-repo/org/apache/maven/its/mng3379/b/x/maven-metadata-maven-core-it.xml is invalid: input contained no data
[INFO] Downloading from maven-core-it: file:///home/jenkins/jenkins-slave/workspace/maven-box_maven_buildfix/test/core-it-suite/target/test-classes/mng-3379/repo/org/apache/maven/its/mng3379/a/x/0.2-SNAPSHOT/maven-metadata.xml
[INFO] Downloading from maven-core-it: file:///home/jenkins/jenkins-slave/workspace/maven-box_maven_buildfix/test/core-it-suite/target/test-classes/mng-3379/repo/org/apache/maven/its/mng3379/d/x/maven-metadata.xml
[WARNING] The metadata /home/jenkins/jenkins-slave/workspace/maven-box_maven_buildfix/test/it-local-repo/org/apache/maven/its/mng3379/b/x/maven-metadata-maven-core-it.xml is invalid: input contained no data
[INFO] Downloading from maven-core-it: file:///home/jenkins/jenkins-slave/workspace/maven-box_maven_buildfix/test/core-it-suite/target/test-classes/mng-3379/repo/org/apache/maven/its/mng3379/d/x/0.2-SNAPSHOT/maven-metadata.xml
[INFO] Downloaded from maven-core-it: file:///home/jenkins/jenkins-slave/workspace/maven-box_maven_buildfix/test/core-it-suite/target/test-classes/mng-3379/repo/org/apache/maven/its/mng3379/a/x/0.2-SNAPSHOT/maven-metadata.xml (365 B at 122 kB/s)
[INFO] Downloaded from maven-core-it: file:///home/jenkins/jenkins-slave/workspace/maven-box_maven_buildfix/test/core-it-suite/target/test-classes/mng-3379/repo/org/apache/maven/its/mng3379/c/x/maven-metadata.xml (323 B at 108 kB/s)
[INFO] Downloading from maven-core-it: file:///home/jenkins/jenkins-slave/workspace/maven-box_maven_buildfix/test/core-it-suite/target/test-classes/mng-3379/repo/org/apache/maven/its/mng3379/d/x/maven-metadata.xml
[INFO] Downloading from maven-core-it: file:///home/jenkins/jenkins-slave/workspace/maven-box_maven_buildfix/test/core-it-suite/target/test-classes/mng-3379/repo/org/apache/maven/its/mng3379/c/x/0.2-SNAPSHOT/maven-metadata.xml
[INFO] Downloading from maven-core-it: file:///home/jenkins/jenkins-slave/workspace/maven-box_maven_buildfix/test/core-it-suite/target/test-classes/mng-3379/repo/org/apache/maven/its/mng3379/c/x/0.2-SNAPSHOT/maven-metadata.xml
[INFO] Downloaded from maven-core-it: file:///home/jenkins/jenkins-slave/workspace/maven-box_maven_buildfix/test/core-it-suite/target/test-classes/mng-3379/repo/org/apache/maven/its/mng3379/d/x/0.2-SNAPSHOT/maven-metadata.xml (365 B at 73 kB/s)
[INFO] Downloading from maven-core-it: file:///home/jenkins/jenkins-slave/workspace/maven-box_maven_buildfix/test/core-it-suite/target/test-classes/mng-3379/repo/org/apache/maven/its/mng3379/c/x/0.2-SNAPSHOT/maven-metadata.xml
[INFO] Downloaded from maven-core-it: file:///home/jenkins/jenkins-slave/workspace/maven-box_maven_buildfix/test/core-it-suite/target/test-classes/mng-3379/repo/org/apache/maven/its/mng3379/d/x/maven-metadata.xml (323 B at 81 kB/s)
[INFO] Downloaded from maven-core-it: file:///home/jenkins/jenkins-slave/workspace/maven-box_maven_buildfix/test/core-it-suite/target/test-classes/mng-3379/repo/org/apache/maven/its/mng3379/c/x/0.2-SNAPSHOT/maven-metadata.xml (365 B at 182 kB/s)
[INFO] Downloading from maven-core-it: file:///home/jenkins/jenkins-slave/workspace/maven-box_maven_buildfix/test/core-it-suite/target/test-classes/mng-3379/repo/org/apache/maven/its/mng3379/a/x/0.2-SNAPSHOT/x-0.2-20100119.121141-1.pom
[INFO] Downloading from maven-core-it: file:///home/jenkins/jenkins-slave/workspace/maven-box_maven_buildfix/test/core-it-suite/target/test-classes/mng-3379/repo/org/apache/maven/its/mng3379/d/x/0.2-SNAPSHOT/x-0.2-20100119.121254-1.pom
[INFO] Downloading from maven-core-it: file:///home/jenkins/jenkins-slave/workspace/maven-box_maven_buildfix/test/core-it-suite/target/test-classes/mng-3379/repo/org/apache/maven/its/mng3379/c/x/0.2-SNAPSHOT/maven-metadata.xml
[INFO] Downloading from maven-core-it: file:///home/jenkins/jenkins-slave/workspace/maven-box_maven_buildfix/test/core-it-suite/target/test-classes/mng-3379/repo/org/apache/maven/its/mng3379/d/x/0.2-SNAPSHOT/x-0.2-20100119.121254-1.pom
[INFO] Downloaded from maven-core-it: file:///home/jenkins/jenkins-slave/workspace/maven-box_maven_buildfix/test/core-it-suite/target/test-classes/mng-3379/repo/org/apache/maven/its/mng3379/a/x/0.2-SNAPSHOT/x-0.2-20100119.121141-1.pom (2.3 kB at 2.3 MB/s)
[INFO] Downloaded from maven-core-it: file:///home/jenkins/jenkins-slave/workspace/maven-box_maven_buildfix/test/core-it-suite/target/test-classes/mng-3379/repo/org/apache/maven/its/mng3379/d/x/0.2-SNAPSHOT/x-0.2-20100119.121254-1.pom (2.3 kB at 2.3 MB/s)
[INFO] Downloaded from maven-core-it: file:///home/jenkins/jenkins-slave/workspace/maven-box_maven_buildfix/test/core-it-suite/target/test-classes/mng-3379/repo/org/apache/maven/its/mng3379/c/x/0.2-SNAPSHOT/maven-metadata.xml (365 B at 182 kB/s)
[INFO] Downloading from maven-core-it: file:///home/jenkins/jenkins-slave/workspace/maven-box_maven_buildfix/test/core-it-suite/target/test-classes/mng-3379/repo/org/apache/maven/its/mng3379/c/x/0.2-SNAPSHOT/x-0.2-20100119.121243-1.pom
[INFO] Downloaded from maven-core-it: file:///home/jenkins/jenkins-slave/workspace/maven-box_maven_buildfix/test/core-it-suite/target/test-classes/mng-3379/repo/org/apache/maven/its/mng3379/c/x/0.2-SNAPSHOT/x-0.2-20100119.121243-1.pom (2.3 kB at 2.3 MB/s)
[INFO] Downloading from maven-core-it: file:///home/jenkins/jenkins-slave/workspace/maven-box_maven_buildfix/test/core-it-suite/target/test-classes/mng-3379/repo/org/apache/maven/its/mng3379/c/x/0.2-SNAPSHOT/x-0.2-20100119.121243-1.pom
[INFO] Downloaded from maven-core-it: file:///home/jenkins/jenkins-slave/workspace/maven-box_maven_buildfix/test/core-it-suite/target/test-classes/mng-3379/repo/org/apache/maven/its/mng3379/c/x/0.2-SNAPSHOT/x-0.2-20100119.121243-1.pom (2.3 kB at 2.3 MB/s)
[INFO] Downloaded from maven-core-it: file:///home/jenkins/jenkins-slave/workspace/maven-box_maven_buildfix/test/core-it-suite/target/test-classes/mng-3379/repo/org/apache/maven/its/mng3379/a/x/maven-metadata.xml (323 B at 3.1 kB/s)
[INFO] Downloaded from maven-core-it: file:///home/jenkins/jenkins-slave/workspace/maven-box_maven_buildfix/test/core-it-suite/target/test-classes/mng-3379/repo/org/apache/maven/its/mng3379/a/x/0.2-SNAPSHOT/maven-metadata.xml (365 B at 3.6 kB/s)
[INFO] Downloaded from maven-core-it: file:///home/jenkins/jenkins-slave/workspace/maven-box_maven_buildfix/test/core-it-suite/target/test-classes/mng-3379/repo/org/apache/maven/its/mng3379/d/x/0.2-SNAPSHOT/maven-metadata.xml (365 B at 3.6 kB/s)
[INFO] Downloaded from maven-core-it: file:///home/jenkins/jenkins-slave/workspace/maven-box_maven_buildfix/test/core-it-suite/target/test-classes/mng-3379/repo/org/apache/maven/its/mng3379/c/x/0.2-SNAPSHOT/maven-metadata.xml (365 B at 3.6 kB/s)
[INFO] Downloaded from maven-core-it: file:///home/jenkins/jenkins-slave/workspace/maven-box_maven_buildfix/test/core-it-suite/target/test-classes/mng-3379/repo/org/apache/maven/its/mng3379/d/x/maven-metadata.xml (323 B at 3.1 kB/s)
[INFO] Downloaded from maven-core-it: file:///home/jenkins/jenkins-slave/workspace/maven-box_maven_buildfix/test/core-it-suite/target/test-classes/mng-3379/repo/org/apache/maven/its/mng3379/d/x/0.2-SNAPSHOT/x-0.2-20100119.121254-1.pom (2.3 kB at 22 kB/s)
[INFO] Downloaded from maven-core-it: file:///home/jenkins/jenkins-slave/workspace/maven-box_maven_buildfix/test/core-it-suite/target/test-classes/mng-3379/repo/org/apache/maven/its/mng3379/a/x/maven-metadata.xml (323 B at 1.6 kB/s)
[INFO] ------------------------------------------------------------------------
[INFO] BUILD FAILURE
[INFO] ------------------------------------------------------------------------
[INFO] Total time:  0.251 s
[INFO] Finished at: 2019-07-14T09:29:29Z
[INFO] ------------------------------------------------------------------------
[ERROR] NullPointerException
java.lang.NullPointerException
[ERROR] 
[ERROR] Re-run Maven using the -X switch to enable full debug logging.

	at org.apache.maven.it.MavenITmng3379ParallelArtifactDownloadsTest.testitMNG3379(MavenITmng3379ParallelArtifactDownloadsTest.java:60)




Build log:
[...truncated 76307 lines...]
[withMaven] openTasksPublisher - Scan Tasks for Maven artifact org.apache.maven.its.plugins:maven-it-plugin-invalid-descriptor:maven-plugin:2.1-SNAPSHOT in source directory core-it-support\core-it-plugins\maven-it-plugin-invalid-descriptor\src\main\java
[withMaven] openTasksPublisher - Scan Tasks for Maven artifact org.apache.maven.its.plugins:maven-it-plugin-log-file:maven-plugin:2.1-SNAPSHOT in source directory core-it-support\core-it-plugins\maven-it-plugin-log-file\src\main\java
[withMaven] openTasksPublisher - Scan Tasks for Maven artifact org.apache.maven.its:maven-it-helper:jar:2.1-SNAPSHOT in source directory core-it-support\maven-it-helper\src\main\java
[withMaven] openTasksPublisher - Scan Tasks for Maven artifact org.apache.maven.its.plugins:maven-it-plugin-model-interpolation:maven-plugin:2.1-SNAPSHOT in source directory core-it-support\core-it-plugins\maven-it-plugin-model-interpolation\src\main\java
[withMaven] openTasksPublisher - Scan Tasks for Maven artifact org.apache.maven.its.plugins:maven-it-plugin-no-default-comp:maven-plugin:2.1-SNAPSHOT in source directory core-it-support\core-it-plugins\maven-it-plugin-no-default-comp\src\main\java
[withMaven] openTasksPublisher - Scan Tasks for Maven artifact org.apache.maven.its.plugins:maven-it-plugin-no-project:maven-plugin:2.1-SNAPSHOT in source directory core-it-support\core-it-plugins\maven-it-plugin-no-project\src\main\java
[withMaven] openTasksPublisher - Scan Tasks for Maven artifact org.apache.maven.its.plugins:maven-it-plugin-online:maven-plugin:2.1-SNAPSHOT in source directory core-it-support\core-it-plugins\maven-it-plugin-online\src\main\java
[withMaven] openTasksPublisher - Scan Tasks for Maven artifact org.apache.maven.its.plugins:maven-it-plugin-optional-mojos:maven-plugin:2.1-SNAPSHOT in source directory core-it-support\core-it-plugins\maven-it-plugin-optional-mojos\src\main\java
[withMaven] openTasksPublisher - Scan Tasks for Maven artifact org.apache.maven.its.plugins:maven-it-plugin-plexus-lifecycle:maven-plugin:2.1-SNAPSHOT in source directory core-it-support/core-it-plugins/maven-it-plugin-plexus-lifecycle/src/main/java
[withMaven] openTasksPublisher - Scan Tasks for Maven artifact org.apache.maven.its.plugins:maven-it-plugin-packaging:maven-plugin:2.1-SNAPSHOT in source directory core-it-support\core-it-plugins\maven-it-plugin-packaging\src\main\java
[withMaven] openTasksPublisher - Scan Tasks for Maven artifact org.apache.maven.its.plugins:maven-it-plugin-parameter-implementation:maven-plugin:2.1-SNAPSHOT in source directory core-it-support\core-it-plugins\maven-it-plugin-parameter-implementation\src\main\java
[withMaven] openTasksPublisher - Scan Tasks for Maven artifact org.apache.maven.its.plugins:maven-it-plugin-plugin-dependency:maven-plugin:2.1-SNAPSHOT in source directory core-it-support\core-it-plugins\maven-it-plugin-plugin-dependency\src\main\java
[withMaven] openTasksPublisher - Scan Tasks for Maven artifact org.apache.maven.its.plugins:maven-it-plugin-project:maven-plugin:2.1-SNAPSHOT in source directory core-it-support\core-it-plugins\maven-it-plugin-project\src\main\java
[withMaven] openTasksPublisher - Scan Tasks for Maven artifact org.apache.maven.its.plugins:maven-it-plugin-project-interpolation:maven-plugin:2.1-SNAPSHOT in source directory core-it-support\core-it-plugins\maven-it-plugin-project-interpolation\src\main\java
[withMaven] openTasksPublisher - Scan Tasks for Maven artifact org.apache.maven.its.plugins:maven-it-plugin-setter:maven-plugin:2.1-SNAPSHOT in source directory core-it-support\core-it-plugins\maven-it-plugin-setter\src\main\java
[withMaven] openTasksPublisher - Scan Tasks for Maven artifact org.apache.maven.its.plugins:maven-it-plugin-singleton-component:maven-plugin:2.1-SNAPSHOT in source directory core-it-support\core-it-plugins\maven-it-plugin-singleton-component\src\main\java
[withMaven] openTasksPublisher - Scan Tasks for Maven artifact org.apache.maven.its.plugins:maven-it-plugin-site:maven-plugin:2.1-SNAPSHOT in source directory core-it-support\core-it-plugins\maven-it-plugin-site\src\main\java
[withMaven] openTasksPublisher - Scan Tasks for Maven artifact org.apache.maven.its.plugins:maven-it-plugin-toolchain:maven-plugin:2.1-SNAPSHOT in source directory core-it-support\core-it-plugins\maven-it-plugin-toolchain\src\main\java
[withMaven] openTasksPublisher - Scan Tasks for Maven artifact org.apache.maven.its.plugins:maven-it-plugin-touch:maven-plugin:2.1-SNAPSHOT in source directory core-it-support\core-it-plugins\maven-it-plugin-touch\src\main\java
[withMaven] openTasksPublisher - Scan Tasks for Maven artifact org.apache.maven.its.plugins:maven-it-plugin-uses-properties:maven-plugin:2.1-SNAPSHOT in source directory core-it-support\core-it-plugins\maven-it-plugin-uses-properties\src\main\java
[withMaven] openTasksPublisher - Scan Tasks for Maven artifact org.apache.maven.its.plugins:maven-it-plugin-uses-wagon:maven-plugin:2.1-SNAPSHOT in source directory core-it-support\core-it-plugins\maven-it-plugin-uses-wagon\src\main\java
[withMaven] openTasksPublisher - Scan Tasks for Maven artifact org.apache.maven.its.plugins:maven-it-plugin-all:maven-plugin:2.1-SNAPSHOT in source directory core-it-support\core-it-plugins\maven-it-plugin-all\src\main\java
[withMaven] openTasksPublisher - Scan Tasks for Maven artifact org.apache.maven.its.plugins:maven-it-plugin-plexus-utils-11:maven-plugin:2.1-SNAPSHOT in source directory core-it-support\core-it-plugins\maven-it-plugin-plexus-utils-11\src\main\java
[withMaven] openTasksPublisher - Scan Tasks for Maven artifact org.apache.maven.its.plugins:maven-it-plugin-plexus-utils-new:maven-plugin:2.1-SNAPSHOT in source directory core-it-support\core-it-plugins\maven-it-plugin-plexus-utils-new\src\main\java
[withMaven] openTasksPublisher - Scan Tasks for Maven artifact org.apache.maven.its.plugins:maven-it-plugin-plexus-component-api:maven-plugin:2.1-SNAPSHOT in source directory core-it-support\core-it-plugins\maven-it-plugin-plexus-component-api\src\main\java
[withMaven] openTasksPublisher - Scan Tasks for Maven artifact org.apache.maven.its.plugins:maven-it-plugin-log4j:maven-plugin:2.1-SNAPSHOT in source directory core-it-support\core-it-plugins\maven-it-plugin-log4j\src\main\java
[withMaven] openTasksPublisher - Scan Tasks for Maven artifact org.apache.maven.its.plugins:maven-it-plugin-extension1:maven-plugin:2.1-SNAPSHOT in source directory core-it-support\core-it-plugins\maven-it-plugin-extension1\src\main\java
[withMaven] openTasksPublisher - Scan Tasks for Maven artifact org.apache.maven.its.plugins:maven-it-plugin-extension2:maven-plugin:2.1-SNAPSHOT in source directory core-it-support\core-it-plugins\maven-it-plugin-extension2\src\main\java
[withMaven] openTasksPublisher - Scan Tasks for Maven artifact org.apache.maven.its.plugins:maven-it-plugin-plexus-lifecycle:maven-plugin:2.1-SNAPSHOT in source directory core-it-support\core-it-plugins\maven-it-plugin-plexus-lifecycle\src\main\java
[withMaven] openTasksPublisher - Scan Tasks for Maven artifact org.apache.maven.its.plugins:maven-it-plugin-settings:maven-plugin:2.1-SNAPSHOT in source directory core-it-support\core-it-plugins\maven-it-plugin-settings\src\main\java
[withMaven] openTasksPublisher - Scan Tasks for Maven artifact org.apache.maven.its.plugins:mng-5805-pkg-type-mojo-configuration-plugin:maven-plugin:2.1-SNAPSHOT in source directory core-it-support\core-it-plugins\mng5805-plugin\src\main\java
[withMaven] openTasksPublisher - Scan Tasks for Maven artifact org.apache.maven.its.plugins:mng-5805-pkg-type-mojo-configuration-plugin-dep:jar:2.1-SNAPSHOT in source directory core-it-support\core-it-plugins\mng5805-plugin-dep\src\main\java
[withMaven] openTasksPublisher - Scan Tasks for Maven artifact org.apache.maven.its.plugins:mng-5958-pkg-type-extension:jar:2.1-SNAPSHOT in source directory core-it-support\core-it-plugins\mng5958-extension\src\main\java
[withMaven] openTasksPublisher - Scan Tasks for Maven artifact org.apache.maven.its:core-it-toolchain:jar:2.1-SNAPSHOT in source directory core-it-support\core-it-toolchain\src\main\java
[withMaven] openTasksPublisher - Scan Tasks for Maven artifact org.apache.maven.its:core-it-wagon:jar:2.1-SNAPSHOT in source directory core-it-support\core-it-wagon\src\main\java
[withMaven] openTasksPublisher - Scan Tasks for Maven artifact org.apache.maven.its.plugins:maven-it-plugin-settings:maven-plugin:2.1-SNAPSHOT in source directory core-it-support/core-it-plugins/maven-it-plugin-settings/src/main/java
[TASKS] Scanning folder 'c:\mvn-it-0.tmp' for files matching the pattern 'core-it-support\core-it-plugins\maven-it-plugin-active-collection\src\main\java\**\*,core-it-support\core-it-plugins\maven-it-plugin-artifact\src\main\java\**\*,core-it-support\core-it-plugins\maven-it-plugin-class-loader\dep-a\src\main\java\**\*,core-it-support\core-it-plugins\maven-it-plugin-class-loader\dep-b\src\main\java\**\*,core-it-support\core-it-plugins\maven-it-plugin-class-loader\maven-it-plugin-class-loader\src\main\java\**\*,core-it-support\core-it-plugins\maven-it-plugin-configuration\src\main\java\**\*,core-it-support\core-it-plugins\maven-it-plugin-context-passing\src\main\java\**\*,core-it-support\core-it-plugins\maven-it-plugin-core-stubs\maven-clean-plugin\src\main\java\**\*,core-it-support\core-it-plugins\maven-it-plugin-core-stubs\maven-compiler-plugin\src\main\java\**\*,core-it-support\core-it-plugins\maven-it-plugin-core-stubs\maven-deploy-plugin\src\main\java\**\*,core-it-support\core-it-plugins\maven-it-plugin-core-stubs\maven-ear-plugin\src\main\java\**\*,core-it-support\core-it-plugins\maven-it-plugin-core-stubs\maven-ejb-plugin\src\main\java\**\*,core-it-support\core-it-plugins\maven-it-plugin-core-stubs\maven-install-plugin\src\main\java\**\*,core-it-support\core-it-plugins\maven-it-plugin-core-stubs\maven-jar-plugin\src\main\java\**\*,core-it-support\core-it-plugins\maven-it-plugin-core-stubs\maven-javadoc-plugin\src\main\java\**\*,core-it-support\core-it-plugins\maven-it-plugin-core-stubs\maven-plugin-plugin\src\main\java\**\*,core-it-support\core-it-plugins\maven-it-plugin-core-stubs\maven-rar-plugin\src\main\java\**\*,core-it-support\core-it-plugins\maven-it-plugin-core-stubs\maven-resources-plugin\src\main\java\**\*,core-it-support\core-it-plugins\maven-it-plugin-core-stubs\maven-site-plugin\src\main\java\**\*,core-it-support\core-it-plugins\maven-it-plugin-core-stubs\maven-source-plugin\src\main\java\**\*,core-it-support\core-it-plugins\maven-it-plugin-core-stubs\maven-surefire-plugin\src\main\java\**\*,core-it-support\core-it-plugins\maven-it-plugin-core-stubs\maven-war-plugin\src\main\java\**\*,core-it-support\core-it-plugins\maven-it-plugin-dependency-collection\src\main\java\**\*,core-it-support\core-it-plugins\maven-it-plugin-dependency-resolution\src\main\java\**\*,core-it-support\core-it-plugins\maven-it-plugin-expression\src\main\java\**\*,core-it-support\core-it-plugins\maven-it-plugin-error\src\main\java\**\*,core-it-support\core-it-component\src\main\java\**\*,core-it-support\core-it-plugins\maven-it-plugin-extension-consumer\src\main\java\**\*,core-it-support\core-it-plugins\maven-it-plugin-extension-provider\src\main\java\**\*,core-it-support\core-it-plugins\maven-it-plugin-fork\src\main\java\**\*,core-it-support\core-it-plugins\maven-it-plugin-invalid-descriptor\src\main\java\**\*,core-it-support\core-it-plugins\maven-it-plugin-log-file\src\main\java\**\*,core-it-support\maven-it-helper\src\main\java\**\*,core-it-support\core-it-plugins\maven-it-plugin-model-interpolation\src\main\java\**\*,core-it-support\core-it-plugins\maven-it-plugin-no-default-comp\src\main\java\**\*,core-it-support\core-it-plugins\maven-it-plugin-no-project\src\main\java\**\*,core-it-support\core-it-plugins\maven-it-plugin-online\src\main\java\**\*,core-it-support\core-it-plugins\maven-it-plugin-optional-mojos\src\main\java\**\*,core-it-support\core-it-plugins\maven-it-plugin-packaging\src\main\java\**\*,core-it-support\core-it-plugins\maven-it-plugin-parameter-implementation\src\main\java\**\*,core-it-support\core-it-plugins\maven-it-plugin-plugin-dependency\src\main\java\**\*,core-it-support\core-it-plugins\maven-it-plugin-project\src\main\java\**\*,core-it-support\core-it-plugins\maven-it-plugin-project-interpolation\src\main\java\**\*,core-it-support\core-it-plugins\maven-it-plugin-setter\src\main\java\**\*,core-it-support\core-it-plugins\maven-it-plugin-singleton-component\src\main\java\**\*,core-it-support\core-it-plugins\maven-it-plugin-site\src\main\java\**\*,core-it-support\core-it-plugins\maven-it-plugin-toolchain\src\main\java\**\*,core-it-support\core-it-plugins\maven-it-plugin-touch\src\main\java\**\*,core-it-support\core-it-plugins\maven-it-plugin-uses-properties\src\main\java\**\*,core-it-support\core-it-plugins\maven-it-plugin-uses-wagon\src\main\java\**\*,core-it-support\core-it-plugins\maven-it-plugin-all\src\main\java\**\*,core-it-support\core-it-plugins\maven-it-plugin-plexus-utils-11\src\main\java\**\*,core-it-support\core-it-plugins\maven-it-plugin-plexus-utils-new\src\main\java\**\*,core-it-support\core-it-plugins\maven-it-plugin-plexus-component-api\src\main\java\**\*,core-it-support\core-it-plugins\maven-it-plugin-log4j\src\main\java\**\*,core-it-support\core-it-plugins\maven-it-plugin-extension1\src\main\java\**\*,core-it-support\core-it-plugins\maven-it-plugin-extension2\src\main\java\**\*,core-it-support\core-it-plugins\maven-it-plugin-plexus-lifecycle\src\main\java\**\*,core-it-support\core-it-plugins\maven-it-plugin-settings\src\main\java\**\*,core-it-support\core-it-plugins\mng5805-plugin\src\main\java\**\*,core-it-support\core-it-plugins\mng5805-plugin-dep\src\main\java\**\*,core-it-support\core-it-plugins\mng5958-extension\src\main\java\**\*,core-it-support\core-it-toolchain\src\main\java\**\*,core-it-support\core-it-wagon\src\main\java\**\*' - excludes: null
[TASKS] Found 164 files to scan for tasks
[TASKS] Found 0 open tasks.
Skipping warnings blame since pipelines do not have an SCM link.%n
[withMaven] Publishers: Pipeline Graph Publisher: 24 ms, Generated Artifacts Publisher: 3229 ms, Invoker Publisher: 5 ms, Junit Publisher: 10050 ms, Concordion Publisher: 9 ms, Dependencies Fingerprint Publisher: 104 ms, Findbugs Publisher: 4 ms, JGiven Publisher: 2 ms, Jacoco Publisher: 3 ms, SpotBugs Publisher: 2 ms, Open Task Scanner Publisher: 504 ms
[Pipeline] // withMaven
[withMaven] openTasksPublisher - Scan Tasks for Maven artifact org.apache.maven.its.plugins:mng-5805-pkg-type-mojo-configuration-plugin:maven-plugin:2.1-SNAPSHOT in source directory core-it-support/core-it-plugins/mng5805-plugin/src/main/java
[withMaven] openTasksPublisher - Scan Tasks for Maven artifact org.apache.maven.its.plugins:mng-5805-pkg-type-mojo-configuration-plugin-dep:jar:2.1-SNAPSHOT in source directory core-it-support/core-it-plugins/mng5805-plugin-dep/src/main/java
[withMaven] openTasksPublisher - Scan Tasks for Maven artifact org.apache.maven.its.plugins:mng-5958-pkg-type-extension:jar:2.1-SNAPSHOT in source directory core-it-support/core-it-plugins/mng5958-extension/src/main/java
[withMaven] openTasksPublisher - Scan Tasks for Maven artifact org.apache.maven.its:core-it-toolchain:jar:2.1-SNAPSHOT in source directory core-it-support/core-it-toolchain/src/main/java
[withMaven] openTasksPublisher - Scan Tasks for Maven artifact org.apache.maven.its:core-it-wagon:jar:2.1-SNAPSHOT in source directory core-it-support/core-it-wagon/src/main/java
[TASKS] Scanning folder '/home/jenkins/jenkins-slave/workspace/maven-box_maven_buildfix/test' for files matching the pattern 'core-it-support/core-it-plugins/maven-it-plugin-active-collection/src/main/java/**/*,core-it-support/core-it-plugins/maven-it-plugin-artifact/src/main/java/**/*,core-it-support/core-it-plugins/maven-it-plugin-class-loader/dep-a/src/main/java/**/*,core-it-support/core-it-plugins/maven-it-plugin-class-loader/dep-b/src/main/java/**/*,core-it-support/core-it-plugins/maven-it-plugin-class-loader/maven-it-plugin-class-loader/src/main/java/**/*,core-it-support/core-it-plugins/maven-it-plugin-configuration/src/main/java/**/*,core-it-support/core-it-plugins/maven-it-plugin-context-passing/src/main/java/**/*,core-it-support/core-it-plugins/maven-it-plugin-core-stubs/maven-clean-plugin/src/main/java/**/*,core-it-support/core-it-plugins/maven-it-plugin-core-stubs/maven-compiler-plugin/src/main/java/**/*,core-it-support/core-it-plugins/maven-it-plugin-core-stubs/maven-deploy-plugin/src/main/java/**/*,core-it-support/core-it-plugins/maven-it-plugin-core-stubs/maven-ear-plugin/src/main/java/**/*,core-it-support/core-it-plugins/maven-it-plugin-core-stubs/maven-ejb-plugin/src/main/java/**/*,core-it-support/core-it-plugins/maven-it-plugin-core-stubs/maven-install-plugin/src/main/java/**/*,core-it-support/core-it-plugins/maven-it-plugin-core-stubs/maven-jar-plugin/src/main/java/**/*,core-it-support/core-it-plugins/maven-it-plugin-core-stubs/maven-javadoc-plugin/src/main/java/**/*,core-it-support/core-it-plugins/maven-it-plugin-core-stubs/maven-plugin-plugin/src/main/java/**/*,core-it-support/core-it-plugins/maven-it-plugin-core-stubs/maven-rar-plugin/src/main/java/**/*,core-it-support/core-it-plugins/maven-it-plugin-core-stubs/maven-resources-plugin/src/main/java/**/*,core-it-support/core-it-plugins/maven-it-plugin-core-stubs/maven-site-plugin/src/main/java/**/*,core-it-support/core-it-plugins/maven-it-plugin-core-stubs/maven-source-plugin/src/main/java/**/*,core-it-support/core-it-plugins/maven-it-plugin-core-stubs/maven-surefire-plugin/src/main/java/**/*,core-it-support/core-it-plugins/maven-it-plugin-core-stubs/maven-war-plugin/src/main/java/**/*,core-it-support/core-it-plugins/maven-it-plugin-dependency-collection/src/main/java/**/*,core-it-support/core-it-plugins/maven-it-plugin-dependency-resolution/src/main/java/**/*,core-it-support/core-it-plugins/maven-it-plugin-expression/src/main/java/**/*,core-it-support/core-it-plugins/maven-it-plugin-error/src/main/java/**/*,core-it-support/core-it-component/src/main/java/**/*,core-it-support/core-it-plugins/maven-it-plugin-extension-consumer/src/main/java/**/*,core-it-support/core-it-plugins/maven-it-plugin-extension-provider/src/main/java/**/*,core-it-support/core-it-plugins/maven-it-plugin-fork/src/main/java/**/*,core-it-support/core-it-plugins/maven-it-plugin-invalid-descriptor/src/main/java/**/*,core-it-support/core-it-plugins/maven-it-plugin-log-file/src/main/java/**/*,core-it-support/maven-it-helper/src/main/java/**/*,core-it-support/core-it-plugins/maven-it-plugin-model-interpolation/src/main/java/**/*,core-it-support/core-it-plugins/maven-it-plugin-no-default-comp/src/main/java/**/*,core-it-support/core-it-plugins/maven-it-plugin-no-project/src/main/java/**/*,core-it-support/core-it-plugins/maven-it-plugin-online/src/main/java/**/*,core-it-support/core-it-plugins/maven-it-plugin-optional-mojos/src/main/java/**/*,core-it-support/core-it-plugins/maven-it-plugin-packaging/src/main/java/**/*,core-it-support/core-it-plugins/maven-it-plugin-parameter-implementation/src/main/java/**/*,core-it-support/core-it-plugins/maven-it-plugin-plugin-dependency/src/main/java/**/*,core-it-support/core-it-plugins/maven-it-plugin-project/src/main/java/**/*,core-it-support/core-it-plugins/maven-it-plugin-project-interpolation/src/main/java/**/*,core-it-support/core-it-plugins/maven-it-plugin-setter/src/main/java/**/*,core-it-support/core-it-plugins/maven-it-plugin-singleton-component/src/main/java/**/*,core-it-support/core-it-plugins/maven-it-plugin-site/src/main/java/**/*,core-it-support/core-it-plugins/maven-it-plugin-toolchain/src/main/java/**/*,core-it-support/core-it-plugins/maven-it-plugin-touch/src/main/java/**/*,core-it-support/core-it-plugins/maven-it-plugin-uses-properties/src/main/java/**/*,core-it-support/core-it-plugins/maven-it-plugin-uses-wagon/src/main/java/**/*,core-it-support/core-it-plugins/maven-it-plugin-all/src/main/java/**/*,core-it-support/core-it-plugins/maven-it-plugin-plexus-utils-11/src/main/java/**/*,core-it-support/core-it-plugins/maven-it-plugin-plexus-utils-new/src/main/java/**/*,core-it-support/core-it-plugins/maven-it-plugin-plexus-component-api/src/main/java/**/*,core-it-support/core-it-plugins/maven-it-plugin-log4j/src/main/java/**/*,core-it-support/core-it-plugins/maven-it-plugin-extension1/src/main/java/**/*,core-it-support/core-it-plugins/maven-it-plugin-extension2/src/main/java/**/*,core-it-support/core-it-plugins/maven-it-plugin-plexus-lifecycle/src/main/java/**/*,core-it-support/core-it-plugins/maven-it-plugin-settings/src/main/java/**/*,core-it-support/core-it-plugins/mng5805-plugin/src/main/java/**/*,core-it-support/core-it-plugins/mng5805-plugin-dep/src/main/java/**/*,core-it-support/core-it-plugins/mng5958-extension/src/main/java/**/*,core-it-support/core-it-toolchain/src/main/java/**/*,core-it-support/core-it-wagon/src/main/java/**/*' - excludes: null
[TASKS] Found 164 files to scan for tasks
[TASKS] Found 0 open tasks.
Skipping warnings blame since pipelines do not have an SCM link.%n
[withMaven] Publishers: Pipeline Graph Publisher: 50 ms, Generated Artifacts Publisher: 585583 ms, Invoker Publisher: 9 ms, Junit Publisher: 511909 ms, Concordion Publisher: 4 ms, Dependencies Fingerprint Publisher: 2627 ms, Findbugs Publisher: 4 ms, JGiven Publisher: 3 ms, Jacoco Publisher: 5 ms, SpotBugs Publisher: 3 ms, Open Task Scanner Publisher: 12033 ms
[withMaven] openTasksPublisher - Scan Tasks for Maven artifact org.apache.maven.its.plugins:maven-it-plugin-active-collection:maven-plugin:2.1-SNAPSHOT in source directory core-it-support\core-it-plugins\maven-it-plugin-active-collection\src\main\java
[withMaven] openTasksPublisher - Scan Tasks for Maven artifact org.apache.maven.its.plugins:maven-it-plugin-artifact:maven-plugin:2.1-SNAPSHOT in source directory core-it-support\core-it-plugins\maven-it-plugin-artifact\src\main\java
[withMaven] openTasksPublisher - Scan Tasks for Maven artifact org.apache.maven.its.plugins.class-loader:dep-a:jar:2.1-SNAPSHOT in source directory core-it-support\core-it-plugins\maven-it-plugin-class-loader\dep-a\src\main\java
[withMaven] openTasksPublisher - Scan Tasks for Maven artifact org.apache.maven.its.plugins.class-loader:dep-b:jar:2.1-SNAPSHOT in source directory core-it-support\core-it-plugins\maven-it-plugin-class-loader\dep-b\src\main\java
[withMaven] openTasksPublisher - Scan Tasks for Maven artifact org.apache.maven.its.plugins:maven-it-plugin-class-loader:maven-plugin:2.1-SNAPSHOT in source directory core-it-support\core-it-plugins\maven-it-plugin-class-loader\maven-it-plugin-class-loader\src\main\java
[withMaven] openTasksPublisher - Scan Tasks for Maven artifact org.apache.maven.its.plugins:maven-it-plugin-configuration:maven-plugin:2.1-SNAPSHOT in source directory core-it-support\core-it-plugins\maven-it-plugin-configuration\src\main\java
[withMaven] openTasksPublisher - Scan Tasks for Maven artifact org.apache.maven.its.plugins:maven-it-plugin-context-passing:maven-plugin:2.1-SNAPSHOT in source directory core-it-support\core-it-plugins\maven-it-plugin-context-passing\src\main\java
[withMaven] openTasksPublisher - Scan Tasks for Maven artifact org.apache.maven.plugins:maven-clean-plugin:maven-plugin:0.1-stub-SNAPSHOT in source directory core-it-support\core-it-plugins\maven-it-plugin-core-stubs\maven-clean-plugin\src\main\java
[withMaven] openTasksPublisher - Scan Tasks for Maven artifact org.apache.maven.plugins:maven-compiler-plugin:maven-plugin:0.1-stub-SNAPSHOT in source directory core-it-support\core-it-plugins\maven-it-plugin-core-stubs\maven-compiler-plugin\src\main\java
[withMaven] openTasksPublisher - Scan Tasks for Maven artifact org.apache.maven.plugins:maven-deploy-plugin:maven-plugin:0.1-stub-SNAPSHOT in source directory core-it-support\core-it-plugins\maven-it-plugin-core-stubs\maven-deploy-plugin\src\main\java
[withMaven] openTasksPublisher - Scan Tasks for Maven artifact org.apache.maven.plugins:maven-ear-plugin:maven-plugin:0.1-stub-SNAPSHOT in source directory core-it-support\core-it-plugins\maven-it-plugin-core-stubs\maven-ear-plugin\src\main\java
[withMaven] openTasksPublisher - Scan Tasks for Maven artifact org.apache.maven.plugins:maven-ejb-plugin:maven-plugin:0.1-stub-SNAPSHOT in source directory core-it-support\core-it-plugins\maven-it-plugin-core-stubs\maven-ejb-plugin\src\main\java
[withMaven] openTasksPublisher - Scan Tasks for Maven artifact org.apache.maven.plugins:maven-install-plugin:maven-plugin:0.1-stub-SNAPSHOT in source directory core-it-support\core-it-plugins\maven-it-plugin-core-stubs\maven-install-plugin\src\main\java
[withMaven] openTasksPublisher - Scan Tasks for Maven artifact org.apache.maven.plugins:maven-jar-plugin:maven-plugin:0.1-stub-SNAPSHOT in source directory core-it-support\core-it-plugins\maven-it-plugin-core-stubs\maven-jar-plugin\src\main\java
[withMaven] openTasksPublisher - Scan Tasks for Maven artifact org.apache.maven.plugins:maven-javadoc-plugin:maven-plugin:0.1-stub-SNAPSHOT in source directory core-it-support\core-it-plugins\maven-it-plugin-core-stubs\maven-javadoc-plugin\src\main\java
[withMaven] openTasksPublisher - Scan Tasks for Maven artifact org.apache.maven.plugins:maven-plugin-plugin:maven-plugin:0.1-stub-SNAPSHOT in source directory core-it-support\core-it-plugins\maven-it-plugin-core-stubs\maven-plugin-plugin\src\main\java
[withMaven] openTasksPublisher - Scan Tasks for Maven artifact org.apache.maven.plugins:maven-rar-plugin:maven-plugin:0.1-stub-SNAPSHOT in source directory core-it-support\core-it-plugins\maven-it-plugin-core-stubs\maven-rar-plugin\src\main\java
[withMaven] openTasksPublisher - Scan Tasks for Maven artifact org.apache.maven.plugins:maven-resources-plugin:maven-plugin:0.1-stub-SNAPSHOT in source directory core-it-support\core-it-plugins\maven-it-plugin-core-stubs\maven-resources-plugin\src\main\java
[withMaven] openTasksPublisher - Scan Tasks for Maven artifact org.apache.maven.plugins:maven-site-plugin:maven-plugin:0.1-stub-SNAPSHOT in source directory core-it-support\core-it-plugins\maven-it-plugin-core-stubs\maven-site-plugin\src\main\java
[withMaven] openTasksPublisher - Scan Tasks for Maven artifact org.apache.maven.plugins:maven-source-plugin:maven-plugin:0.1-stub-SNAPSHOT in source directory core-it-support\core-it-plugins\maven-it-plugin-core-stubs\maven-source-plugin\src\main\java
[withMaven] openTasksPublisher - Scan Tasks for Maven artifact org.apache.maven.plugins:maven-surefire-plugin:maven-plugin:0.1-stub-SNAPSHOT in source directory core-it-support\core-it-plugins\maven-it-plugin-core-stubs\maven-surefire-plugin\src\main\java
[withMaven] openTasksPublisher - Scan Tasks for Maven artifact org.apache.maven.plugins:maven-war-plugin:maven-plugin:0.1-stub-SNAPSHOT in source directory core-it-support\core-it-plugins\maven-it-plugin-core-stubs\maven-war-plugin\src\main\java
[withMaven] openTasksPublisher - Scan Tasks for Maven artifact org.apache.maven.its.plugins:maven-it-plugin-dependency-collection:maven-plugin:2.1-SNAPSHOT in source directory core-it-support\core-it-plugins\maven-it-plugin-dependency-collection\src\main\java
[withMaven] openTasksPublisher - Scan Tasks for Maven artifact org.apache.maven.its.plugins:maven-it-plugin-dependency-resolution:maven-plugin:2.1-SNAPSHOT in source directory core-it-support\core-it-plugins\maven-it-plugin-dependency-resolution\src\main\java
[withMaven] openTasksPublisher - Scan Tasks for Maven artifact org.apache.maven.its.plugins:maven-it-plugin-expression:maven-plugin:2.1-SNAPSHOT in source directory core-it-support\core-it-plugins\maven-it-plugin-expression\src\main\java
[withMaven] openTasksPublisher - Scan Tasks for Maven artifact org.apache.maven.its.plugins:maven-it-plugin-error:maven-plugin:2.1-SNAPSHOT in source directory core-it-support\core-it-plugins\maven-it-plugin-error\src\main\java
[withMaven] openTasksPublisher - Scan Tasks for Maven artifact org.apache.maven.its:core-it-component:jar:2.1-SNAPSHOT in source directory core-it-support\core-it-component\src\main\java
[withMaven] openTasksPublisher - Scan Tasks for Maven artifact org.apache.maven.its.plugins:maven-it-plugin-extension-consumer:maven-plugin:2.1-SNAPSHOT in source directory core-it-support\core-it-plugins\maven-it-plugin-extension-consumer\src\main\java
[withMaven] openTasksPublisher - Scan Tasks for Maven artifact org.apache.maven.its.plugins:maven-it-plugin-extension-provider:maven-plugin:2.1-SNAPSHOT in source directory core-it-support\core-it-plugins\maven-it-plugin-extension-provider\src\main\java
[withMaven] openTasksPublisher - Scan Tasks for Maven artifact org.apache.maven.its.plugins:maven-it-plugin-fork:maven-plugin:2.1-SNAPSHOT in source directory core-it-support\core-it-plugins\maven-it-plugin-fork\src\main\java
[withMaven] openTasksPublisher - Scan Tasks for Maven artifact org.apache.maven.its.plugins:maven-it-plugin-invalid-descriptor:maven-plugin:2.1-SNAPSHOT in source directory core-it-support\core-it-plugins\maven-it-plugin-invalid-descriptor\src\main\java
[withMaven] openTasksPublisher - Scan Tasks for Maven artifact org.apache.maven.its.plugins:maven-it-plugin-log-file:maven-plugin:2.1-SNAPSHOT in source directory core-it-support\core-it-plugins\maven-it-plugin-log-file\src\main\java
[withMaven] openTasksPublisher - Scan Tasks for Maven artifact org.apache.maven.its:maven-it-helper:jar:2.1-SNAPSHOT in source directory core-it-support\maven-it-helper\src\main\java
[withMaven] openTasksPublisher - Scan Tasks for Maven artifact org.apache.maven.its.plugins:maven-it-plugin-model-interpolation:maven-plugin:2.1-SNAPSHOT in source directory core-it-support\core-it-plugins\maven-it-plugin-model-interpolation\src\main\java
[withMaven] openTasksPublisher - Scan Tasks for Maven artifact org.apache.maven.its.plugins:maven-it-plugin-no-default-comp:maven-plugin:2.1-SNAPSHOT in source directory core-it-support\core-it-plugins\maven-it-plugin-no-default-comp\src\main\java
[withMaven] openTasksPublisher - Scan Tasks for Maven artifact org.apache.maven.its.plugins:maven-it-plugin-no-project:maven-plugin:2.1-SNAPSHOT in source directory core-it-support\core-it-plugins\maven-it-plugin-no-project\src\main\java
[withMaven] openTasksPublisher - Scan Tasks for Maven artifact org.apache.maven.its.plugins:maven-it-plugin-online:maven-plugin:2.1-SNAPSHOT in source directory core-it-support\core-it-plugins\maven-it-plugin-online\src\main\java
[withMaven] openTasksPublisher - Scan Tasks for Maven artifact org.apache.maven.its.plugins:maven-it-plugin-optional-mojos:maven-plugin:2.1-SNAPSHOT in source directory core-it-support\core-it-plugins\maven-it-plugin-optional-mojos\src\main\java
[withMaven] openTasksPublisher - Scan Tasks for Maven artifact org.apache.maven.its.plugins:maven-it-plugin-packaging:maven-plugin:2.1-SNAPSHOT in source directory core-it-support\core-it-plugins\maven-it-plugin-packaging\src\main\java
[withMaven] openTasksPublisher - Scan Tasks for Maven artifact org.apache.maven.its.plugins:maven-it-plugin-parameter-implementation:maven-plugin:2.1-SNAPSHOT in source directory core-it-support\core-it-plugins\maven-it-plugin-parameter-implementation\src\main\java
[withMaven] openTasksPublisher - Scan Tasks for Maven artifact org.apache.maven.its.plugins:maven-it-plugin-plugin-dependency:maven-plugin:2.1-SNAPSHOT in source directory core-it-support\core-it-plugins\maven-it-plugin-plugin-dependency\src\main\java
[withMaven] openTasksPublisher - Scan Tasks for Maven artifact org.apache.maven.its.plugins:maven-it-plugin-project:maven-plugin:2.1-SNAPSHOT in source directory core-it-support\core-it-plugins\maven-it-plugin-project\src\main\java
[withMaven] openTasksPublisher - Scan Tasks for Maven artifact org.apache.maven.its.plugins:maven-it-plugin-project-interpolation:maven-plugin:2.1-SNAPSHOT in source directory core-it-support\core-it-plugins\maven-it-plugin-project-interpolation\src\main\java
[withMaven] openTasksPublisher - Scan Tasks for Maven artifact org.apache.maven.its.plugins:maven-it-plugin-setter:maven-plugin:2.1-SNAPSHOT in source directory core-it-support\core-it-plugins\maven-it-plugin-setter\src\main\java
[withMaven] openTasksPublisher - Scan Tasks for Maven artifact org.apache.maven.its.plugins:maven-it-plugin-singleton-component:maven-plugin:2.1-SNAPSHOT in source directory core-it-support\core-it-plugins\maven-it-plugin-singleton-component\src\main\java
[withMaven] openTasksPublisher - Scan Tasks for Maven artifact org.apache.maven.its.plugins:maven-it-plugin-site:maven-plugin:2.1-SNAPSHOT in source directory core-it-support\core-it-plugins\maven-it-plugin-site\src\main\java
[withMaven] openTasksPublisher - Scan Tasks for Maven artifact org.apache.maven.its.plugins:maven-it-plugin-toolchain:maven-plugin:2.1-SNAPSHOT in source directory core-it-support\core-it-plugins\maven-it-plugin-toolchain\src\main\java
[withMaven] openTasksPublisher - Scan Tasks for Maven artifact org.apache.maven.its.plugins:maven-it-plugin-touch:maven-plugin:2.1-SNAPSHOT in source directory core-it-support\core-it-plugins\maven-it-plugin-touch\src\main\java
[withMaven] openTasksPublisher - Scan Tasks for Maven artifact org.apache.maven.its.plugins:maven-it-plugin-uses-properties:maven-plugin:2.1-SNAPSHOT in source directory core-it-support\core-it-plugins\maven-it-plugin-uses-properties\src\main\java
[withMaven] openTasksPublisher - Scan Tasks for Maven artifact org.apache.maven.its.plugins:maven-it-plugin-uses-wagon:maven-plugin:2.1-SNAPSHOT in source directory core-it-support\core-it-plugins\maven-it-plugin-uses-wagon\src\main\java
[withMaven] openTasksPublisher - Scan Tasks for Maven artifact org.apache.maven.its.plugins:maven-it-plugin-all:maven-plugin:2.1-SNAPSHOT in source directory core-it-support\core-it-plugins\maven-it-plugin-all\src\main\java
[withMaven] openTasksPublisher - Scan Tasks for Maven artifact org.apache.maven.its.plugins:maven-it-plugin-plexus-utils-11:maven-plugin:2.1-SNAPSHOT in source directory core-it-support\core-it-plugins\maven-it-plugin-plexus-utils-11\src\main\java
[withMaven] openTasksPublisher - Scan Tasks for Maven artifact org.apache.maven.its.plugins:maven-it-plugin-plexus-utils-new:maven-plugin:2.1-SNAPSHOT in source directory core-it-support\core-it-plugins\maven-it-plugin-plexus-utils-new\src\main\java
[withMaven] openTasksPublisher - Scan Tasks for Maven artifact org.apache.maven.its.plugins:maven-it-plugin-plexus-component-api:maven-plugin:2.1-SNAPSHOT in source directory core-it-support\core-it-plugins\maven-it-plugin-plexus-component-api\src\main\java
[withMaven] openTasksPublisher - Scan Tasks for Maven artifact org.apache.maven.its.plugins:maven-it-plugin-log4j:maven-plugin:2.1-SNAPSHOT in source directory core-it-support\core-it-plugins\maven-it-plugin-log4j\src\main\java
[withMaven] openTasksPublisher - Scan Tasks for Maven artifact org.apache.maven.its.plugins:maven-it-plugin-extension1:maven-plugin:2.1-SNAPSHOT in source directory core-it-support\core-it-plugins\maven-it-plugin-extension1\src\main\java
[withMaven] openTasksPublisher - Scan Tasks for Maven artifact org.apache.maven.its.plugins:maven-it-plugin-extension2:maven-plugin:2.1-SNAPSHOT in source directory core-it-support\core-it-plugins\maven-it-plugin-extension2\src\main\java
[withMaven] openTasksPublisher - Scan Tasks for Maven artifact org.apache.maven.its.plugins:maven-it-plugin-plexus-lifecycle:maven-plugin:2.1-SNAPSHOT in source directory core-it-support\core-it-plugins\maven-it-plugin-plexus-lifecycle\src\main\java
[withMaven] openTasksPublisher - Scan Tasks for Maven artifact org.apache.maven.its.plugins:maven-it-plugin-settings:maven-plugin:2.1-SNAPSHOT in source directory core-it-support\core-it-plugins\maven-it-plugin-settings\src\main\java
[withMaven] openTasksPublisher - Scan Tasks for Maven artifact org.apache.maven.its.plugins:mng-5805-pkg-type-mojo-configuration-plugin:maven-plugin:2.1-SNAPSHOT in source directory core-it-support\core-it-plugins\mng5805-plugin\src\main\java
[withMaven] openTasksPublisher - Scan Tasks for Maven artifact org.apache.maven.its.plugins:mng-5805-pkg-type-mojo-configuration-plugin-dep:jar:2.1-SNAPSHOT in source directory core-it-support\core-it-plugins\mng5805-plugin-dep\src\main\java
[withMaven] openTasksPublisher - Scan Tasks for Maven artifact org.apache.maven.its.plugins:mng-5958-pkg-type-extension:jar:2.1-SNAPSHOT in source directory core-it-support\core-it-plugins\mng5958-extension\src\main\java
[withMaven] openTasksPublisher - Scan Tasks for Maven artifact org.apache.maven.its:core-it-toolchain:jar:2.1-SNAPSHOT in source directory core-it-support\core-it-toolchain\src\main\java
[withMaven] openTasksPublisher - Scan Tasks for Maven artifact org.apache.maven.its:core-it-wagon:jar:2.1-SNAPSHOT in source directory core-it-support\core-it-wagon\src\main\java
[TASKS] Scanning folder 'c:\mvn-it-2.tmp' for files matching the pattern 'core-it-support\core-it-plugins\maven-it-plugin-active-collection\src\main\java\**\*,core-it-support\core-it-plugins\maven-it-plugin-artifact\src\main\java\**\*,core-it-support\core-it-plugins\maven-it-plugin-class-loader\dep-a\src\main\java\**\*,core-it-support\core-it-plugins\maven-it-plugin-class-loader\dep-b\src\main\java\**\*,core-it-support\core-it-plugins\maven-it-plugin-class-loader\maven-it-plugin-class-loader\src\main\java\**\*,core-it-support\core-it-plugins\maven-it-plugin-configuration\src\main\java\**\*,core-it-support\core-it-plugins\maven-it-plugin-context-passing\src\main\java\**\*,core-it-support\core-it-plugins\maven-it-plugin-core-stubs\maven-clean-plugin\src\main\java\**\*,core-it-support\core-it-plugins\maven-it-plugin-core-stubs\maven-compiler-plugin\src\main\java\**\*,core-it-support\core-it-plugins\maven-it-plugin-core-stubs\maven-deploy-plugin\src\main\java\**\*,core-it-support\core-it-plugins\maven-it-plugin-core-stubs\maven-ear-plugin\src\main\java\**\*,core-it-support\core-it-plugins\maven-it-plugin-core-stubs\maven-ejb-plugin\src\main\java\**\*,core-it-support\core-it-plugins\maven-it-plugin-core-stubs\maven-install-plugin\src\main\java\**\*,core-it-support\core-it-plugins\maven-it-plugin-core-stubs\maven-jar-plugin\src\main\java\**\*,core-it-support\core-it-plugins\maven-it-plugin-core-stubs\maven-javadoc-plugin\src\main\java\**\*,core-it-support\core-it-plugins\maven-it-plugin-core-stubs\maven-plugin-plugin\src\main\java\**\*,core-it-support\core-it-plugins\maven-it-plugin-core-stubs\maven-rar-plugin\src\main\java\**\*,core-it-support\core-it-plugins\maven-it-plugin-core-stubs\maven-resources-plugin\src\main\java\**\*,core-it-support\core-it-plugins\maven-it-plugin-core-stubs\maven-site-plugin\src\main\java\**\*,core-it-support\core-it-plugins\maven-it-plugin-core-stubs\maven-source-plugin\src\main\java\**\*,core-it-support\core-it-plugins\maven-it-plugin-core-stubs\maven-surefire-plugin\src\main\java\**\*,core-it-support\core-it-plugins\maven-it-plugin-core-stubs\maven-war-plugin\src\main\java\**\*,core-it-support\core-it-plugins\maven-it-plugin-dependency-collection\src\main\java\**\*,core-it-support\core-it-plugins\maven-it-plugin-dependency-resolution\src\main\java\**\*,core-it-support\core-it-plugins\maven-it-plugin-expression\src\main\java\**\*,core-it-support\core-it-plugins\maven-it-plugin-error\src\main\java\**\*,core-it-support\core-it-component\src\main\java\**\*,core-it-support\core-it-plugins\maven-it-plugin-extension-consumer\src\main\java\**\*,core-it-support\core-it-plugins\maven-it-plugin-extension-provider\src\main\java\**\*,core-it-support\core-it-plugins\maven-it-plugin-fork\src\main\java\**\*,core-it-support\core-it-plugins\maven-it-plugin-invalid-descriptor\src\main\java\**\*,core-it-support\core-it-plugins\maven-it-plugin-log-file\src\main\java\**\*,core-it-support\maven-it-helper\src\main\java\**\*,core-it-support\core-it-plugins\maven-it-plugin-model-interpolation\src\main\java\**\*,core-it-support\core-it-plugins\maven-it-plugin-no-default-comp\src\main\java\**\*,core-it-support\core-it-plugins\maven-it-plugin-no-project\src\main\java\**\*,core-it-support\core-it-plugins\maven-it-plugin-online\src\main\java\**\*,core-it-support\core-it-plugins\maven-it-plugin-optional-mojos\src\main\java\**\*,core-it-support\core-it-plugins\maven-it-plugin-packaging\src\main\java\**\*,core-it-support\core-it-plugins\maven-it-plugin-parameter-implementation\src\main\java\**\*,core-it-support\core-it-plugins\maven-it-plugin-plugin-dependency\src\main\java\**\*,core-it-support\core-it-plugins\maven-it-plugin-project\src\main\java\**\*,core-it-support\core-it-plugins\maven-it-plugin-project-interpolation\src\main\java\**\*,core-it-support\core-it-plugins\maven-it-plugin-setter\src\main\java\**\*,core-it-support\core-it-plugins\maven-it-plugin-singleton-component\src\main\java\**\*,core-it-support\core-it-plugins\maven-it-plugin-site\src\main\java\**\*,core-it-support\core-it-plugins\maven-it-plugin-toolchain\src\main\java\**\*,core-it-support\core-it-plugins\maven-it-plugin-touch\src\main\java\**\*,core-it-support\core-it-plugins\maven-it-plugin-uses-properties\src\main\java\**\*,core-it-support\core-it-plugins\maven-it-plugin-uses-wagon\src\main\java\**\*,core-it-support\core-it-plugins\maven-it-plugin-all\src\main\java\**\*,core-it-support\core-it-plugins\maven-it-plugin-plexus-utils-11\src\main\java\**\*,core-it-support\core-it-plugins\maven-it-plugin-plexus-utils-new\src\main\java\**\*,core-it-support\core-it-plugins\maven-it-plugin-plexus-component-api\src\main\java\**\*,core-it-support\core-it-plugins\maven-it-plugin-log4j\src\main\java\**\*,core-it-support\core-it-plugins\maven-it-plugin-extension1\src\main\java\**\*,core-it-support\core-it-plugins\maven-it-plugin-extension2\src\main\java\**\*,core-it-support\core-it-plugins\maven-it-plugin-plexus-lifecycle\src\main\java\**\*,core-it-support\core-it-plugins\maven-it-plugin-settings\src\main\java\**\*,core-it-support\core-it-plugins\mng5805-plugin\src\main\java\**\*,core-it-support\core-it-plugins\mng5805-plugin-dep\src\main\java\**\*,core-it-support\core-it-plugins\mng5958-extension\src\main\java\**\*,core-it-support\core-it-toolchain\src\main\java\**\*,core-it-support\core-it-wagon\src\main\java\**\*' - excludes: null
[TASKS] Found 164 files to scan for tasks
[TASKS] Found 0 open tasks.
Skipping warnings blame since pipelines do not have an SCM link.%n
[withMaven] Publishers: Pipeline Graph Publisher: 22 ms, Generated Artifacts Publisher: 4493 ms, Invoker Publisher: 10 ms, Junit Publisher: 18992 ms, Concordion Publisher: 10 ms, Dependencies Fingerprint Publisher: 106 ms, Findbugs Publisher: 3 ms, JGiven Publisher: 2 ms, Jacoco Publisher: 3 ms, SpotBugs Publisher: 3 ms, Open Task Scanner Publisher: 657 ms
[Pipeline] deleteDir
[Pipeline] // withMaven
[Pipeline] // withMaven
[Pipeline] deleteDir
[Pipeline] deleteDir
[withMaven] openTasksPublisher - Scan Tasks for Maven artifact org.apache.maven.its.plugins:maven-it-plugin-active-collection:maven-plugin:2.1-SNAPSHOT in source directory core-it-support\core-it-plugins\maven-it-plugin-active-collection\src\main\java
[withMaven] openTasksPublisher - Scan Tasks for Maven artifact org.apache.maven.its.plugins:maven-it-plugin-artifact:maven-plugin:2.1-SNAPSHOT in source directory core-it-support\core-it-plugins\maven-it-plugin-artifact\src\main\java
[withMaven] openTasksPublisher - Scan Tasks for Maven artifact org.apache.maven.its.plugins.class-loader:dep-a:jar:2.1-SNAPSHOT in source directory core-it-support\core-it-plugins\maven-it-plugin-class-loader\dep-a\src\main\java
[withMaven] openTasksPublisher - Scan Tasks for Maven artifact org.apache.maven.its.plugins.class-loader:dep-b:jar:2.1-SNAPSHOT in source directory core-it-support\core-it-plugins\maven-it-plugin-class-loader\dep-b\src\main\java
[withMaven] openTasksPublisher - Scan Tasks for Maven artifact org.apache.maven.its.plugins:maven-it-plugin-class-loader:maven-plugin:2.1-SNAPSHOT in source directory core-it-support\core-it-plugins\maven-it-plugin-class-loader\maven-it-plugin-class-loader\src\main\java
[withMaven] openTasksPublisher - Scan Tasks for Maven artifact org.apache.maven.its.plugins:maven-it-plugin-configuration:maven-plugin:2.1-SNAPSHOT in source directory core-it-support\core-it-plugins\maven-it-plugin-configuration\src\main\java
[withMaven] openTasksPublisher - Scan Tasks for Maven artifact org.apache.maven.its.plugins:maven-it-plugin-context-passing:maven-plugin:2.1-SNAPSHOT in source directory core-it-support\core-it-plugins\maven-it-plugin-context-passing\src\main\java
[withMaven] openTasksPublisher - Scan Tasks for Maven artifact org.apache.maven.plugins:maven-clean-plugin:maven-plugin:0.1-stub-SNAPSHOT in source directory core-it-support\core-it-plugins\maven-it-plugin-core-stubs\maven-clean-plugin\src\main\java
[withMaven] openTasksPublisher - Scan Tasks for Maven artifact org.apache.maven.plugins:maven-compiler-plugin:maven-plugin:0.1-stub-SNAPSHOT in source directory core-it-support\core-it-plugins\maven-it-plugin-core-stubs\maven-compiler-plugin\src\main\java
[withMaven] openTasksPublisher - Scan Tasks for Maven artifact org.apache.maven.plugins:maven-deploy-plugin:maven-plugin:0.1-stub-SNAPSHOT in source directory core-it-support\core-it-plugins\maven-it-plugin-core-stubs\maven-deploy-plugin\src\main\java
[withMaven] openTasksPublisher - Scan Tasks for Maven artifact org.apache.maven.plugins:maven-ear-plugin:maven-plugin:0.1-stub-SNAPSHOT in source directory core-it-support\core-it-plugins\maven-it-plugin-core-stubs\maven-ear-plugin\src\main\java
[withMaven] openTasksPublisher - Scan Tasks for Maven artifact org.apache.maven.plugins:maven-ejb-plugin:maven-plugin:0.1-stub-SNAPSHOT in source directory core-it-support\core-it-plugins\maven-it-plugin-core-stubs\maven-ejb-plugin\src\main\java
[withMaven] openTasksPublisher - Scan Tasks for Maven artifact org.apache.maven.plugins:maven-install-plugin:maven-plugin:0.1-stub-SNAPSHOT in source directory core-it-support\core-it-plugins\maven-it-plugin-core-stubs\maven-install-plugin\src\main\java
[withMaven] openTasksPublisher - Scan Tasks for Maven artifact org.apache.maven.plugins:maven-jar-plugin:maven-plugin:0.1-stub-SNAPSHOT in source directory core-it-support\core-it-plugins\maven-it-plugin-core-stubs\maven-jar-plugin\src\main\java
[withMaven] openTasksPublisher - Scan Tasks for Maven artifact org.apache.maven.plugins:maven-javadoc-plugin:maven-plugin:0.1-stub-SNAPSHOT in source directory core-it-support\core-it-plugins\maven-it-plugin-core-stubs\maven-javadoc-plugin\src\main\java
[withMaven] openTasksPublisher - Scan Tasks for Maven artifact org.apache.maven.plugins:maven-plugin-plugin:maven-plugin:0.1-stub-SNAPSHOT in source directory core-it-support\core-it-plugins\maven-it-plugin-core-stubs\maven-plugin-plugin\src\main\java
[withMaven] openTasksPublisher - Scan Tasks for Maven artifact org.apache.maven.plugins:maven-rar-plugin:maven-plugin:0.1-stub-SNAPSHOT in source directory core-it-support\core-it-plugins\maven-it-plugin-core-stubs\maven-rar-plugin\src\main\java
[withMaven] openTasksPublisher - Scan Tasks for Maven artifact org.apache.maven.plugins:maven-resources-plugin:maven-plugin:0.1-stub-SNAPSHOT in source directory core-it-support\core-it-plugins\maven-it-plugin-core-stubs\maven-resources-plugin\src\main\java
[withMaven] openTasksPublisher - Scan Tasks for Maven artifact org.apache.maven.plugins:maven-site-plugin:maven-plugin:0.1-stub-SNAPSHOT in source directory core-it-support\core-it-plugins\maven-it-plugin-core-stubs\maven-site-plugin\src\main\java
[withMaven] openTasksPublisher - Scan Tasks for Maven artifact org.apache.maven.plugins:maven-source-plugin:maven-plugin:0.1-stub-SNAPSHOT in source directory core-it-support\core-it-plugins\maven-it-plugin-core-stubs\maven-source-plugin\src\main\java
[withMaven] openTasksPublisher - Scan Tasks for Maven artifact org.apache.maven.plugins:maven-surefire-plugin:maven-plugin:0.1-stub-SNAPSHOT in source directory core-it-support\core-it-plugins\maven-it-plugin-core-stubs\maven-surefire-plugin\src\main\java
[withMaven] openTasksPublisher - Scan Tasks for Maven artifact org.apache.maven.plugins:maven-war-plugin:maven-plugin:0.1-stub-SNAPSHOT in source directory core-it-support\core-it-plugins\maven-it-plugin-core-stubs\maven-war-plugin\src\main\java
[withMaven] openTasksPublisher - Scan Tasks for Maven artifact org.apache.maven.its.plugins:maven-it-plugin-dependency-collection:maven-plugin:2.1-SNAPSHOT in source directory core-it-support\core-it-plugins\maven-it-plugin-dependency-collection\src\main\java
[withMaven] openTasksPublisher - Scan Tasks for Maven artifact org.apache.maven.its.plugins:maven-it-plugin-dependency-resolution:maven-plugin:2.1-SNAPSHOT in source directory core-it-support\core-it-plugins\maven-it-plugin-dependency-resolution\src\main\java
[withMaven] openTasksPublisher - Scan Tasks for Maven artifact org.apache.maven.its.plugins:maven-it-plugin-expression:maven-plugin:2.1-SNAPSHOT in source directory core-it-support\core-it-plugins\maven-it-plugin-expression\src\main\java
[withMaven] openTasksPublisher - Scan Tasks for Maven artifact org.apache.maven.its.plugins:maven-it-plugin-error:maven-plugin:2.1-SNAPSHOT in source directory core-it-support\core-it-plugins\maven-it-plugin-error\src\main\java
[withMaven] openTasksPublisher - Scan Tasks for Maven artifact org.apache.maven.its:core-it-component:jar:2.1-SNAPSHOT in source directory core-it-support\core-it-component\src\main\java
[withMaven] openTasksPublisher - Scan Tasks for Maven artifact org.apache.maven.its.plugins:maven-it-plugin-extension-consumer:maven-plugin:2.1-SNAPSHOT in source directory core-it-support\core-it-plugins\maven-it-plugin-extension-consumer\src\main\java
[withMaven] openTasksPublisher - Scan Tasks for Maven artifact org.apache.maven.its.plugins:maven-it-plugin-extension-provider:maven-plugin:2.1-SNAPSHOT in source directory core-it-support\core-it-plugins\maven-it-plugin-extension-provider\src\main\java
[withMaven] openTasksPublisher - Scan Tasks for Maven artifact org.apache.maven.its.plugins:maven-it-plugin-fork:maven-plugin:2.1-SNAPSHOT in source directory core-it-support\core-it-plugins\maven-it-plugin-fork\src\main\java
[withMaven] openTasksPublisher - Scan Tasks for Maven artifact org.apache.maven.its.plugins:maven-it-plugin-invalid-descriptor:maven-plugin:2.1-SNAPSHOT in source directory core-it-support\core-it-plugins\maven-it-plugin-invalid-descriptor\src\main\java
[withMaven] openTasksPublisher - Scan Tasks for Maven artifact org.apache.maven.its.plugins:maven-it-plugin-log-file:maven-plugin:2.1-SNAPSHOT in source directory core-it-support\core-it-plugins\maven-it-plugin-log-file\src\main\java
[withMaven] openTasksPublisher - Scan Tasks for Maven artifact org.apache.maven.its:maven-it-helper:jar:2.1-SNAPSHOT in source directory core-it-support\maven-it-helper\src\main\java
[withMaven] openTasksPublisher - Scan Tasks for Maven artifact org.apache.maven.its.plugins:maven-it-plugin-model-interpolation:maven-plugin:2.1-SNAPSHOT in source directory core-it-support\core-it-plugins\maven-it-plugin-model-interpolation\src\main\java
[withMaven] openTasksPublisher - Scan Tasks for Maven artifact org.apache.maven.its.plugins:maven-it-plugin-no-default-comp:maven-plugin:2.1-SNAPSHOT in source directory core-it-support\core-it-plugins\maven-it-plugin-no-default-comp\src\main\java
[withMaven] openTasksPublisher - Scan Tasks for Maven artifact org.apache.maven.its.plugins:maven-it-plugin-no-project:maven-plugin:2.1-SNAPSHOT in source directory core-it-support\core-it-plugins\maven-it-plugin-no-project\src\main\java
[withMaven] openTasksPublisher - Scan Tasks for Maven artifact org.apache.maven.its.plugins:maven-it-plugin-online:maven-plugin:2.1-SNAPSHOT in source directory core-it-support\core-it-plugins\maven-it-plugin-online\src\main\java
[withMaven] openTasksPublisher - Scan Tasks for Maven artifact org.apache.maven.its.plugins:maven-it-plugin-optional-mojos:maven-plugin:2.1-SNAPSHOT in source directory core-it-support\core-it-plugins\maven-it-plugin-optional-mojos\src\main\java
[withMaven] openTasksPublisher - Scan Tasks for Maven artifact org.apache.maven.its.plugins:maven-it-plugin-packaging:maven-plugin:2.1-SNAPSHOT in source directory core-it-support\core-it-plugins\maven-it-plugin-packaging\src\main\java
[withMaven] openTasksPublisher - Scan Tasks for Maven artifact org.apache.maven.its.plugins:maven-it-plugin-parameter-implementation:maven-plugin:2.1-SNAPSHOT in source directory core-it-support\core-it-plugins\maven-it-plugin-parameter-implementation\src\main\java
[withMaven] openTasksPublisher - Scan Tasks for Maven artifact org.apache.maven.its.plugins:maven-it-plugin-plugin-dependency:maven-plugin:2.1-SNAPSHOT in source directory core-it-support\core-it-plugins\maven-it-plugin-plugin-dependency\src\main\java
[withMaven] openTasksPublisher - Scan Tasks for Maven artifact org.apache.maven.its.plugins:maven-it-plugin-project:maven-plugin:2.1-SNAPSHOT in source directory core-it-support\core-it-plugins\maven-it-plugin-project\src\main\java
[withMaven] openTasksPublisher - Scan Tasks for Maven artifact org.apache.maven.its.plugins:maven-it-plugin-project-interpolation:maven-plugin:2.1-SNAPSHOT in source directory core-it-support\core-it-plugins\maven-it-plugin-project-interpolation\src\main\java
[withMaven] openTasksPublisher - Scan Tasks for Maven artifact org.apache.maven.its.plugins:maven-it-plugin-setter:maven-plugin:2.1-SNAPSHOT in source directory core-it-support\core-it-plugins\maven-it-plugin-setter\src\main\java
[withMaven] openTasksPublisher - Scan Tasks for Maven artifact org.apache.maven.its.plugins:maven-it-plugin-singleton-component:maven-plugin:2.1-SNAPSHOT in source directory core-it-support\core-it-plugins\maven-it-plugin-singleton-component\src\main\java
[withMaven] openTasksPublisher - Scan Tasks for Maven artifact org.apache.maven.its.plugins:maven-it-plugin-site:maven-plugin:2.1-SNAPSHOT in source directory core-it-support\core-it-plugins\maven-it-plugin-site\src\main\java
[withMaven] openTasksPublisher - Scan Tasks for Maven artifact org.apache.maven.its.plugins:maven-it-plugin-toolchain:maven-plugin:2.1-SNAPSHOT in source directory core-it-support\core-it-plugins\maven-it-plugin-toolchain\src\main\java
[withMaven] openTasksPublisher - Scan Tasks for Maven artifact org.apache.maven.its.plugins:maven-it-plugin-touch:maven-plugin:2.1-SNAPSHOT in source directory core-it-support\core-it-plugins\maven-it-plugin-touch\src\main\java
[withMaven] openTasksPublisher - Scan Tasks for Maven artifact org.apache.maven.its.plugins:maven-it-plugin-uses-properties:maven-plugin:2.1-SNAPSHOT in source directory core-it-support\core-it-plugins\maven-it-plugin-uses-properties\src\main\java
[withMaven] openTasksPublisher - Scan Tasks for Maven artifact org.apache.maven.its.plugins:maven-it-plugin-uses-wagon:maven-plugin:2.1-SNAPSHOT in source directory core-it-support\core-it-plugins\maven-it-plugin-uses-wagon\src\main\java
[withMaven] openTasksPublisher - Scan Tasks for Maven artifact org.apache.maven.its.plugins:maven-it-plugin-all:maven-plugin:2.1-SNAPSHOT in source directory core-it-support\core-it-plugins\maven-it-plugin-all\src\main\java
[withMaven] openTasksPublisher - Scan Tasks for Maven artifact org.apache.maven.its.plugins:maven-it-plugin-plexus-utils-11:maven-plugin:2.1-SNAPSHOT in source directory core-it-support\core-it-plugins\maven-it-plugin-plexus-utils-11\src\main\java
[withMaven] openTasksPublisher - Scan Tasks for Maven artifact org.apache.maven.its.plugins:maven-it-plugin-plexus-utils-new:maven-plugin:2.1-SNAPSHOT in source directory core-it-support\core-it-plugins\maven-it-plugin-plexus-utils-new\src\main\java
[withMaven] openTasksPublisher - Scan Tasks for Maven artifact org.apache.maven.its.plugins:maven-it-plugin-plexus-component-api:maven-plugin:2.1-SNAPSHOT in source directory core-it-support\core-it-plugins\maven-it-plugin-plexus-component-api\src\main\java
[withMaven] openTasksPublisher - Scan Tasks for Maven artifact org.apache.maven.its.plugins:maven-it-plugin-log4j:maven-plugin:2.1-SNAPSHOT in source directory core-it-support\core-it-plugins\maven-it-plugin-log4j\src\main\java
[withMaven] openTasksPublisher - Scan Tasks for Maven artifact org.apache.maven.its.plugins:maven-it-plugin-extension1:maven-plugin:2.1-SNAPSHOT in source directory core-it-support\core-it-plugins\maven-it-plugin-extension1\src\main\java
[withMaven] openTasksPublisher - Scan Tasks for Maven artifact org.apache.maven.its.plugins:maven-it-plugin-extension2:maven-plugin:2.1-SNAPSHOT in source directory core-it-support\core-it-plugins\maven-it-plugin-extension2\src\main\java
[withMaven] openTasksPublisher - Scan Tasks for Maven artifact org.apache.maven.its.plugins:maven-it-plugin-plexus-lifecycle:maven-plugin:2.1-SNAPSHOT in source directory core-it-support\core-it-plugins\maven-it-plugin-plexus-lifecycle\src\main\java
[withMaven] openTasksPublisher - Scan Tasks for Maven artifact org.apache.maven.its.plugins:maven-it-plugin-settings:maven-plugin:2.1-SNAPSHOT in source directory core-it-support\core-it-plugins\maven-it-plugin-settings\src\main\java
[withMaven] openTasksPublisher - Scan Tasks for Maven artifact org.apache.maven.its.plugins:mng-5805-pkg-type-mojo-configuration-plugin:maven-plugin:2.1-SNAPSHOT in source directory core-it-support\core-it-plugins\mng5805-plugin\src\main\java
[withMaven] openTasksPublisher - Scan Tasks for Maven artifact org.apache.maven.its.plugins:mng-5805-pkg-type-mojo-configuration-plugin-dep:jar:2.1-SNAPSHOT in source directory core-it-support\core-it-plugins\mng5805-plugin-dep\src\main\java
[withMaven] openTasksPublisher - Scan Tasks for Maven artifact org.apache.maven.its.plugins:mng-5958-pkg-type-extension:jar:2.1-SNAPSHOT in source directory core-it-support\core-it-plugins\mng5958-extension\src\main\java
[withMaven] openTasksPublisher - Scan Tasks for Maven artifact org.apache.maven.its:core-it-toolchain:jar:2.1-SNAPSHOT in source directory core-it-support\core-it-toolchain\src\main\java
[withMaven] openTasksPublisher - Scan Tasks for Maven artifact org.apache.maven.its:core-it-wagon:jar:2.1-SNAPSHOT in source directory core-it-support\core-it-wagon\src\main\java
[TASKS] Scanning folder 'c:\mvn-it-0.tmp' for files matching the pattern 'core-it-support\core-it-plugins\maven-it-plugin-active-collection\src\main\java\**\*,core-it-support\core-it-plugins\maven-it-plugin-artifact\src\main\java\**\*,core-it-support\core-it-plugins\maven-it-plugin-class-loader\dep-a\src\main\java\**\*,core-it-support\core-it-plugins\maven-it-plugin-class-loader\dep-b\src\main\java\**\*,core-it-support\core-it-plugins\maven-it-plugin-class-loader\maven-it-plugin-class-loader\src\main\java\**\*,core-it-support\core-it-plugins\maven-it-plugin-configuration\src\main\java\**\*,core-it-support\core-it-plugins\maven-it-plugin-context-passing\src\main\java\**\*,core-it-support\core-it-plugins\maven-it-plugin-core-stubs\maven-clean-plugin\src\main\java\**\*,core-it-support\core-it-plugins\maven-it-plugin-core-stubs\maven-compiler-plugin\src\main\java\**\*,core-it-support\core-it-plugins\maven-it-plugin-core-stubs\maven-deploy-plugin\src\main\java\**\*,core-it-support\core-it-plugins\maven-it-plugin-core-stubs\maven-ear-plugin\src\main\java\**\*,core-it-support\core-it-plugins\maven-it-plugin-core-stubs\maven-ejb-plugin\src\main\java\**\*,core-it-support\core-it-plugins\maven-it-plugin-core-stubs\maven-install-plugin\src\main\java\**\*,core-it-support\core-it-plugins\maven-it-plugin-core-stubs\maven-jar-plugin\src\main\java\**\*,core-it-support\core-it-plugins\maven-it-plugin-core-stubs\maven-javadoc-plugin\src\main\java\**\*,core-it-support\core-it-plugins\maven-it-plugin-core-stubs\maven-plugin-plugin\src\main\java\**\*,core-it-support\core-it-plugins\maven-it-plugin-core-stubs\maven-rar-plugin\src\main\java\**\*,core-it-support\core-it-plugins\maven-it-plugin-core-stubs\maven-resources-plugin\src\main\java\**\*,core-it-support\core-it-plugins\maven-it-plugin-core-stubs\maven-site-plugin\src\main\java\**\*,core-it-support\core-it-plugins\maven-it-plugin-core-stubs\maven-source-plugin\src\main\java\**\*,core-it-support\core-it-plugins\maven-it-plugin-core-stubs\maven-surefire-plugin\src\main\java\**\*,core-it-support\core-it-plugins\maven-it-plugin-core-stubs\maven-war-plugin\src\main\java\**\*,core-it-support\core-it-plugins\maven-it-plugin-dependency-collection\src\main\java\**\*,core-it-support\core-it-plugins\maven-it-plugin-dependency-resolution\src\main\java\**\*,core-it-support\core-it-plugins\maven-it-plugin-expression\src\main\java\**\*,core-it-support\core-it-plugins\maven-it-plugin-error\src\main\java\**\*,core-it-support\core-it-component\src\main\java\**\*,core-it-support\core-it-plugins\maven-it-plugin-extension-consumer\src\main\java\**\*,core-it-support\core-it-plugins\maven-it-plugin-extension-provider\src\main\java\**\*,core-it-support\core-it-plugins\maven-it-plugin-fork\src\main\java\**\*,core-it-support\core-it-plugins\maven-it-plugin-invalid-descriptor\src\main\java\**\*,core-it-support\core-it-plugins\maven-it-plugin-log-file\src\main\java\**\*,core-it-support\maven-it-helper\src\main\java\**\*,core-it-support\core-it-plugins\maven-it-plugin-model-interpolation\src\main\java\**\*,core-it-support\core-it-plugins\maven-it-plugin-no-default-comp\src\main\java\**\*,core-it-support\core-it-plugins\maven-it-plugin-no-project\src\main\java\**\*,core-it-support\core-it-plugins\maven-it-plugin-online\src\main\java\**\*,core-it-support\core-it-plugins\maven-it-plugin-optional-mojos\src\main\java\**\*,core-it-support\core-it-plugins\maven-it-plugin-packaging\src\main\java\**\*,core-it-support\core-it-plugins\maven-it-plugin-parameter-implementation\src\main\java\**\*,core-it-support\core-it-plugins\maven-it-plugin-plugin-dependency\src\main\java\**\*,core-it-support\core-it-plugins\maven-it-plugin-project\src\main\java\**\*,core-it-support\core-it-plugins\maven-it-plugin-project-interpolation\src\main\java\**\*,core-it-support\core-it-plugins\maven-it-plugin-setter\src\main\java\**\*,core-it-support\core-it-plugins\maven-it-plugin-singleton-component\src\main\java\**\*,core-it-support\core-it-plugins\maven-it-plugin-site\src\main\java\**\*,core-it-support\core-it-plugins\maven-it-plugin-toolchain\src\main\java\**\*,core-it-support\core-it-plugins\maven-it-plugin-touch\src\main\java\**\*,core-it-support\core-it-plugins\maven-it-plugin-uses-properties\src\main\java\**\*,core-it-support\core-it-plugins\maven-it-plugin-uses-wagon\src\main\java\**\*,core-it-support\core-it-plugins\maven-it-plugin-all\src\main\java\**\*,core-it-support\core-it-plugins\maven-it-plugin-plexus-utils-11\src\main\java\**\*,core-it-support\core-it-plugins\maven-it-plugin-plexus-utils-new\src\main\java\**\*,core-it-support\core-it-plugins\maven-it-plugin-plexus-component-api\src\main\java\**\*,core-it-support\core-it-plugins\maven-it-plugin-log4j\src\main\java\**\*,core-it-support\core-it-plugins\maven-it-plugin-extension1\src\main\java\**\*,core-it-support\core-it-plugins\maven-it-plugin-extension2\src\main\java\**\*,core-it-support\core-it-plugins\maven-it-plugin-plexus-lifecycle\src\main\java\**\*,core-it-support\core-it-plugins\maven-it-plugin-settings\src\main\java\**\*,core-it-support\core-it-plugins\mng5805-plugin\src\main\java\**\*,core-it-support\core-it-plugins\mng5805-plugin-dep\src\main\java\**\*,core-it-support\core-it-plugins\mng5958-extension\src\main\java\**\*,core-it-support\core-it-toolchain\src\main\java\**\*,core-it-support\core-it-wagon\src\main\java\**\*' - excludes: null
[TASKS] Found 164 files to scan for tasks
[TASKS] Found 0 open tasks.
Skipping warnings blame since pipelines do not have an SCM link.%n
[withMaven] Publishers: Pipeline Graph Publisher: 23 ms, Generated Artifacts Publisher: 4483 ms, Invoker Publisher: 10 ms, Junit Publisher: 29808 ms, Concordion Publisher: 10 ms, Dependencies Fingerprint Publisher: 102 ms, Findbugs Publisher: 3 ms, JGiven Publisher: 2 ms, Jacoco Publisher: 4 ms, SpotBugs Publisher: 3 ms, Open Task Scanner Publisher: 686 ms
[Pipeline] // withMaven
[Pipeline] deleteDir
[Pipeline] }
[Pipeline] // dir
[Pipeline] }
[Pipeline] // stage
[Pipeline] }
[Pipeline] // node
[Pipeline] }
[Pipeline] }
[Pipeline] // dir
[Pipeline] }
[Pipeline] // stage
[Pipeline] }
[Pipeline] // node
[Pipeline] }
[Pipeline] }
[Pipeline] // dir
[Pipeline] }
[Pipeline] // stage
[Pipeline] }
[Pipeline] // node
[Pipeline] }
[Pipeline] }
[Pipeline] // dir
[Pipeline] }
[Pipeline] // stage
[Pipeline] }
[Pipeline] // node
[Pipeline] }
Aborted by hboutemy
mng3746POMPropertyOverride(itMNG3746_UsingDefaultSystemProperty)Sending interrupt signal to process
Sending interrupt signal to process
script returned exit code -1
[Pipeline] }
[withMaven] One or multiple Maven executions have been ignored by the Jenkins Pipeline Maven Plugin because they have been interrupted before completion (1). See Pipeline Maven Plugin FAQ for more details.
[Pipeline] // withMaven
[Pipeline] }
[Pipeline] // dir
[Pipeline] }
[Pipeline] // stage
[Pipeline] }
[Pipeline] // node
[Pipeline] }
Failed in branch windows-jdk7
[Pipeline] // parallel
[Pipeline] echo
[FAILURE-002] FlowInterruptedException org.jenkinsci.plugins.workflow.steps.FlowInterruptedException
[Pipeline] stage
[Pipeline] { (Notifications)
[Pipeline] echo
Build result: FAILURE
[Pipeline] jiraIssueSelector
[Pipeline] emailext
Mime
  • Unnamed multipart/mixed (inline, None, 0 bytes)
View raw message