maven-notifications mailing list archives

Site index · List index
Message view « Date » · « Thread »
Top « Date » · « Thread »
From Apache Jenkins Server <jenk...@builds.apache.org>
Subject Build failed in Jenkins: Maven TLP » maven-pmd-plugin » MPMD-292 #1
Date Thu, 01 Aug 2019 18:44:39 GMT
See https://builds.apache.org/job/maven-box/job/maven-pmd-plugin/job/MPMD-292/1/

No changes.

All tests passed

Build log:
[...truncated 6620 lines...]
[Pipeline] }
[Pipeline] // ws
[Pipeline] }
[Pipeline] // node
[Pipeline] }
[INFO] run post-build script verify.groovy
[INFO]           MPMD-163/pom.xml ................................. SUCCESS (6.7 s)
[INFO] 
[INFO] --- maven-checkstyle-plugin:3.0.0:check (checkstyle-check) @ maven-pmd-plugin ---
[INFO] 
[INFO] --- maven-invoker-plugin:3.1.0:verify (integration-test) @ maven-pmd-plugin ---
[INFO] -------------------------------------------------
[INFO] Build Summary:
[INFO]   Passed: 28, Failed: 1, Errors: 0, Skipped: 2
[INFO] -------------------------------------------------
[ERROR] The following builds failed:
[ERROR] *  MPMD-187/pom.xml
[INFO] -------------------------------------------------
[INFO] ------------------------------------------------------------------------
[INFO] BUILD FAILURE
[INFO] ------------------------------------------------------------------------
[INFO] Total time:  06:09 min
[INFO] Finished at: 2019-08-01T18:43:10Z
[INFO] ------------------------------------------------------------------------
[INFO] [jenkins-event-spy] Generated /home/jenkins/jenkins-slave/workspace/en-box_maven-pmd-plugin_MPMD-292@2@tmp/withMavenbc036a90/maven-spy-20190801-183700-754698660075001456228.log
[ERROR] Failed to execute goal org.apache.maven.plugins:maven-invoker-plugin:3.1.0:verify
(integration-test) on project maven-pmd-plugin: 1 build failed. See console output above for
details. -> [Help 1]
org.apache.maven.lifecycle.LifecycleExecutionException: Failed to execute goal org.apache.maven.plugins:maven-invoker-plugin:3.1.0:verify
(integration-test) on project maven-pmd-plugin: 1 build failed. See console output above for
details.
    at org.apache.maven.lifecycle.internal.MojoExecutor.execute (MojoExecutor.java:215)
    at org.apache.maven.lifecycle.internal.MojoExecutor.execute (MojoExecutor.java:156)
    at org.apache.maven.lifecycle.internal.MojoExecutor.execute (MojoExecutor.java:148)
    at org.apache.maven.lifecycle.internal.LifecycleModuleBuilder.buildProject (LifecycleModuleBuilder.java:117)
    at org.apache.maven.lifecycle.internal.LifecycleModuleBuilder.buildProject (LifecycleModuleBuilder.java:81)
    at org.apache.maven.lifecycle.internal.builder.singlethreaded.SingleThreadedBuilder.build
(SingleThreadedBuilder.java:56)
    at org.apache.maven.lifecycle.internal.LifecycleStarter.execute (LifecycleStarter.java:128)
    at org.apache.maven.DefaultMaven.doExecute (DefaultMaven.java:305)
    at org.apache.maven.DefaultMaven.doExecute (DefaultMaven.java:192)
    at org.apache.maven.DefaultMaven.execute (DefaultMaven.java:105)
    at org.apache.maven.cli.MavenCli.execute (MavenCli.java:956)
    at org.apache.maven.cli.MavenCli.doMain (MavenCli.java:288)
    at org.apache.maven.cli.MavenCli.main (MavenCli.java:192)
    at sun.reflect.NativeMethodAccessorImpl.invoke0 (Native Method)
    at sun.reflect.NativeMethodAccessorImpl.invoke (NativeMethodAccessorImpl.java:62)
    at sun.reflect.DelegatingMethodAccessorImpl.invoke (DelegatingMethodAccessorImpl.java:43)
    at java.lang.reflect.Method.invoke (Method.java:498)
    at org.codehaus.plexus.classworlds.launcher.Launcher.launchEnhanced (Launcher.java:289)
    at org.codehaus.plexus.classworlds.launcher.Launcher.launch (Launcher.java:229)
    at org.codehaus.plexus.classworlds.launcher.Launcher.mainWithExitCode (Launcher.java:415)
    at org.codehaus.plexus.classworlds.launcher.Launcher.main (Launcher.java:356)
Caused by: org.apache.maven.plugin.MojoFailureException: 1 build failed. See console output
above for details.
    at org.apache.maven.plugins.invoker.InvokerSession.handleFailures (InvokerSession.java:260)
    at org.apache.maven.plugins.invoker.VerifyMojo.execute (VerifyMojo.java:137)
    at org.apache.maven.plugin.DefaultBuildPluginManager.executeMojo (DefaultBuildPluginManager.java:137)
    at org.apache.maven.lifecycle.internal.MojoExecutor.execute (MojoExecutor.java:210)
    at org.apache.maven.lifecycle.internal.MojoExecutor.execute (MojoExecutor.java:156)
    at org.apache.maven.lifecycle.internal.MojoExecutor.execute (MojoExecutor.java:148)
    at org.apache.maven.lifecycle.internal.LifecycleModuleBuilder.buildProject (LifecycleModuleBuilder.java:117)
    at org.apache.maven.lifecycle.internal.LifecycleModuleBuilder.buildProject (LifecycleModuleBuilder.java:81)
    at org.apache.maven.lifecycle.internal.builder.singlethreaded.SingleThreadedBuilder.build
(SingleThreadedBuilder.java:56)
    at org.apache.maven.lifecycle.internal.LifecycleStarter.execute (LifecycleStarter.java:128)
    at org.apache.maven.DefaultMaven.doExecute (DefaultMaven.java:305)
    at org.apache.maven.DefaultMaven.doExecute (DefaultMaven.java:192)
    at org.apache.maven.DefaultMaven.execute (DefaultMaven.java:105)
    at org.apache.maven.cli.MavenCli.execute (MavenCli.java:956)
    at org.apache.maven.cli.MavenCli.doMain (MavenCli.java:288)
    at org.apache.maven.cli.MavenCli.main (MavenCli.java:192)
    at sun.reflect.NativeMethodAccessorImpl.invoke0 (Native Method)
    at sun.reflect.NativeMethodAccessorImpl.invoke (NativeMethodAccessorImpl.java:62)
    at sun.reflect.DelegatingMethodAccessorImpl.invoke (DelegatingMethodAccessorImpl.java:43)
    at java.lang.reflect.Method.invoke (Method.java:498)
    at org.codehaus.plexus.classworlds.launcher.Launcher.launchEnhanced (Launcher.java:289)
    at org.codehaus.plexus.classworlds.launcher.Launcher.launch (Launcher.java:229)
    at org.codehaus.plexus.classworlds.launcher.Launcher.mainWithExitCode (Launcher.java:415)
    at org.codehaus.plexus.classworlds.launcher.Launcher.main (Launcher.java:356)
[ERROR] 
[ERROR] Re-run Maven using the -X switch to enable full debug logging.
[ERROR] 
[ERROR] For more information about the errors and possible solutions, please read the following
articles:
[ERROR] [Help 1] http://cwiki.apache.org/confluence/display/MAVEN/MojoFailureException
[Pipeline] }
[Pipeline] // dir
[Pipeline] }
[INFO] run post-build script verify.groovy
[INFO]           MPMD-266-typeresolution-aggregated\pom.xml ....... SUCCESS (21.7 s)
[INFO] Building: MPMD-268-deprecated-rules\pom.xml
[Fast Archiver] No prior successful build to compare, so performing full copy of artifacts
[withMaven] junitPublisher - Archive test results for Maven artifact org.apache.maven.plugins:maven-pmd-plugin:maven-plugin:3.12.1-SNAPSHOT
generated by maven-surefire-plugin:test (default-test): linux-jdk8-m3.6.x_build/target/surefire-reports/*.xml
Recording test results
[INFO] run post-build script verify.groovy
[INFO]           MPMD-266-typeresolution-aggregated\pom.xml ....... SUCCESS (21.6 s)
[INFO] Building: MPMD-268-deprecated-rules\pom.xml
[withMaven] openTasksPublisher - Scan Tasks for Maven artifact org.apache.maven.plugins:maven-pmd-plugin:maven-plugin:3.12.1-SNAPSHOT
in source directory linux-jdk8-m3.6.x_build/src/main/java
[TASKS] Scanning folder '/home/jenkins/jenkins-slave/workspace/en-box_maven-pmd-plugin_MPMD-292@2'
for files matching the pattern 'linux-jdk8-m3.6.x_build/src/main/java/**/*' - excludes: null
[TASKS] Found 14 files to scan for tasks
[TASKS] Found 6 open tasks.
Skipping warnings blame since pipelines do not have an SCM link.%n
[withMaven] invokerPublisher - Archive invoker results for Maven artifact MavenArtifact{org.apache.maven.plugins:maven-pmd-plugin:maven-plugin:3.12.1-SNAPSHOT(version:
3.12.1-SNAPSHOT, snapshot:false) } generated by PluginInvocation{org.apache.maven.plugins:maven-invoker-plugin:3.1.0@integration-test
 integration-test}: linux-jdk8-m3.6.x_build/target/invoker-reports/*.xml
[INFO] run post-build script verify.groovy
[INFO]           MPMD-268-deprecated-rules\pom.xml ................ SUCCESS (5.4 s)
[INFO] Building: MPMD-270-JDK11\pom.xml
[INFO]           MPMD-270-JDK11\pom.xml ........................... SKIPPED due to JRE version
[INFO] Building: MPMD-277-multi-module-check\pom.xml
[INFO] run post-build script verify.groovy
[INFO]           MPMD-268-deprecated-rules\pom.xml ................ SUCCESS (6.5 s)
[INFO] Building: MPMD-270-JDK11\pom.xml
[INFO] run post-build script verify.groovy
[INFO]           MPMD-277-multi-module-check\pom.xml .............. SUCCESS (12.6 s)
[INFO] Building: MPMD-280-JDK12\pom.xml
[INFO]           MPMD-280-JDK12\pom.xml ........................... SKIPPED due to JRE version
[INFO] Building: mpmd-80-included\pom.xml
[INFO] run post-build script verify.groovy
[INFO]           MPMD-270-JDK11\pom.xml ........................... SUCCESS (9.9 s)
[INFO] Building: MPMD-277-multi-module-check\pom.xml
[INFO] run post-build script verify.groovy
[INFO]           mpmd-80-included\pom.xml ......................... SUCCESS (8.8 s)
[INFO] Building: mpmd-80-not-included\pom.xml
[withMaven] Publishers: Generated Artifacts Publisher: 157 ms, Junit Publisher: 2079 ms, Open
Task Scanner Publisher: 680 ms, Invoker Publisher: 28925 ms
[Pipeline] // withMaven
[Pipeline] cleanWs
[WS-CLEANUP] Deleting project workspace...
[WS-CLEANUP] Deferred wipeout is used...
[WS-CLEANUP] done
[Pipeline] cleanWs
[WS-CLEANUP] Deleting project workspace...
[WS-CLEANUP] Deferred wipeout is used...
[WS-CLEANUP] done
[Pipeline] }
[Pipeline] // stage
[Pipeline] }
[Pipeline] // ws
[INFO] run post-build script verify.groovy
[INFO]           MPMD-277-multi-module-check\pom.xml .............. SUCCESS (13.9 s)
[INFO] Building: MPMD-280-JDK12\pom.xml
[INFO]           MPMD-280-JDK12\pom.xml ........................... SKIPPED due to JRE version
[INFO] Building: mpmd-80-included\pom.xml
[Pipeline] }
[Pipeline] // node
[Pipeline] }
Failed in branch linux-jdk8-m3.6.x_build
[INFO] run post-build script verify.groovy
[INFO]           mpmd-80-not-included\pom.xml ..................... SUCCESS (8.9 s)
[INFO] Building: MPMD-89-232-typeresolution\pom.xml
[INFO] run post-build script verify.groovy
[INFO]           mpmd-80-included\pom.xml ......................... SUCCESS (9.1 s)
[INFO] Building: mpmd-80-not-included\pom.xml
[INFO] run post-build script verify.groovy
[INFO]           MPMD-89-232-typeresolution\pom.xml ............... SUCCESS (7.6 s)
[INFO] Building: multi-module\pom.xml
[INFO] run post-build script verify.groovy
[INFO]           mpmd-80-not-included\pom.xml ..................... SUCCESS (10.5 s)
[INFO] Building: MPMD-89-232-typeresolution\pom.xml
[INFO] run post-build script verify.bsh
[INFO]           multi-module\pom.xml ............................. SUCCESS (12.4 s)
[INFO] 
[INFO] --- maven-checkstyle-plugin:3.0.0:check (checkstyle-check) @ maven-pmd-plugin ---
[INFO] 
[INFO] --- maven-invoker-plugin:3.1.0:verify (integration-test) @ maven-pmd-plugin ---
[INFO] -------------------------------------------------
[INFO] Build Summary:
[INFO]   Passed: 29, Failed: 0, Errors: 0, Skipped: 2
[INFO] -------------------------------------------------
[INFO] ------------------------------------------------------------------------
[INFO] BUILD SUCCESS
[INFO] ------------------------------------------------------------------------
[INFO] Total time:  07:06 min
[INFO] Finished at: 2019-08-01T11:44:09-07:00
[INFO] ------------------------------------------------------------------------
[INFO] [jenkins-event-spy] Generated F:\jenkins\jenkins-slave\workspace\en-box_maven-pmd-plugin_MPMD-292@3@tmp\withMaven951daf3e\maven-spy-20190801-113702-2701534111130383382982.log
Picked up JAVA_TOOL_OPTIONS: -Dmaven.ext.class.path="f:\jenkins\jenkins-slave\workspace\en-box_maven-pmd-plugin_MPMD-292@3@tmp\withMaven951daf3e\pipeline-maven-spy.jar"
-Dorg.jenkinsci.plugins.pipeline.maven.reportsFolder="f:\jenkins\jenkins-slave\workspace\en-box_maven-pmd-plugin_MPMD-292@3@tmp\withMaven951daf3e"

[Pipeline] }
[Pipeline] // dir
[Pipeline] }
[withMaven] artifactsPublisher - Archive artifact windows-jdk8-m3.6.x_build\pom.xml under
org\apache\maven\plugins\maven-pmd-plugin\3.12.1-SNAPSHOT\maven-pmd-plugin-3.12.1-SNAPSHOT.pom
[withMaven] artifactsPublisher - Archive artifact windows-jdk8-m3.6.x_build\target\maven-pmd-plugin-3.12.1-SNAPSHOT.jar
under org\apache\maven\plugins\maven-pmd-plugin\3.12.1-SNAPSHOT\maven-pmd-plugin-3.12.1-SNAPSHOT.jar
[Fast Archiver] No prior successful build to compare, so performing full copy of artifacts
[withMaven] junitPublisher - Archive test results for Maven artifact org.apache.maven.plugins:maven-pmd-plugin:maven-plugin:3.12.1-SNAPSHOT
generated by maven-surefire-plugin:test (default-test): windows-jdk8-m3.6.x_build\target\surefire-reports\*.xml
Recording test results
[withMaven] openTasksPublisher - Scan Tasks for Maven artifact org.apache.maven.plugins:maven-pmd-plugin:maven-plugin:3.12.1-SNAPSHOT
in source directory windows-jdk8-m3.6.x_build\src\main\java
[TASKS] Scanning folder 'f:\jenkins\jenkins-slave\workspace\en-box_maven-pmd-plugin_MPMD-292@3'
for files matching the pattern 'windows-jdk8-m3.6.x_build\src\main\java\**\*' - excludes:
null
[TASKS] Found 14 files to scan for tasks
[TASKS] Found 6 open tasks.
Skipping warnings blame since pipelines do not have an SCM link.%n
[withMaven] invokerPublisher - Archive invoker results for Maven artifact MavenArtifact{org.apache.maven.plugins:maven-pmd-plugin:maven-plugin:3.12.1-SNAPSHOT(version:
3.12.1-SNAPSHOT, snapshot:false) } generated by PluginInvocation{org.apache.maven.plugins:maven-invoker-plugin:3.1.0@integration-test
 integration-test}: windows-jdk8-m3.6.x_build\target\invoker-reports\*.xml
[INFO] run post-build script verify.groovy
[INFO]           MPMD-89-232-typeresolution\pom.xml ............... SUCCESS (9.0 s)
[INFO] Building: multi-module\pom.xml
[withMaven] Publishers: Generated Artifacts Publisher: 65 ms, Junit Publisher: 126 ms, Open
Task Scanner Publisher: 68 ms, Invoker Publisher: 11475 ms, Pipeline Graph Publisher: 1 ms
[Pipeline] // withMaven
[Pipeline] cleanWs
[WS-CLEANUP] Deleting project workspace...
[WS-CLEANUP] Deferred wipeout is used...
[WS-CLEANUP] done
[Pipeline] }
[Pipeline] // stage
[Pipeline] }
[Pipeline] // ws
[Pipeline] }
[Pipeline] // node
[Pipeline] }
[INFO] run post-build script verify.bsh
[INFO]           multi-module\pom.xml ............................. SUCCESS (12.1 s)
[INFO] 
[INFO] --- maven-checkstyle-plugin:3.0.0:check (checkstyle-check) @ maven-pmd-plugin ---
[INFO] 
[INFO] --- maven-invoker-plugin:3.1.0:verify (integration-test) @ maven-pmd-plugin ---
[INFO] -------------------------------------------------
[INFO] Build Summary:
[INFO]   Passed: 30, Failed: 0, Errors: 0, Skipped: 1
[INFO] -------------------------------------------------
[INFO] ------------------------------------------------------------------------
[INFO] BUILD SUCCESS
[INFO] ------------------------------------------------------------------------
[INFO] Total time:  07:24 min
[INFO] Finished at: 2019-08-01T11:44:27-07:00
[INFO] ------------------------------------------------------------------------
[INFO] [jenkins-event-spy] Generated F:\jenkins\jenkins-slave\workspace\en-box_maven-pmd-plugin_MPMD-292@2@2@tmp\withMaven857d29c0\maven-spy-20190801-113702-5602126565415254614423.log
[Pipeline] }
[Pipeline] // dir
[Pipeline] }
[withMaven] artifactsPublisher - Archive artifact windows-jdk11-m3.6.x_build\pom.xml under
org\apache\maven\plugins\maven-pmd-plugin\3.12.1-SNAPSHOT\maven-pmd-plugin-3.12.1-SNAPSHOT.pom
[withMaven] artifactsPublisher - Archive artifact windows-jdk11-m3.6.x_build\target\maven-pmd-plugin-3.12.1-SNAPSHOT.jar
under org\apache\maven\plugins\maven-pmd-plugin\3.12.1-SNAPSHOT\maven-pmd-plugin-3.12.1-SNAPSHOT.jar
[Fast Archiver] No prior successful build to compare, so performing full copy of artifacts
[withMaven] junitPublisher - Archive test results for Maven artifact org.apache.maven.plugins:maven-pmd-plugin:maven-plugin:3.12.1-SNAPSHOT
generated by maven-surefire-plugin:test (default-test): windows-jdk11-m3.6.x_build\target\surefire-reports\*.xml
Recording test results
[withMaven] openTasksPublisher - Scan Tasks for Maven artifact org.apache.maven.plugins:maven-pmd-plugin:maven-plugin:3.12.1-SNAPSHOT
in source directory windows-jdk11-m3.6.x_build\src\main\java
[TASKS] Scanning folder 'f:\jenkins\jenkins-slave\workspace\en-box_maven-pmd-plugin_MPMD-292@2@2'
for files matching the pattern 'windows-jdk11-m3.6.x_build\src\main\java\**\*' - excludes:
null
[TASKS] Found 14 files to scan for tasks
[TASKS] Found 6 open tasks.
Skipping warnings blame since pipelines do not have an SCM link.%n
[withMaven] invokerPublisher - Archive invoker results for Maven artifact MavenArtifact{org.apache.maven.plugins:maven-pmd-plugin:maven-plugin:3.12.1-SNAPSHOT(version:
3.12.1-SNAPSHOT, snapshot:false) } generated by PluginInvocation{org.apache.maven.plugins:maven-invoker-plugin:3.1.0@integration-test
 integration-test}: windows-jdk11-m3.6.x_build\target\invoker-reports\*.xml
[withMaven] Publishers: Generated Artifacts Publisher: 64 ms, Junit Publisher: 134 ms, Open
Task Scanner Publisher: 72 ms, Invoker Publisher: 10963 ms, Pipeline Graph Publisher: 1 ms
[Pipeline] // withMaven
[Pipeline] cleanWs
[WS-CLEANUP] Deleting project workspace...
[WS-CLEANUP] Deferred wipeout is used...
[WS-CLEANUP] done
[Pipeline] }
[Pipeline] // stage
[Pipeline] }
[Pipeline] // ws
[Pipeline] }
[Pipeline] // node
[Pipeline] }
[Pipeline] // parallel
[Pipeline] stage
[Pipeline] { (Notifications)
[Pipeline] echo
Build result: FAILURE
[Pipeline] jiraIssueSelector
[Pipeline] emailext
Mime
  • Unnamed multipart/mixed (inline, None, 0 bytes)
View raw message