maven-notifications mailing list archives

Site index · List index
Message view « Date » · « Thread »
Top « Date » · « Thread »
From Apache Jenkins Server <jenk...@builds.apache.org>
Subject Build failed in Jenkins: Maven TLP » maven-surefire » master #45
Date Sat, 03 Aug 2019 11:21:05 GMT
See https://builds.apache.org/job/maven-box/job/maven-surefire/job/master/45/

Changes:

* NotSerializableException: hudson.plugins.git.GitChangeSetList
* investigating permissions to the call 'ChangeSetList.author'
* NotSerializableException: hudson.plugins.git.GitChangeSetList
* [INFRA-18734] Jenkins builds fail on email notifications due to unknown
* moved the fix of INFRA-18734 to jenkinsNotify
* moved the fix of INFRA-18734 to jenkinsNotify
* moved the fix of INFRA-18734 to jenkinsNotify
* moved the fix of INFRA-18734 to jenkinsNotify
* moved the fix of INFRA-18734 to jenkinsNotify
* moved the fix of INFRA-18734 to jenkinsNotify
* moved the fix of INFRA-18734 to jenkinsNotify
* moved the fix of INFRA-18734 to jenkinsNotify
* moved the fix of INFRA-18734 to jenkinsNotify
* moved the fix of INFRA-18734 to jenkinsNotify
* moved the fix of INFRA-18734 to jenkinsNotify
* moved the fix of INFRA-18734 to jenkinsNotify
* moved the fix of INFRA-18734 to jenkinsNotify
* moved the fix of INFRA-18734 to jenkinsNotify
* moved the fix of INFRA-18734 to jenkinsNotify
* moved the fix of INFRA-18734 to jenkinsNotify

All tests passed

Build log:
[...truncated 118605 lines...]
[Pipeline] // ws
[Pipeline] }
[Pipeline] // timestamps
[Pipeline] }
[Pipeline] // node
[Pipeline] }
[2019-08-03T11:14:36.049Z] [INFO] Tests run: 6, Failures: 0, Errors: 0, Skipped: 0, Time elapsed:
44.032 s - in org.apache.maven.surefire.its.jiras.Surefire809GroupExpressionsIT
[2019-08-03T11:14:36.049Z] [INFO] Running org.apache.maven.surefire.its.jiras.Surefire812Log4JClassLoaderIT
[2019-08-03T11:14:36.301Z] [INFO] Tests run: 6, Failures: 0, Errors: 0, Skipped: 0, Time elapsed:
43.758 s - in org.apache.maven.surefire.its.jiras.Surefire809GroupExpressionsIT
[2019-08-03T11:14:36.301Z] [INFO] Running org.apache.maven.surefire.its.jiras.Surefire812Log4JClassLoaderIT
[2019-08-03T11:14:40.322Z] [INFO] Tests run: 1, Failures: 0, Errors: 0, Skipped: 0, Time elapsed:
8.017 s - in org.apache.maven.surefire.its.jiras.Surefire812Log4JClassLoaderIT
[2019-08-03T11:14:40.322Z] [INFO] Running org.apache.maven.surefire.its.jiras.Surefire817SystemExitIT
[2019-08-03T11:14:40.570Z] [INFO] Tests run: 1, Failures: 0, Errors: 0, Skipped: 0, Time elapsed:
7.98 s - in org.apache.maven.surefire.its.jiras.Surefire812Log4JClassLoaderIT
[2019-08-03T11:14:40.570Z] [INFO] Running org.apache.maven.surefire.its.jiras.Surefire817SystemExitIT
[2019-08-03T11:14:48.568Z] [INFO] Tests run: 1, Failures: 0, Errors: 0, Skipped: 0, Time elapsed:
7.664 s - in org.apache.maven.surefire.its.jiras.Surefire817SystemExitIT
[2019-08-03T11:14:48.568Z] [INFO] Running org.apache.maven.surefire.its.jiras.Surefire818NpeIgnoresTestsIT
[2019-08-03T11:14:48.791Z] [INFO] Tests run: 1, Failures: 0, Errors: 0, Skipped: 0, Time elapsed:
7.585 s - in org.apache.maven.surefire.its.jiras.Surefire817SystemExitIT
[2019-08-03T11:14:48.791Z] [INFO] Running org.apache.maven.surefire.its.jiras.Surefire818NpeIgnoresTestsIT
[2019-08-03T11:14:56.798Z] [INFO] Tests run: 1, Failures: 0, Errors: 0, Skipped: 0, Time elapsed:
8.07 s - in org.apache.maven.surefire.its.jiras.Surefire818NpeIgnoresTestsIT
[2019-08-03T11:14:56.798Z] [INFO] Running org.apache.maven.surefire.its.jiras.Surefire828EmptyGroupExprIT
[2019-08-03T11:14:57.019Z] [INFO] Tests run: 1, Failures: 0, Errors: 0, Skipped: 0, Time elapsed:
8.008 s - in org.apache.maven.surefire.its.jiras.Surefire818NpeIgnoresTestsIT
[2019-08-03T11:14:57.019Z] [INFO] Running org.apache.maven.surefire.its.jiras.Surefire828EmptyGroupExprIT
[2019-08-03T11:15:29.041Z] [INFO] Tests run: 4, Failures: 0, Errors: 0, Skipped: 0, Time elapsed:
30.493 s - in org.apache.maven.surefire.its.jiras.Surefire828EmptyGroupExprIT
[2019-08-03T11:15:29.041Z] [INFO] Running org.apache.maven.surefire.its.jiras.Surefire832ProviderSelectionIT
[2019-08-03T11:15:29.852Z] [INFO] Tests run: 4, Failures: 0, Errors: 0, Skipped: 0, Time elapsed:
30.909 s - in org.apache.maven.surefire.its.jiras.Surefire828EmptyGroupExprIT
[2019-08-03T11:15:29.852Z] [INFO] Running org.apache.maven.surefire.its.jiras.Surefire832ProviderSelectionIT
[2019-08-03T11:15:35.210Z] [INFO] Tests run: 1, Failures: 0, Errors: 0, Skipped: 0, Time elapsed:
7.815 s - in org.apache.maven.surefire.its.jiras.Surefire832ProviderSelectionIT
[2019-08-03T11:15:35.210Z] [INFO] Running org.apache.maven.surefire.its.jiras.Surefire839TestWithoutCategoriesIT
[2019-08-03T11:15:35.703Z] [INFO] Tests run: 1, Failures: 0, Errors: 0, Skipped: 0, Time elapsed:
8.112 s - in org.apache.maven.surefire.its.jiras.Surefire832ProviderSelectionIT
[2019-08-03T11:15:35.703Z] [INFO] Running org.apache.maven.surefire.its.jiras.Surefire839TestWithoutCategoriesIT
[2019-08-03T11:15:50.240Z] [INFO] Tests run: 2, Failures: 0, Errors: 0, Skipped: 0, Time elapsed:
15.515 s - in org.apache.maven.surefire.its.jiras.Surefire839TestWithoutCategoriesIT
[2019-08-03T11:15:50.240Z] [INFO] Running org.apache.maven.surefire.its.jiras.Surefire847AdditionalFailureIT
[2019-08-03T11:15:50.717Z] [INFO] Tests run: 2, Failures: 0, Errors: 0, Skipped: 0, Time elapsed:
15.988 s - in org.apache.maven.surefire.its.jiras.Surefire839TestWithoutCategoriesIT
[2019-08-03T11:15:50.717Z] [INFO] Running org.apache.maven.surefire.its.jiras.Surefire847AdditionalFailureIT
[2019-08-03T11:16:00.395Z] [INFO] Tests run: 1, Failures: 0, Errors: 0, Skipped: 0, Time elapsed:
8.942 s - in org.apache.maven.surefire.its.jiras.Surefire847AdditionalFailureIT
[2019-08-03T11:16:00.395Z] [INFO] Running org.apache.maven.surefire.its.jiras.Surefire855AllowFailsafeUseArtifactFileIT
[2019-08-03T11:16:00.838Z] [INFO] Tests run: 1, Failures: 0, Errors: 0, Skipped: 0, Time elapsed:
8.524 s - in org.apache.maven.surefire.its.jiras.Surefire847AdditionalFailureIT
[2019-08-03T11:16:00.838Z] [INFO] Running org.apache.maven.surefire.its.jiras.Surefire855AllowFailsafeUseArtifactFileIT
[2019-08-03T11:17:22.062Z] [INFO] Tests run: 4, Failures: 0, Errors: 0, Skipped: 0, Time elapsed:
81.734 s - in org.apache.maven.surefire.its.jiras.Surefire855AllowFailsafeUseArtifactFileIT
[2019-08-03T11:17:22.063Z] [INFO] Running org.apache.maven.surefire.its.jiras.Surefire901MIssingResultfileWhenNoTestsIT
[2019-08-03T11:17:22.861Z] [INFO] Tests run: 4, Failures: 0, Errors: 0, Skipped: 0, Time elapsed:
80.72 s - in org.apache.maven.surefire.its.jiras.Surefire855AllowFailsafeUseArtifactFileIT
[2019-08-03T11:17:22.861Z] [INFO] Running org.apache.maven.surefire.its.jiras.Surefire901MIssingResultfileWhenNoTestsIT
[2019-08-03T11:17:26.223Z] [INFO] Tests run: 1, Failures: 0, Errors: 0, Skipped: 0, Time elapsed:
5.617 s - in org.apache.maven.surefire.its.jiras.Surefire901MIssingResultfileWhenNoTestsIT
[2019-08-03T11:17:26.223Z] [INFO] Running org.apache.maven.surefire.its.jiras.Surefire907PerThreadWithoutThreadCountIT
[2019-08-03T11:17:27.426Z] [INFO] Tests run: 1, Failures: 0, Errors: 0, Skipped: 0, Time elapsed:
5.665 s - in org.apache.maven.surefire.its.jiras.Surefire901MIssingResultfileWhenNoTestsIT
[2019-08-03T11:17:27.426Z] [INFO] Running org.apache.maven.surefire.its.jiras.Surefire907PerThreadWithoutThreadCountIT
[2019-08-03T11:17:31.597Z] [INFO] Tests run: 1, Failures: 0, Errors: 0, Skipped: 0, Time elapsed:
4.784 s - in org.apache.maven.surefire.its.jiras.Surefire907PerThreadWithoutThreadCountIT
[2019-08-03T11:17:31.597Z] [INFO] Running org.apache.maven.surefire.its.jiras.Surefire920TestFailureIgnoreWithTimeoutIT
[2019-08-03T11:17:31.714Z] [INFO] Tests run: 1, Failures: 0, Errors: 0, Skipped: 0, Time elapsed:
4.711 s - in org.apache.maven.surefire.its.jiras.Surefire907PerThreadWithoutThreadCountIT
[2019-08-03T11:17:31.714Z] [INFO] Running org.apache.maven.surefire.its.jiras.Surefire920TestFailureIgnoreWithTimeoutIT
[2019-08-03T11:17:49.817Z] [INFO] Tests run: 2, Failures: 0, Errors: 0, Skipped: 0, Time elapsed:
17.934 s - in org.apache.maven.surefire.its.jiras.Surefire920TestFailureIgnoreWithTimeoutIT
[2019-08-03T11:17:49.817Z] [INFO] Running org.apache.maven.surefire.its.jiras.Surefire926FailureWith2ProvidersIT
[2019-08-03T11:17:49.946Z] [INFO] Tests run: 2, Failures: 0, Errors: 0, Skipped: 0, Time elapsed:
17.858 s - in org.apache.maven.surefire.its.jiras.Surefire920TestFailureIgnoreWithTimeoutIT
[2019-08-03T11:17:49.946Z] [INFO] Running org.apache.maven.surefire.its.jiras.Surefire926FailureWith2ProvidersIT
[2019-08-03T11:17:54.170Z] [INFO] Tests run: 1, Failures: 0, Errors: 0, Skipped: 0, Time elapsed:
5.129 s - in org.apache.maven.surefire.its.jiras.Surefire926FailureWith2ProvidersIT
[2019-08-03T11:17:54.170Z] [INFO] Running org.apache.maven.surefire.its.jiras.Surefire930TestNgSuiteXmlIT
[2019-08-03T11:17:55.407Z] [INFO] Tests run: 1, Failures: 0, Errors: 0, Skipped: 0, Time elapsed:
4.894 s - in org.apache.maven.surefire.its.jiras.Surefire926FailureWith2ProvidersIT
[2019-08-03T11:17:55.407Z] [INFO] Running org.apache.maven.surefire.its.jiras.Surefire930TestNgSuiteXmlIT
[2019-08-03T11:18:03.769Z] [INFO] Tests run: 1, Failures: 0, Errors: 0, Skipped: 0, Time elapsed:
8.926 s - in org.apache.maven.surefire.its.jiras.Surefire930TestNgSuiteXmlIT
[2019-08-03T11:18:03.769Z] [INFO] Running org.apache.maven.surefire.its.jiras.Surefire943ReportContentIT
[2019-08-03T11:18:04.268Z] [INFO] Tests run: 1, Failures: 0, Errors: 0, Skipped: 0, Time elapsed:
8.68 s - in org.apache.maven.surefire.its.jiras.Surefire930TestNgSuiteXmlIT
[2019-08-03T11:18:04.268Z] [INFO] Running org.apache.maven.surefire.its.jiras.Surefire943ReportContentIT
[2019-08-03T11:18:42.665Z] [INFO] Tests run: 2, Failures: 0, Errors: 0, Skipped: 0, Time elapsed:
34.793 s - in org.apache.maven.surefire.its.jiras.Surefire943ReportContentIT
[2019-08-03T11:18:42.665Z] [INFO] Running org.apache.maven.surefire.its.jiras.Surefire946KillMainProcessInReusableForkIT
[2019-08-03T11:18:43.159Z] [INFO] Tests run: 2, Failures: 0, Errors: 0, Skipped: 0, Time elapsed:
34.677 s - in org.apache.maven.surefire.its.jiras.Surefire943ReportContentIT
[2019-08-03T11:18:43.159Z] [INFO] Running org.apache.maven.surefire.its.jiras.Surefire946KillMainProcessInReusableForkIT
[2019-08-03T11:19:39.130Z] [INFO] Tests run: 6, Failures: 0, Errors: 0, Skipped: 0, Time elapsed:
53.589 s - in org.apache.maven.surefire.its.jiras.Surefire946KillMainProcessInReusableForkIT
[2019-08-03T11:19:39.130Z] [INFO] Running org.apache.maven.surefire.its.jiras.Surefire972BizarreNoClassDefIT
[2019-08-03T11:19:39.677Z] [INFO] Tests run: 6, Failures: 0, Errors: 0, Skipped: 0, Time elapsed:
54.179 s - in org.apache.maven.surefire.its.jiras.Surefire946KillMainProcessInReusableForkIT
[2019-08-03T11:19:39.677Z] [INFO] Running org.apache.maven.surefire.its.jiras.Surefire972BizarreNoClassDefIT
[2019-08-03T11:19:45.044Z] [INFO] Tests run: 1, Failures: 0, Errors: 0, Skipped: 0, Time elapsed:
13.129 s - in org.apache.maven.surefire.its.jiras.Surefire972BizarreNoClassDefIT
[2019-08-03T11:19:45.044Z] [INFO] Running org.apache.maven.surefire.its.jiras.Surefire975DefaultVMEncodingIT
[2019-08-03T11:19:45.792Z] [INFO] Tests run: 1, Failures: 0, Errors: 0, Skipped: 0, Time elapsed:
12.479 s - in org.apache.maven.surefire.its.jiras.Surefire972BizarreNoClassDefIT
[2019-08-03T11:19:45.792Z] [INFO] Running org.apache.maven.surefire.its.jiras.Surefire975DefaultVMEncodingIT
[2019-08-03T11:19:52.543Z] [INFO] Tests run: 1, Failures: 0, Errors: 0, Skipped: 0, Time elapsed:
7.29 s - in org.apache.maven.surefire.its.jiras.Surefire975DefaultVMEncodingIT
[2019-08-03T11:19:52.543Z] [INFO] Running org.apache.maven.surefire.its.jiras.Surefire979WrongClassLoaderIT
[2019-08-03T11:19:53.392Z] [INFO] Tests run: 1, Failures: 0, Errors: 0, Skipped: 0, Time elapsed:
7.134 s - in org.apache.maven.surefire.its.jiras.Surefire975DefaultVMEncodingIT
[2019-08-03T11:19:53.392Z] [INFO] Running org.apache.maven.surefire.its.jiras.Surefire979WrongClassLoaderIT
[2019-08-03T11:19:59.203Z] [INFO] Tests run: 1, Failures: 0, Errors: 0, Skipped: 0, Time elapsed:
7.098 s - in org.apache.maven.surefire.its.jiras.Surefire979WrongClassLoaderIT
[2019-08-03T11:19:59.203Z] [INFO] Running org.apache.maven.surefire.its.jiras.Surefire985ParameterizedRunnerAndCategoriesIT
[2019-08-03T11:20:00.080Z] [INFO] Tests run: 1, Failures: 0, Errors: 0, Skipped: 0, Time elapsed:
7.177 s - in org.apache.maven.surefire.its.jiras.Surefire979WrongClassLoaderIT
[2019-08-03T11:20:00.081Z] [INFO] Running org.apache.maven.surefire.its.jiras.Surefire985ParameterizedRunnerAndCategoriesIT
[2019-08-03T11:20:05.865Z] [INFO] Tests run: 1, Failures: 0, Errors: 0, Skipped: 0, Time elapsed:
6.349 s - in org.apache.maven.surefire.its.jiras.Surefire985ParameterizedRunnerAndCategoriesIT
[2019-08-03T11:20:05.865Z] [INFO] Running org.apache.maven.surefire.its.jiras.Surefire995CategoryInheritanceIT
[2019-08-03T11:20:06.762Z] [INFO] Tests run: 1, Failures: 0, Errors: 0, Skipped: 0, Time elapsed:
6.6 s - in org.apache.maven.surefire.its.jiras.Surefire985ParameterizedRunnerAndCategoriesIT
[2019-08-03T11:20:06.762Z] [INFO] Running org.apache.maven.surefire.its.jiras.Surefire995CategoryInheritanceIT
[2019-08-03T11:20:38.129Z] [INFO] Tests run: 5, Failures: 0, Errors: 0, Skipped: 0, Time elapsed:
29.438 s - in org.apache.maven.surefire.its.jiras.Surefire995CategoryInheritanceIT
[2019-08-03T11:20:38.129Z] [INFO] 
[2019-08-03T11:20:38.129Z] [INFO] Results:
[2019-08-03T11:20:38.129Z] [INFO] 
[2019-08-03T11:20:38.129Z] [WARNING] Tests run: 846, Failures: 0, Errors: 0, Skipped: 143
[2019-08-03T11:20:38.129Z] [INFO] 
[2019-08-03T11:20:38.129Z] [INFO] 
[2019-08-03T11:20:38.129Z] [INFO] --- maven-checkstyle-plugin:3.0.0:check (checkstyle-check)
@ surefire-its ---
[2019-08-03T11:20:38.129Z] [INFO] 
[2019-08-03T11:20:38.129Z] [INFO] --- maven-failsafe-plugin:3.0.0-M3:verify (default) @ surefire-its
---
[2019-08-03T11:20:38.129Z] [INFO] Failsafe report directory: C:\Users\jenkins\AppData\Local\Temp\3\jenkins-maven-box-maven-surefire-master-45@2\surefire-its\target\failsafe-reports
[2019-08-03T11:20:38.129Z] [INFO] 
[2019-08-03T11:20:38.129Z] [INFO] --- maven-install-plugin:2.5.2:install (default-install)
@ surefire-its ---
[2019-08-03T11:20:38.129Z] [INFO] Skipping artifact installation
[2019-08-03T11:20:38.129Z] [INFO] ------------------------------------------------------------------------
[2019-08-03T11:20:38.129Z] [INFO] Reactor Summary for Apache Maven Surefire 3.0.0-SNAPSHOT:
[2019-08-03T11:20:38.129Z] [INFO] 
[2019-08-03T11:20:38.129Z] [INFO] Apache Maven Surefire .............................. SUCCESS
[01:19 min]
[2019-08-03T11:20:38.129Z] [INFO] SureFire Logger API ................................ SUCCESS
[ 28.678 s]
[2019-08-03T11:20:38.129Z] [INFO] SureFire API ....................................... SUCCESS
[ 21.127 s]
[2019-08-03T11:20:38.129Z] [INFO] Surefire Extensions API ............................ SUCCESS
[  3.543 s]
[2019-08-03T11:20:38.129Z] [INFO] SureFire Booter .................................... SUCCESS
[ 22.637 s]
[2019-08-03T11:20:38.129Z] [INFO] Maven Surefire Test-Grouping Support ............... SUCCESS
[ 13.761 s]
[2019-08-03T11:20:38.129Z] [INFO] SureFire Providers ................................. SUCCESS
[  1.207 s]
[2019-08-03T11:20:38.129Z] [INFO] Shared JUnit3 Provider Code ........................ SUCCESS
[  5.648 s]
[2019-08-03T11:20:38.129Z] [INFO] Shared Java 5 Provider Base ........................ SUCCESS
[  9.833 s]
[2019-08-03T11:20:38.129Z] [INFO] Shared JUnit4 Provider Code ........................ SUCCESS
[  7.318 s]
[2019-08-03T11:20:38.129Z] [INFO] Shared JUnit48 Provider Code ....................... SUCCESS
[  8.277 s]
[2019-08-03T11:20:38.129Z] [INFO] SureFire JUnit Runner .............................. SUCCESS
[  6.434 s]
[2019-08-03T11:20:38.129Z] [INFO] SureFire JUnit4 Runner ............................. SUCCESS
[ 37.635 s]
[2019-08-03T11:20:38.129Z] [INFO] Maven Surefire Common .............................. SUCCESS
[ 53.300 s]
[2019-08-03T11:20:38.129Z] [INFO] SureFire JUnitCore Runner .......................... SUCCESS
[02:20 min]
[2019-08-03T11:20:38.129Z] [INFO] SureFire JUnit Platform Runner ..................... SUCCESS
[ 13.593 s]
[2019-08-03T11:20:38.129Z] [INFO] SureFire TestNG Utils .............................. SUCCESS
[  7.088 s]
[2019-08-03T11:20:38.129Z] [INFO] SureFire TestNG Runner ............................. SUCCESS
[  8.330 s]
[2019-08-03T11:20:38.129Z] [INFO] ShadeFire JUnit3 Provider .......................... SUCCESS
[  2.932 s]
[2019-08-03T11:20:38.129Z] [INFO] Surefire Report Parser ............................. SUCCESS
[  8.738 s]
[2019-08-03T11:20:38.129Z] [INFO] Maven Surefire Plugin .............................. SUCCESS
[ 17.800 s]
[2019-08-03T11:20:38.129Z] [INFO] Maven Failsafe Plugin .............................. SUCCESS
[02:17 min]
[2019-08-03T11:20:38.129Z] [INFO] Maven Surefire Report Plugin ....................... SUCCESS
[ 23.168 s]
[2019-08-03T11:20:38.129Z] [INFO] Maven Surefire Integration Tests ................... SUCCESS
[  01:28 h]
[2019-08-03T11:20:38.129Z] [INFO] ------------------------------------------------------------------------
[2019-08-03T11:20:38.129Z] [INFO] BUILD SUCCESS
[2019-08-03T11:20:38.129Z] [INFO] ------------------------------------------------------------------------
[2019-08-03T11:20:38.129Z] [INFO] Total time:  01:39 h
[2019-08-03T11:20:38.129Z] [INFO] Finished at: 2019-08-03T04:20:36-07:00
[2019-08-03T11:20:38.129Z] [INFO] ------------------------------------------------------------------------
[Pipeline] }
[Pipeline] // withEnv
[Pipeline] }
[Pipeline] // stage
[Pipeline] fileExists
[Pipeline] zip
[2019-08-03T11:20:38.295Z] Writing zip file of C:\Users\jenkins\AppData\Local\Temp\3\jenkins-maven-box-maven-surefire-master-45@2\maven-failsafe-plugin\target\it
to C:\Users\jenkins\AppData\Local\Temp\3\jenkins-maven-box-maven-surefire-master-45@2\maven-failsafe-plugin--windows-jdk11-maven3.6.x.zip
[2019-08-03T11:20:38.965Z] Zipped 79 entries.
[2019-08-03T11:20:38.965Z] Archiving C:\Users\jenkins\AppData\Local\Temp\3\jenkins-maven-box-maven-surefire-master-45@2\maven-failsafe-plugin--windows-jdk11-maven3.6.x.zip
[2019-08-03T11:20:38.966Z] [Fast Archiver] No artifacts from Maven TLP » maven-surefire »
master #43 to compare, so performing full copy of artifacts
[Pipeline] fileExists
[2019-08-03T11:20:39.005Z] [INFO] Tests run: 5, Failures: 0, Errors: 0, Skipped: 0, Time elapsed:
30.25 s - in org.apache.maven.surefire.its.jiras.Surefire995CategoryInheritanceIT
[2019-08-03T11:20:39.005Z] [INFO] 
[2019-08-03T11:20:39.005Z] [INFO] Results:
[2019-08-03T11:20:39.005Z] [INFO] 
[2019-08-03T11:20:39.005Z] [WARNING] Tests run: 846, Failures: 0, Errors: 0, Skipped: 143
[2019-08-03T11:20:39.005Z] [INFO] 
[2019-08-03T11:20:39.005Z] [INFO] 
[2019-08-03T11:20:39.005Z] [INFO] --- maven-checkstyle-plugin:3.0.0:check (checkstyle-check)
@ surefire-its ---
[2019-08-03T11:20:39.005Z] [INFO] 
[2019-08-03T11:20:39.005Z] [INFO] --- maven-failsafe-plugin:3.0.0-M3:verify (default) @ surefire-its
---
[2019-08-03T11:20:39.005Z] [INFO] Failsafe report directory: C:\Users\jenkins\AppData\Local\Temp\3\jenkins-maven-box-maven-surefire-master-45\surefire-its\target\failsafe-reports
[2019-08-03T11:20:39.005Z] [INFO] 
[2019-08-03T11:20:39.005Z] [INFO] --- maven-install-plugin:2.5.2:install (default-install)
@ surefire-its ---
[2019-08-03T11:20:39.005Z] [INFO] Skipping artifact installation
[2019-08-03T11:20:39.005Z] [INFO] ------------------------------------------------------------------------
[2019-08-03T11:20:39.005Z] [INFO] Reactor Summary for Apache Maven Surefire 3.0.0-SNAPSHOT:
[2019-08-03T11:20:39.005Z] [INFO] 
[2019-08-03T11:20:39.005Z] [INFO] Apache Maven Surefire .............................. SUCCESS
[01:22 min]
[2019-08-03T11:20:39.005Z] [INFO] SureFire Logger API ................................ SUCCESS
[ 29.064 s]
[2019-08-03T11:20:39.005Z] [INFO] SureFire API ....................................... SUCCESS
[ 20.484 s]
[2019-08-03T11:20:39.005Z] [INFO] Surefire Extensions API ............................ SUCCESS
[  3.552 s]
[2019-08-03T11:20:39.005Z] [INFO] SureFire Booter .................................... SUCCESS
[ 22.632 s]
[2019-08-03T11:20:39.005Z] [INFO] Maven Surefire Test-Grouping Support ............... SUCCESS
[ 13.759 s]
[2019-08-03T11:20:39.005Z] [INFO] SureFire Providers ................................. SUCCESS
[  1.214 s]
[2019-08-03T11:20:39.005Z] [INFO] Shared JUnit3 Provider Code ........................ SUCCESS
[  5.671 s]
[2019-08-03T11:20:39.005Z] [INFO] Shared Java 5 Provider Base ........................ SUCCESS
[  9.532 s]
[2019-08-03T11:20:39.005Z] [INFO] Shared JUnit4 Provider Code ........................ SUCCESS
[  7.571 s]
[2019-08-03T11:20:39.005Z] [INFO] Shared JUnit48 Provider Code ....................... SUCCESS
[  8.238 s]
[2019-08-03T11:20:39.005Z] [INFO] SureFire JUnit Runner .............................. SUCCESS
[  6.490 s]
[2019-08-03T11:20:39.005Z] [INFO] SureFire JUnit4 Runner ............................. SUCCESS
[ 15.375 s]
[2019-08-03T11:20:39.005Z] [INFO] Maven Surefire Common .............................. SUCCESS
[ 56.279 s]
[2019-08-03T11:20:39.005Z] [INFO] SureFire JUnitCore Runner .......................... SUCCESS
[02:23 min]
[2019-08-03T11:20:39.005Z] [INFO] SureFire JUnit Platform Runner ..................... SUCCESS
[ 12.712 s]
[2019-08-03T11:20:39.005Z] [INFO] SureFire TestNG Utils .............................. SUCCESS
[  6.669 s]
[2019-08-03T11:20:39.005Z] [INFO] SureFire TestNG Runner ............................. SUCCESS
[  7.480 s]
[2019-08-03T11:20:39.005Z] [INFO] ShadeFire JUnit3 Provider .......................... SUCCESS
[  2.767 s]
[2019-08-03T11:20:39.006Z] [INFO] Surefire Report Parser ............................. SUCCESS
[ 10.208 s]
[2019-08-03T11:20:39.006Z] [INFO] Maven Surefire Plugin .............................. SUCCESS
[ 17.753 s]
[2019-08-03T11:20:39.006Z] [INFO] Maven Failsafe Plugin .............................. SUCCESS
[02:16 min]
[2019-08-03T11:20:39.006Z] [INFO] Maven Surefire Report Plugin ....................... SUCCESS
[ 24.776 s]
[2019-08-03T11:20:39.006Z] [INFO] Maven Surefire Integration Tests ................... SUCCESS
[  01:28 h]
[2019-08-03T11:20:39.006Z] [INFO] ------------------------------------------------------------------------
[2019-08-03T11:20:39.006Z] [INFO] BUILD SUCCESS
[2019-08-03T11:20:39.006Z] [INFO] ------------------------------------------------------------------------
[2019-08-03T11:20:39.006Z] [INFO] Total time:  01:39 h
[2019-08-03T11:20:39.006Z] [INFO] Finished at: 2019-08-03T04:20:37-07:00
[2019-08-03T11:20:39.006Z] [INFO] ------------------------------------------------------------------------
[Pipeline] zip
[Pipeline] }
[2019-08-03T11:20:39.046Z] Writing zip file of C:\Users\jenkins\AppData\Local\Temp\3\jenkins-maven-box-maven-surefire-master-45@2\surefire-its\target
to C:\Users\jenkins\AppData\Local\Temp\3\jenkins-maven-box-maven-surefire-master-45@2\surefire-its--windows-jdk11-maven3.6.x.zip
[Pipeline] // withEnv
[Pipeline] }
[Pipeline] // stage
[Pipeline] fileExists
[Pipeline] zip
[2019-08-03T11:20:39.174Z] Writing zip file of C:\Users\jenkins\AppData\Local\Temp\3\jenkins-maven-box-maven-surefire-master-45\maven-failsafe-plugin\target\it
to C:\Users\jenkins\AppData\Local\Temp\3\jenkins-maven-box-maven-surefire-master-45\maven-failsafe-plugin--windows-jdk12-maven3.6.x.zip
[2019-08-03T11:20:39.607Z] Zipped 78 entries.
[2019-08-03T11:20:39.607Z] Archiving C:\Users\jenkins\AppData\Local\Temp\3\jenkins-maven-box-maven-surefire-master-45\maven-failsafe-plugin--windows-jdk12-maven3.6.x.zip
[2019-08-03T11:20:39.609Z] [Fast Archiver] No artifacts from Maven TLP » maven-surefire »
master #43 to compare, so performing full copy of artifacts
[Pipeline] fileExists
[Pipeline] zip
[2019-08-03T11:20:39.681Z] Writing zip file of C:\Users\jenkins\AppData\Local\Temp\3\jenkins-maven-box-maven-surefire-master-45\surefire-its\target
to C:\Users\jenkins\AppData\Local\Temp\3\jenkins-maven-box-maven-surefire-master-45\surefire-its--windows-jdk12-maven3.6.x.zip
[2019-08-03T11:20:59.375Z] Zipped 17018 entries.
[2019-08-03T11:20:59.375Z] Archiving C:\Users\jenkins\AppData\Local\Temp\3\jenkins-maven-box-maven-surefire-master-45\surefire-its--windows-jdk12-maven3.6.x.zip
[2019-08-03T11:20:59.376Z] Zipped 17028 entries.
[2019-08-03T11:20:59.376Z] Archiving C:\Users\jenkins\AppData\Local\Temp\3\jenkins-maven-box-maven-surefire-master-45@2\surefire-its--windows-jdk11-maven3.6.x.zip
[2019-08-03T11:20:59.376Z] [Fast Archiver] No artifacts from Maven TLP » maven-surefire »
master #43 to compare, so performing full copy of artifacts
[2019-08-03T11:20:59.377Z] [Fast Archiver] No artifacts from Maven TLP » maven-surefire »
master #43 to compare, so performing full copy of artifacts
[Pipeline] archiveArtifacts
[2019-08-03T11:21:02.225Z] Archiving artifacts
[Pipeline] archiveArtifacts
[2019-08-03T11:21:02.256Z] Archiving artifacts
[2019-08-03T11:21:02.260Z] [Fast Archiver] No artifacts from Maven TLP » maven-surefire »
master #43 to compare, so performing full copy of artifacts
[2019-08-03T11:21:02.268Z] [Fast Archiver] No artifacts from Maven TLP » maven-surefire »
master #43 to compare, so performing full copy of artifacts
[Pipeline] cleanWs
[2019-08-03T11:21:04.577Z] [WS-CLEANUP] Deleting project workspace...
[2019-08-03T11:21:04.577Z] [WS-CLEANUP] Deferred wipeout is used...
[Pipeline] cleanWs
[2019-08-03T11:21:04.840Z] [WS-CLEANUP] Deleting project workspace...
[2019-08-03T11:21:04.840Z] [WS-CLEANUP] Deferred wipeout is used...
[2019-08-03T11:21:04.841Z] [WS-CLEANUP] done
[Pipeline] }
[Pipeline] // ws
[Pipeline] }
[Pipeline] // timestamps
[Pipeline] }
[Pipeline] // node
[Pipeline] }
[2019-08-03T11:21:04.977Z] [WS-CLEANUP] done
[Pipeline] }
[Pipeline] // ws
[Pipeline] }
[Pipeline] // timestamps
[Pipeline] }
[Pipeline] // node
[Pipeline] }
[Pipeline] // parallel
[Pipeline] echo
Build result: FAILURE
[Pipeline] jiraIssueSelector
[Pipeline] echo
The authors of changes [tibordigana].
[Pipeline] echo
Sending email ...
[Pipeline] emailext
Mime
  • Unnamed multipart/mixed (inline, None, 0 bytes)
View raw message