maven-notifications mailing list archives

Site index · List index
Message view « Date » · « Thread »
Top « Date » · « Thread »
From Apache Jenkins Server <jenk...@builds.apache.org>
Subject Build failed in Jenkins: Maven TLP » maven-archetype » buildfix #35
Date Mon, 12 Aug 2019 21:51:25 GMT
See https://builds.apache.org/job/maven-box/job/maven-archetype/job/buildfix/35/

Changes:

* aether 1.13.1
* aether 1.13.1

26 tests failed.
FAILED:  org.apache.maven.archetype.generator.DefaultArchetypeGeneratorTest.windows-jdk7-m3.2.x_build / Build windows-jdk7-m3.2.x_build / testGenerateArchetypePartialWithoutPoms

Error Message:
org/sonatype/aether/util/ConfigUtils

Stack Trace:
java.lang.NoClassDefFoundError: org/sonatype/aether/util/ConfigUtils
	at org.sonatype.aether.connector.file.ParallelRepositoryConnector.initExecutor(ParallelRepositoryConnector.java:50)
	at org.sonatype.aether.connector.file.FileRepositoryConnector.<init>(FileRepositoryConnector.java:59)
	at org.sonatype.aether.connector.file.FileRepositoryConnectorFactory.newInstance(FileRepositoryConnectorFactory.java:94)
	at org.sonatype.aether.impl.internal.DefaultRemoteRepositoryManager.getRepositoryConnector(DefaultRemoteRepositoryManager.java:316)
	at org.sonatype.aether.impl.internal.DefaultArtifactResolver.resolveArtifacts(DefaultArtifactResolver.java:403)
	at org.sonatype.aether.impl.internal.DefaultArtifactResolver.resolveArtifact(DefaultArtifactResolver.java:190)
	at org.apache.maven.repository.internal.DefaultArtifactDescriptorReader.loadPom(DefaultArtifactDescriptorReader.java:259)
	at org.apache.maven.repository.internal.DefaultArtifactDescriptorReader.readArtifactDescriptor(DefaultArtifactDescriptorReader.java:170)
	at org.sonatype.aether.impl.internal.DefaultRepositorySystem.readArtifactDescriptor(DefaultRepositorySystem.java:243)
	at org.apache.maven.shared.transfer.artifact.resolve.internal.Maven30ArtifactResolver.resolveArtifact(Maven30ArtifactResolver.java:104)
	at org.apache.maven.shared.transfer.artifact.resolve.internal.Maven30ArtifactResolver.resolveArtifact(Maven30ArtifactResolver.java:80)
	at org.apache.maven.shared.transfer.artifact.resolve.internal.DefaultArtifactResolver.resolveArtifact(DefaultArtifactResolver.java:75)
	at org.apache.maven.archetype.downloader.DefaultDownloader.download(DefaultDownloader.java:80)
	at org.apache.maven.archetype.common.DefaultArchetypeArtifactManager.exists(DefaultArchetypeArtifactManager.java:247)
	at org.apache.maven.archetype.generator.DefaultArchetypeGenerator.getArchetypeFile(DefaultArchetypeGenerator.java:84)
	at org.apache.maven.archetype.generator.DefaultArchetypeGenerator.generateArchetype(DefaultArchetypeGenerator.java:161)
	at org.apache.maven.archetype.generator.DefaultArchetypeGeneratorTest.generateProjectFromArchetype(DefaultArchetypeGeneratorTest.java:93)
	at org.apache.maven.archetype.generator.DefaultArchetypeGeneratorTest.testGenerateArchetypePartialWithoutPoms(DefaultArchetypeGeneratorTest.java:280)
	at sun.reflect.NativeMethodAccessorImpl.invoke0(Native Method)
	at sun.reflect.NativeMethodAccessorImpl.invoke(NativeMethodAccessorImpl.java:57)
	at sun.reflect.DelegatingMethodAccessorImpl.invoke(DelegatingMethodAccessorImpl.java:43)
	at java.lang.reflect.Method.invoke(Method.java:606)
	at junit.framework.TestCase.runTest(TestCase.java:176)
	at junit.framework.TestCase.runBare(TestCase.java:141)
	at junit.framework.TestResult$1.protect(TestResult.java:122)
	at junit.framework.TestResult.runProtected(TestResult.java:142)
	at junit.framework.TestResult.run(TestResult.java:125)
	at junit.framework.TestCase.run(TestCase.java:129)
	at junit.framework.TestSuite.runTest(TestSuite.java:255)
	at junit.framework.TestSuite.run(TestSuite.java:250)
	at org.junit.internal.runners.JUnit38ClassRunner.run(JUnit38ClassRunner.java:84)
	at org.apache.maven.surefire.junit4.JUnit4Provider.execute(JUnit4Provider.java:365)
	at org.apache.maven.surefire.junit4.JUnit4Provider.executeWithRerun(JUnit4Provider.java:273)
	at org.apache.maven.surefire.junit4.JUnit4Provider.executeTestSet(JUnit4Provider.java:238)
	at org.apache.maven.surefire.junit4.JUnit4Provider.invoke(JUnit4Provider.java:159)
	at org.apache.maven.surefire.booter.ForkedBooter.invokeProviderInSameClassLoader(ForkedBooter.java:379)
	at org.apache.maven.surefire.booter.ForkedBooter.runSuitesInProcess(ForkedBooter.java:340)
	at org.apache.maven.surefire.booter.ForkedBooter.execute(ForkedBooter.java:125)
	at org.apache.maven.surefire.booter.ForkedBooter.main(ForkedBooter.java:413)
Caused by: java.lang.ClassNotFoundException: org.sonatype.aether.util.ConfigUtils
	at java.net.URLClassLoader$1.run(URLClassLoader.java:366)
	at java.net.URLClassLoader$1.run(URLClassLoader.java:355)
	at java.security.AccessController.doPrivileged(Native Method)
	at java.net.URLClassLoader.findClass(URLClassLoader.java:354)
	at java.lang.ClassLoader.loadClass(ClassLoader.java:425)
	at sun.misc.Launcher$AppClassLoader.loadClass(Launcher.java:308)
	at java.lang.ClassLoader.loadClass(ClassLoader.java:358)
	... 39 more


FAILED:  org.apache.maven.archetype.generator.DefaultArchetypeGeneratorTest.windows-jdk7-m3.2.x_build / Build windows-jdk7-m3.2.x_build / testGenerateArchetypeCompleteWithParent

Error Message:
org/sonatype/aether/util/ConfigUtils

Stack Trace:
java.lang.NoClassDefFoundError: org/sonatype/aether/util/ConfigUtils
	at org.sonatype.aether.connector.file.ParallelRepositoryConnector.initExecutor(ParallelRepositoryConnector.java:50)
	at org.sonatype.aether.connector.file.FileRepositoryConnector.<init>(FileRepositoryConnector.java:59)
	at org.sonatype.aether.connector.file.FileRepositoryConnectorFactory.newInstance(FileRepositoryConnectorFactory.java:94)
	at org.sonatype.aether.impl.internal.DefaultRemoteRepositoryManager.getRepositoryConnector(DefaultRemoteRepositoryManager.java:316)
	at org.sonatype.aether.impl.internal.DefaultArtifactResolver.resolveArtifacts(DefaultArtifactResolver.java:403)
	at org.sonatype.aether.impl.internal.DefaultArtifactResolver.resolveArtifact(DefaultArtifactResolver.java:190)
	at org.apache.maven.repository.internal.DefaultArtifactDescriptorReader.loadPom(DefaultArtifactDescriptorReader.java:259)
	at org.apache.maven.repository.internal.DefaultArtifactDescriptorReader.readArtifactDescriptor(DefaultArtifactDescriptorReader.java:170)
	at org.sonatype.aether.impl.internal.DefaultRepositorySystem.readArtifactDescriptor(DefaultRepositorySystem.java:243)
	at org.apache.maven.shared.transfer.artifact.resolve.internal.Maven30ArtifactResolver.resolveArtifact(Maven30ArtifactResolver.java:104)
	at org.apache.maven.shared.transfer.artifact.resolve.internal.Maven30ArtifactResolver.resolveArtifact(Maven30ArtifactResolver.java:80)
	at org.apache.maven.shared.transfer.artifact.resolve.internal.DefaultArtifactResolver.resolveArtifact(DefaultArtifactResolver.java:75)
	at org.apache.maven.archetype.downloader.DefaultDownloader.download(DefaultDownloader.java:80)
	at org.apache.maven.archetype.common.DefaultArchetypeArtifactManager.exists(DefaultArchetypeArtifactManager.java:247)
	at org.apache.maven.archetype.generator.DefaultArchetypeGenerator.getArchetypeFile(DefaultArchetypeGenerator.java:84)
	at org.apache.maven.archetype.generator.DefaultArchetypeGenerator.generateArchetype(DefaultArchetypeGenerator.java:161)
	at org.apache.maven.archetype.generator.DefaultArchetypeGeneratorTest.generateProjectFromArchetype(DefaultArchetypeGeneratorTest.java:93)
	at org.apache.maven.archetype.generator.DefaultArchetypeGeneratorTest.testGenerateArchetypeCompleteWithParent(DefaultArchetypeGeneratorTest.java:172)
	at sun.reflect.NativeMethodAccessorImpl.invoke0(Native Method)
	at sun.reflect.NativeMethodAccessorImpl.invoke(NativeMethodAccessorImpl.java:57)
	at sun.reflect.DelegatingMethodAccessorImpl.invoke(DelegatingMethodAccessorImpl.java:43)
	at java.lang.reflect.Method.invoke(Method.java:606)
	at junit.framework.TestCase.runTest(TestCase.java:176)
	at junit.framework.TestCase.runBare(TestCase.java:141)
	at junit.framework.TestResult$1.protect(TestResult.java:122)
	at junit.framework.TestResult.runProtected(TestResult.java:142)
	at junit.framework.TestResult.run(TestResult.java:125)
	at junit.framework.TestCase.run(TestCase.java:129)
	at junit.framework.TestSuite.runTest(TestSuite.java:255)
	at junit.framework.TestSuite.run(TestSuite.java:250)
	at org.junit.internal.runners.JUnit38ClassRunner.run(JUnit38ClassRunner.java:84)
	at org.apache.maven.surefire.junit4.JUnit4Provider.execute(JUnit4Provider.java:365)
	at org.apache.maven.surefire.junit4.JUnit4Provider.executeWithRerun(JUnit4Provider.java:273)
	at org.apache.maven.surefire.junit4.JUnit4Provider.executeTestSet(JUnit4Provider.java:238)
	at org.apache.maven.surefire.junit4.JUnit4Provider.invoke(JUnit4Provider.java:159)
	at org.apache.maven.surefire.booter.ForkedBooter.invokeProviderInSameClassLoader(ForkedBooter.java:379)
	at org.apache.maven.surefire.booter.ForkedBooter.runSuitesInProcess(ForkedBooter.java:340)
	at org.apache.maven.surefire.booter.ForkedBooter.execute(ForkedBooter.java:125)
	at org.apache.maven.surefire.booter.ForkedBooter.main(ForkedBooter.java:413)


FAILED:  org.apache.maven.archetype.generator.DefaultArchetypeGeneratorTest.windows-jdk7-m3.2.x_build / Build windows-jdk7-m3.2.x_build / testGenerateArchetypePartialOnChild

Error Message:
org/sonatype/aether/util/ConfigUtils

Stack Trace:
java.lang.NoClassDefFoundError: org/sonatype/aether/util/ConfigUtils
	at org.sonatype.aether.connector.file.ParallelRepositoryConnector.initExecutor(ParallelRepositoryConnector.java:50)
	at org.sonatype.aether.connector.file.FileRepositoryConnector.<init>(FileRepositoryConnector.java:59)
	at org.sonatype.aether.connector.file.FileRepositoryConnectorFactory.newInstance(FileRepositoryConnectorFactory.java:94)
	at org.sonatype.aether.impl.internal.DefaultRemoteRepositoryManager.getRepositoryConnector(DefaultRemoteRepositoryManager.java:316)
	at org.sonatype.aether.impl.internal.DefaultArtifactResolver.resolveArtifacts(DefaultArtifactResolver.java:403)
	at org.sonatype.aether.impl.internal.DefaultArtifactResolver.resolveArtifact(DefaultArtifactResolver.java:190)
	at org.apache.maven.repository.internal.DefaultArtifactDescriptorReader.loadPom(DefaultArtifactDescriptorReader.java:259)
	at org.apache.maven.repository.internal.DefaultArtifactDescriptorReader.readArtifactDescriptor(DefaultArtifactDescriptorReader.java:170)
	at org.sonatype.aether.impl.internal.DefaultRepositorySystem.readArtifactDescriptor(DefaultRepositorySystem.java:243)
	at org.apache.maven.shared.transfer.artifact.resolve.internal.Maven30ArtifactResolver.resolveArtifact(Maven30ArtifactResolver.java:104)
	at org.apache.maven.shared.transfer.artifact.resolve.internal.Maven30ArtifactResolver.resolveArtifact(Maven30ArtifactResolver.java:80)
	at org.apache.maven.shared.transfer.artifact.resolve.internal.DefaultArtifactResolver.resolveArtifact(DefaultArtifactResolver.java:75)
	at org.apache.maven.archetype.downloader.DefaultDownloader.download(DefaultDownloader.java:80)
	at org.apache.maven.archetype.common.DefaultArchetypeArtifactManager.exists(DefaultArchetypeArtifactManager.java:247)
	at org.apache.maven.archetype.generator.DefaultArchetypeGenerator.getArchetypeFile(DefaultArchetypeGenerator.java:84)
	at org.apache.maven.archetype.generator.DefaultArchetypeGenerator.generateArchetype(DefaultArchetypeGenerator.java:161)
	at org.apache.maven.archetype.generator.DefaultArchetypeGeneratorTest.generateProjectFromArchetype(DefaultArchetypeGeneratorTest.java:93)
	at org.apache.maven.archetype.generator.DefaultArchetypeGeneratorTest.testGenerateArchetypePartialOnChild(DefaultArchetypeGeneratorTest.java:203)
	at sun.reflect.NativeMethodAccessorImpl.invoke0(Native Method)
	at sun.reflect.NativeMethodAccessorImpl.invoke(NativeMethodAccessorImpl.java:57)
	at sun.reflect.DelegatingMethodAccessorImpl.invoke(DelegatingMethodAccessorImpl.java:43)
	at java.lang.reflect.Method.invoke(Method.java:606)
	at junit.framework.TestCase.runTest(TestCase.java:176)
	at junit.framework.TestCase.runBare(TestCase.java:141)
	at junit.framework.TestResult$1.protect(TestResult.java:122)
	at junit.framework.TestResult.runProtected(TestResult.java:142)
	at junit.framework.TestResult.run(TestResult.java:125)
	at junit.framework.TestCase.run(TestCase.java:129)
	at junit.framework.TestSuite.runTest(TestSuite.java:255)
	at junit.framework.TestSuite.run(TestSuite.java:250)
	at org.junit.internal.runners.JUnit38ClassRunner.run(JUnit38ClassRunner.java:84)
	at org.apache.maven.surefire.junit4.JUnit4Provider.execute(JUnit4Provider.java:365)
	at org.apache.maven.surefire.junit4.JUnit4Provider.executeWithRerun(JUnit4Provider.java:273)
	at org.apache.maven.surefire.junit4.JUnit4Provider.executeTestSet(JUnit4Provider.java:238)
	at org.apache.maven.surefire.junit4.JUnit4Provider.invoke(JUnit4Provider.java:159)
	at org.apache.maven.surefire.booter.ForkedBooter.invokeProviderInSameClassLoader(ForkedBooter.java:379)
	at org.apache.maven.surefire.booter.ForkedBooter.runSuitesInProcess(ForkedBooter.java:340)
	at org.apache.maven.surefire.booter.ForkedBooter.execute(ForkedBooter.java:125)
	at org.apache.maven.surefire.booter.ForkedBooter.main(ForkedBooter.java:413)


FAILED:  org.apache.maven.archetype.generator.DefaultArchetypeGeneratorTest.windows-jdk7-m3.2.x_build / Build windows-jdk7-m3.2.x_build / testPropertiesNotDefined

Error Message:
org/sonatype/aether/util/ConfigUtils

Stack Trace:
java.lang.NoClassDefFoundError: org/sonatype/aether/util/ConfigUtils
	at org.sonatype.aether.connector.file.ParallelRepositoryConnector.initExecutor(ParallelRepositoryConnector.java:50)
	at org.sonatype.aether.connector.file.FileRepositoryConnector.<init>(FileRepositoryConnector.java:59)
	at org.sonatype.aether.connector.file.FileRepositoryConnectorFactory.newInstance(FileRepositoryConnectorFactory.java:94)
	at org.sonatype.aether.impl.internal.DefaultRemoteRepositoryManager.getRepositoryConnector(DefaultRemoteRepositoryManager.java:316)
	at org.sonatype.aether.impl.internal.DefaultArtifactResolver.resolveArtifacts(DefaultArtifactResolver.java:403)
	at org.sonatype.aether.impl.internal.DefaultArtifactResolver.resolveArtifact(DefaultArtifactResolver.java:190)
	at org.apache.maven.repository.internal.DefaultArtifactDescriptorReader.loadPom(DefaultArtifactDescriptorReader.java:259)
	at org.apache.maven.repository.internal.DefaultArtifactDescriptorReader.readArtifactDescriptor(DefaultArtifactDescriptorReader.java:170)
	at org.sonatype.aether.impl.internal.DefaultRepositorySystem.readArtifactDescriptor(DefaultRepositorySystem.java:243)
	at org.apache.maven.shared.transfer.artifact.resolve.internal.Maven30ArtifactResolver.resolveArtifact(Maven30ArtifactResolver.java:104)
	at org.apache.maven.shared.transfer.artifact.resolve.internal.Maven30ArtifactResolver.resolveArtifact(Maven30ArtifactResolver.java:80)
	at org.apache.maven.shared.transfer.artifact.resolve.internal.DefaultArtifactResolver.resolveArtifact(DefaultArtifactResolver.java:75)
	at org.apache.maven.archetype.downloader.DefaultDownloader.download(DefaultDownloader.java:80)
	at org.apache.maven.archetype.common.DefaultArchetypeArtifactManager.exists(DefaultArchetypeArtifactManager.java:247)
	at org.apache.maven.archetype.generator.DefaultArchetypeGenerator.getArchetypeFile(DefaultArchetypeGenerator.java:84)
	at org.apache.maven.archetype.generator.DefaultArchetypeGenerator.generateArchetype(DefaultArchetypeGenerator.java:161)
	at org.apache.maven.archetype.generator.DefaultArchetypeGeneratorTest.generateProjectFromArchetypeWithFailure(DefaultArchetypeGeneratorTest.java:106)
	at org.apache.maven.archetype.generator.DefaultArchetypeGeneratorTest.testPropertiesNotDefined(DefaultArchetypeGeneratorTest.java:426)
	at sun.reflect.NativeMethodAccessorImpl.invoke0(Native Method)
	at sun.reflect.NativeMethodAccessorImpl.invoke(NativeMethodAccessorImpl.java:57)
	at sun.reflect.DelegatingMethodAccessorImpl.invoke(DelegatingMethodAccessorImpl.java:43)
	at java.lang.reflect.Method.invoke(Method.java:606)
	at junit.framework.TestCase.runTest(TestCase.java:176)
	at junit.framework.TestCase.runBare(TestCase.java:141)
	at junit.framework.TestResult$1.protect(TestResult.java:122)
	at junit.framework.TestResult.runProtected(TestResult.java:142)
	at junit.framework.TestResult.run(TestResult.java:125)
	at junit.framework.TestCase.run(TestCase.java:129)
	at junit.framework.TestSuite.runTest(TestSuite.java:255)
	at junit.framework.TestSuite.run(TestSuite.java:250)
	at org.junit.internal.runners.JUnit38ClassRunner.run(JUnit38ClassRunner.java:84)
	at org.apache.maven.surefire.junit4.JUnit4Provider.execute(JUnit4Provider.java:365)
	at org.apache.maven.surefire.junit4.JUnit4Provider.executeWithRerun(JUnit4Provider.java:273)
	at org.apache.maven.surefire.junit4.JUnit4Provider.executeTestSet(JUnit4Provider.java:238)
	at org.apache.maven.surefire.junit4.JUnit4Provider.invoke(JUnit4Provider.java:159)
	at org.apache.maven.surefire.booter.ForkedBooter.invokeProviderInSameClassLoader(ForkedBooter.java:379)
	at org.apache.maven.surefire.booter.ForkedBooter.runSuitesInProcess(ForkedBooter.java:340)
	at org.apache.maven.surefire.booter.ForkedBooter.execute(ForkedBooter.java:125)
	at org.apache.maven.surefire.booter.ForkedBooter.main(ForkedBooter.java:413)


FAILED:  org.apache.maven.archetype.generator.DefaultArchetypeGeneratorTest.windows-jdk7-m3.2.x_build / Build windows-jdk7-m3.2.x_build / testGenerateArchetypeSite

Error Message:
org/sonatype/aether/util/ConfigUtils

Stack Trace:
java.lang.NoClassDefFoundError: org/sonatype/aether/util/ConfigUtils
	at org.sonatype.aether.connector.file.ParallelRepositoryConnector.initExecutor(ParallelRepositoryConnector.java:50)
	at org.sonatype.aether.connector.file.FileRepositoryConnector.<init>(FileRepositoryConnector.java:59)
	at org.sonatype.aether.connector.file.FileRepositoryConnectorFactory.newInstance(FileRepositoryConnectorFactory.java:94)
	at org.sonatype.aether.impl.internal.DefaultRemoteRepositoryManager.getRepositoryConnector(DefaultRemoteRepositoryManager.java:316)
	at org.sonatype.aether.impl.internal.DefaultArtifactResolver.resolveArtifacts(DefaultArtifactResolver.java:403)
	at org.sonatype.aether.impl.internal.DefaultArtifactResolver.resolveArtifact(DefaultArtifactResolver.java:190)
	at org.apache.maven.repository.internal.DefaultArtifactDescriptorReader.loadPom(DefaultArtifactDescriptorReader.java:259)
	at org.apache.maven.repository.internal.DefaultArtifactDescriptorReader.readArtifactDescriptor(DefaultArtifactDescriptorReader.java:170)
	at org.sonatype.aether.impl.internal.DefaultRepositorySystem.readArtifactDescriptor(DefaultRepositorySystem.java:243)
	at org.apache.maven.shared.transfer.artifact.resolve.internal.Maven30ArtifactResolver.resolveArtifact(Maven30ArtifactResolver.java:104)
	at org.apache.maven.shared.transfer.artifact.resolve.internal.Maven30ArtifactResolver.resolveArtifact(Maven30ArtifactResolver.java:80)
	at org.apache.maven.shared.transfer.artifact.resolve.internal.DefaultArtifactResolver.resolveArtifact(DefaultArtifactResolver.java:75)
	at org.apache.maven.archetype.downloader.DefaultDownloader.download(DefaultDownloader.java:80)
	at org.apache.maven.archetype.common.DefaultArchetypeArtifactManager.exists(DefaultArchetypeArtifactManager.java:247)
	at org.apache.maven.archetype.generator.DefaultArchetypeGenerator.getArchetypeFile(DefaultArchetypeGenerator.java:84)
	at org.apache.maven.archetype.generator.DefaultArchetypeGenerator.generateArchetype(DefaultArchetypeGenerator.java:161)
	at org.apache.maven.archetype.generator.DefaultArchetypeGeneratorTest.generateProjectFromArchetype(DefaultArchetypeGeneratorTest.java:93)
	at org.apache.maven.archetype.generator.DefaultArchetypeGeneratorTest.testGenerateArchetypeSite(DefaultArchetypeGeneratorTest.java:300)
	at sun.reflect.NativeMethodAccessorImpl.invoke0(Native Method)
	at sun.reflect.NativeMethodAccessorImpl.invoke(NativeMethodAccessorImpl.java:57)
	at sun.reflect.DelegatingMethodAccessorImpl.invoke(DelegatingMethodAccessorImpl.java:43)
	at java.lang.reflect.Method.invoke(Method.java:606)
	at junit.framework.TestCase.runTest(TestCase.java:176)
	at junit.framework.TestCase.runBare(TestCase.java:141)
	at junit.framework.TestResult$1.protect(TestResult.java:122)
	at junit.framework.TestResult.runProtected(TestResult.java:142)
	at junit.framework.TestResult.run(TestResult.java:125)
	at junit.framework.TestCase.run(TestCase.java:129)
	at junit.framework.TestSuite.runTest(TestSuite.java:255)
	at junit.framework.TestSuite.run(TestSuite.java:250)
	at org.junit.internal.runners.JUnit38ClassRunner.run(JUnit38ClassRunner.java:84)
	at org.apache.maven.surefire.junit4.JUnit4Provider.execute(JUnit4Provider.java:365)
	at org.apache.maven.surefire.junit4.JUnit4Provider.executeWithRerun(JUnit4Provider.java:273)
	at org.apache.maven.surefire.junit4.JUnit4Provider.executeTestSet(JUnit4Provider.java:238)
	at org.apache.maven.surefire.junit4.JUnit4Provider.invoke(JUnit4Provider.java:159)
	at org.apache.maven.surefire.booter.ForkedBooter.invokeProviderInSameClassLoader(ForkedBooter.java:379)
	at org.apache.maven.surefire.booter.ForkedBooter.runSuitesInProcess(ForkedBooter.java:340)
	at org.apache.maven.surefire.booter.ForkedBooter.execute(ForkedBooter.java:125)
	at org.apache.maven.surefire.booter.ForkedBooter.main(ForkedBooter.java:413)


FAILED:  org.apache.maven.archetype.generator.DefaultArchetypeGeneratorTest.windows-jdk7-m3.2.x_build / Build windows-jdk7-m3.2.x_build / testGenerateArchetypeCompleteWithoutParent

Error Message:
org/sonatype/aether/util/ConfigUtils

Stack Trace:
java.lang.NoClassDefFoundError: org/sonatype/aether/util/ConfigUtils
	at org.sonatype.aether.connector.file.ParallelRepositoryConnector.initExecutor(ParallelRepositoryConnector.java:50)
	at org.sonatype.aether.connector.file.FileRepositoryConnector.<init>(FileRepositoryConnector.java:59)
	at org.sonatype.aether.connector.file.FileRepositoryConnectorFactory.newInstance(FileRepositoryConnectorFactory.java:94)
	at org.sonatype.aether.impl.internal.DefaultRemoteRepositoryManager.getRepositoryConnector(DefaultRemoteRepositoryManager.java:316)
	at org.sonatype.aether.impl.internal.DefaultArtifactResolver.resolveArtifacts(DefaultArtifactResolver.java:403)
	at org.sonatype.aether.impl.internal.DefaultArtifactResolver.resolveArtifact(DefaultArtifactResolver.java:190)
	at org.apache.maven.repository.internal.DefaultArtifactDescriptorReader.loadPom(DefaultArtifactDescriptorReader.java:259)
	at org.apache.maven.repository.internal.DefaultArtifactDescriptorReader.readArtifactDescriptor(DefaultArtifactDescriptorReader.java:170)
	at org.sonatype.aether.impl.internal.DefaultRepositorySystem.readArtifactDescriptor(DefaultRepositorySystem.java:243)
	at org.apache.maven.shared.transfer.artifact.resolve.internal.Maven30ArtifactResolver.resolveArtifact(Maven30ArtifactResolver.java:104)
	at org.apache.maven.shared.transfer.artifact.resolve.internal.Maven30ArtifactResolver.resolveArtifact(Maven30ArtifactResolver.java:80)
	at org.apache.maven.shared.transfer.artifact.resolve.internal.DefaultArtifactResolver.resolveArtifact(DefaultArtifactResolver.java:75)
	at org.apache.maven.archetype.downloader.DefaultDownloader.download(DefaultDownloader.java:80)
	at org.apache.maven.archetype.common.DefaultArchetypeArtifactManager.exists(DefaultArchetypeArtifactManager.java:247)
	at org.apache.maven.archetype.generator.DefaultArchetypeGenerator.getArchetypeFile(DefaultArchetypeGenerator.java:84)
	at org.apache.maven.archetype.generator.DefaultArchetypeGenerator.generateArchetype(DefaultArchetypeGenerator.java:161)
	at org.apache.maven.archetype.generator.DefaultArchetypeGeneratorTest.generateProjectFromArchetype(DefaultArchetypeGeneratorTest.java:93)
	at org.apache.maven.archetype.generator.DefaultArchetypeGeneratorTest.testGenerateArchetypeCompleteWithoutParent(DefaultArchetypeGeneratorTest.java:139)
	at sun.reflect.NativeMethodAccessorImpl.invoke0(Native Method)
	at sun.reflect.NativeMethodAccessorImpl.invoke(NativeMethodAccessorImpl.java:57)
	at sun.reflect.DelegatingMethodAccessorImpl.invoke(DelegatingMethodAccessorImpl.java:43)
	at java.lang.reflect.Method.invoke(Method.java:606)
	at junit.framework.TestCase.runTest(TestCase.java:176)
	at junit.framework.TestCase.runBare(TestCase.java:141)
	at junit.framework.TestResult$1.protect(TestResult.java:122)
	at junit.framework.TestResult.runProtected(TestResult.java:142)
	at junit.framework.TestResult.run(TestResult.java:125)
	at junit.framework.TestCase.run(TestCase.java:129)
	at junit.framework.TestSuite.runTest(TestSuite.java:255)
	at junit.framework.TestSuite.run(TestSuite.java:250)
	at org.junit.internal.runners.JUnit38ClassRunner.run(JUnit38ClassRunner.java:84)
	at org.apache.maven.surefire.junit4.JUnit4Provider.execute(JUnit4Provider.java:365)
	at org.apache.maven.surefire.junit4.JUnit4Provider.executeWithRerun(JUnit4Provider.java:273)
	at org.apache.maven.surefire.junit4.JUnit4Provider.executeTestSet(JUnit4Provider.java:238)
	at org.apache.maven.surefire.junit4.JUnit4Provider.invoke(JUnit4Provider.java:159)
	at org.apache.maven.surefire.booter.ForkedBooter.invokeProviderInSameClassLoader(ForkedBooter.java:379)
	at org.apache.maven.surefire.booter.ForkedBooter.runSuitesInProcess(ForkedBooter.java:340)
	at org.apache.maven.surefire.booter.ForkedBooter.execute(ForkedBooter.java:125)
	at org.apache.maven.surefire.booter.ForkedBooter.main(ForkedBooter.java:413)


FAILED:  org.apache.maven.archetype.generator.DefaultArchetypeGeneratorTest.windows-jdk7-m3.2.x_build / Build windows-jdk7-m3.2.x_build / testGenerateOldArchetype

Error Message:
org/sonatype/aether/util/ConfigUtils

Stack Trace:
java.lang.NoClassDefFoundError: org/sonatype/aether/util/ConfigUtils
	at org.sonatype.aether.connector.file.ParallelRepositoryConnector.initExecutor(ParallelRepositoryConnector.java:50)
	at org.sonatype.aether.connector.file.FileRepositoryConnector.<init>(FileRepositoryConnector.java:59)
	at org.sonatype.aether.connector.file.FileRepositoryConnectorFactory.newInstance(FileRepositoryConnectorFactory.java:94)
	at org.sonatype.aether.impl.internal.DefaultRemoteRepositoryManager.getRepositoryConnector(DefaultRemoteRepositoryManager.java:316)
	at org.sonatype.aether.impl.internal.DefaultArtifactResolver.resolveArtifacts(DefaultArtifactResolver.java:403)
	at org.sonatype.aether.impl.internal.DefaultArtifactResolver.resolveArtifact(DefaultArtifactResolver.java:190)
	at org.apache.maven.repository.internal.DefaultArtifactDescriptorReader.loadPom(DefaultArtifactDescriptorReader.java:259)
	at org.apache.maven.repository.internal.DefaultArtifactDescriptorReader.readArtifactDescriptor(DefaultArtifactDescriptorReader.java:170)
	at org.sonatype.aether.impl.internal.DefaultRepositorySystem.readArtifactDescriptor(DefaultRepositorySystem.java:243)
	at org.apache.maven.shared.transfer.artifact.resolve.internal.Maven30ArtifactResolver.resolveArtifact(Maven30ArtifactResolver.java:104)
	at org.apache.maven.shared.transfer.artifact.resolve.internal.Maven30ArtifactResolver.resolveArtifact(Maven30ArtifactResolver.java:80)
	at org.apache.maven.shared.transfer.artifact.resolve.internal.DefaultArtifactResolver.resolveArtifact(DefaultArtifactResolver.java:75)
	at org.apache.maven.archetype.downloader.DefaultDownloader.download(DefaultDownloader.java:80)
	at org.apache.maven.archetype.common.DefaultArchetypeArtifactManager.exists(DefaultArchetypeArtifactManager.java:247)
	at org.apache.maven.archetype.generator.DefaultArchetypeGenerator.getArchetypeFile(DefaultArchetypeGenerator.java:84)
	at org.apache.maven.archetype.generator.DefaultArchetypeGenerator.generateArchetype(DefaultArchetypeGenerator.java:161)
	at org.apache.maven.archetype.generator.DefaultArchetypeGeneratorTest.generateProjectFromArchetype(DefaultArchetypeGeneratorTest.java:93)
	at org.apache.maven.archetype.generator.DefaultArchetypeGeneratorTest.testGenerateOldArchetype(DefaultArchetypeGeneratorTest.java:404)
	at sun.reflect.NativeMethodAccessorImpl.invoke0(Native Method)
	at sun.reflect.NativeMethodAccessorImpl.invoke(NativeMethodAccessorImpl.java:57)
	at sun.reflect.DelegatingMethodAccessorImpl.invoke(DelegatingMethodAccessorImpl.java:43)
	at java.lang.reflect.Method.invoke(Method.java:606)
	at junit.framework.TestCase.runTest(TestCase.java:176)
	at junit.framework.TestCase.runBare(TestCase.java:141)
	at junit.framework.TestResult$1.protect(TestResult.java:122)
	at junit.framework.TestResult.runProtected(TestResult.java:142)
	at junit.framework.TestResult.run(TestResult.java:125)
	at junit.framework.TestCase.run(TestCase.java:129)
	at junit.framework.TestSuite.runTest(TestSuite.java:255)
	at junit.framework.TestSuite.run(TestSuite.java:250)
	at org.junit.internal.runners.JUnit38ClassRunner.run(JUnit38ClassRunner.java:84)
	at org.apache.maven.surefire.junit4.JUnit4Provider.execute(JUnit4Provider.java:365)
	at org.apache.maven.surefire.junit4.JUnit4Provider.executeWithRerun(JUnit4Provider.java:273)
	at org.apache.maven.surefire.junit4.JUnit4Provider.executeTestSet(JUnit4Provider.java:238)
	at org.apache.maven.surefire.junit4.JUnit4Provider.invoke(JUnit4Provider.java:159)
	at org.apache.maven.surefire.booter.ForkedBooter.invokeProviderInSameClassLoader(ForkedBooter.java:379)
	at org.apache.maven.surefire.booter.ForkedBooter.runSuitesInProcess(ForkedBooter.java:340)
	at org.apache.maven.surefire.booter.ForkedBooter.execute(ForkedBooter.java:125)
	at org.apache.maven.surefire.booter.ForkedBooter.main(ForkedBooter.java:413)


FAILED:  org.apache.maven.archetype.generator.DefaultArchetypeGeneratorTest.windows-jdk7-m3.2.x_build / Build windows-jdk7-m3.2.x_build / testGenerateArchetypePartialOnChildDontOverride

Error Message:
org/sonatype/aether/util/ConfigUtils

Stack Trace:
java.lang.NoClassDefFoundError: org/sonatype/aether/util/ConfigUtils
	at org.sonatype.aether.connector.file.ParallelRepositoryConnector.initExecutor(ParallelRepositoryConnector.java:50)
	at org.sonatype.aether.connector.file.FileRepositoryConnector.<init>(FileRepositoryConnector.java:59)
	at org.sonatype.aether.connector.file.FileRepositoryConnectorFactory.newInstance(FileRepositoryConnectorFactory.java:94)
	at org.sonatype.aether.impl.internal.DefaultRemoteRepositoryManager.getRepositoryConnector(DefaultRemoteRepositoryManager.java:316)
	at org.sonatype.aether.impl.internal.DefaultArtifactResolver.resolveArtifacts(DefaultArtifactResolver.java:403)
	at org.sonatype.aether.impl.internal.DefaultArtifactResolver.resolveArtifact(DefaultArtifactResolver.java:190)
	at org.apache.maven.repository.internal.DefaultArtifactDescriptorReader.loadPom(DefaultArtifactDescriptorReader.java:259)
	at org.apache.maven.repository.internal.DefaultArtifactDescriptorReader.readArtifactDescriptor(DefaultArtifactDescriptorReader.java:170)
	at org.sonatype.aether.impl.internal.DefaultRepositorySystem.readArtifactDescriptor(DefaultRepositorySystem.java:243)
	at org.apache.maven.shared.transfer.artifact.resolve.internal.Maven30ArtifactResolver.resolveArtifact(Maven30ArtifactResolver.java:104)
	at org.apache.maven.shared.transfer.artifact.resolve.internal.Maven30ArtifactResolver.resolveArtifact(Maven30ArtifactResolver.java:80)
	at org.apache.maven.shared.transfer.artifact.resolve.internal.DefaultArtifactResolver.resolveArtifact(DefaultArtifactResolver.java:75)
	at org.apache.maven.archetype.downloader.DefaultDownloader.download(DefaultDownloader.java:80)
	at org.apache.maven.archetype.common.DefaultArchetypeArtifactManager.exists(DefaultArchetypeArtifactManager.java:247)
	at org.apache.maven.archetype.generator.DefaultArchetypeGenerator.getArchetypeFile(DefaultArchetypeGenerator.java:84)
	at org.apache.maven.archetype.generator.DefaultArchetypeGenerator.generateArchetype(DefaultArchetypeGenerator.java:161)
	at org.apache.maven.archetype.generator.DefaultArchetypeGeneratorTest.generateProjectFromArchetype(DefaultArchetypeGeneratorTest.java:93)
	at org.apache.maven.archetype.generator.DefaultArchetypeGeneratorTest.testGenerateArchetypePartialOnChildDontOverride(DefaultArchetypeGeneratorTest.java:229)
	at sun.reflect.NativeMethodAccessorImpl.invoke0(Native Method)
	at sun.reflect.NativeMethodAccessorImpl.invoke(NativeMethodAccessorImpl.java:57)
	at sun.reflect.DelegatingMethodAccessorImpl.invoke(DelegatingMethodAccessorImpl.java:43)
	at java.lang.reflect.Method.invoke(Method.java:606)
	at junit.framework.TestCase.runTest(TestCase.java:176)
	at junit.framework.TestCase.runBare(TestCase.java:141)
	at junit.framework.TestResult$1.protect(TestResult.java:122)
	at junit.framework.TestResult.runProtected(TestResult.java:142)
	at junit.framework.TestResult.run(TestResult.java:125)
	at junit.framework.TestCase.run(TestCase.java:129)
	at junit.framework.TestSuite.runTest(TestSuite.java:255)
	at junit.framework.TestSuite.run(TestSuite.java:250)
	at org.junit.internal.runners.JUnit38ClassRunner.run(JUnit38ClassRunner.java:84)
	at org.apache.maven.surefire.junit4.JUnit4Provider.execute(JUnit4Provider.java:365)
	at org.apache.maven.surefire.junit4.JUnit4Provider.executeWithRerun(JUnit4Provider.java:273)
	at org.apache.maven.surefire.junit4.JUnit4Provider.executeTestSet(JUnit4Provider.java:238)
	at org.apache.maven.surefire.junit4.JUnit4Provider.invoke(JUnit4Provider.java:159)
	at org.apache.maven.surefire.booter.ForkedBooter.invokeProviderInSameClassLoader(ForkedBooter.java:379)
	at org.apache.maven.surefire.booter.ForkedBooter.runSuitesInProcess(ForkedBooter.java:340)
	at org.apache.maven.surefire.booter.ForkedBooter.execute(ForkedBooter.java:125)
	at org.apache.maven.surefire.booter.ForkedBooter.main(ForkedBooter.java:413)


FAILED:  org.apache.maven.archetype.generator.DefaultArchetypeGeneratorTest.windows-jdk7-m3.2.x_build / Build windows-jdk7-m3.2.x_build / testGenerateArchetypePartialOnParent

Error Message:
org/sonatype/aether/util/ConfigUtils

Stack Trace:
java.lang.NoClassDefFoundError: org/sonatype/aether/util/ConfigUtils
	at org.sonatype.aether.connector.file.ParallelRepositoryConnector.initExecutor(ParallelRepositoryConnector.java:50)
	at org.sonatype.aether.connector.file.FileRepositoryConnector.<init>(FileRepositoryConnector.java:59)
	at org.sonatype.aether.connector.file.FileRepositoryConnectorFactory.newInstance(FileRepositoryConnectorFactory.java:94)
	at org.sonatype.aether.impl.internal.DefaultRemoteRepositoryManager.getRepositoryConnector(DefaultRemoteRepositoryManager.java:316)
	at org.sonatype.aether.impl.internal.DefaultArtifactResolver.resolveArtifacts(DefaultArtifactResolver.java:403)
	at org.sonatype.aether.impl.internal.DefaultArtifactResolver.resolveArtifact(DefaultArtifactResolver.java:190)
	at org.apache.maven.repository.internal.DefaultArtifactDescriptorReader.loadPom(DefaultArtifactDescriptorReader.java:259)
	at org.apache.maven.repository.internal.DefaultArtifactDescriptorReader.readArtifactDescriptor(DefaultArtifactDescriptorReader.java:170)
	at org.sonatype.aether.impl.internal.DefaultRepositorySystem.readArtifactDescriptor(DefaultRepositorySystem.java:243)
	at org.apache.maven.shared.transfer.artifact.resolve.internal.Maven30ArtifactResolver.resolveArtifact(Maven30ArtifactResolver.java:104)
	at org.apache.maven.shared.transfer.artifact.resolve.internal.Maven30ArtifactResolver.resolveArtifact(Maven30ArtifactResolver.java:80)
	at org.apache.maven.shared.transfer.artifact.resolve.internal.DefaultArtifactResolver.resolveArtifact(DefaultArtifactResolver.java:75)
	at org.apache.maven.archetype.downloader.DefaultDownloader.download(DefaultDownloader.java:80)
	at org.apache.maven.archetype.common.DefaultArchetypeArtifactManager.exists(DefaultArchetypeArtifactManager.java:247)
	at org.apache.maven.archetype.generator.DefaultArchetypeGenerator.getArchetypeFile(DefaultArchetypeGenerator.java:84)
	at org.apache.maven.archetype.generator.DefaultArchetypeGenerator.generateArchetype(DefaultArchetypeGenerator.java:161)
	at org.apache.maven.archetype.generator.DefaultArchetypeGeneratorTest.generateProjectFromArchetype(DefaultArchetypeGeneratorTest.java:93)
	at org.apache.maven.archetype.generator.DefaultArchetypeGeneratorTest.testGenerateArchetypePartialOnParent(DefaultArchetypeGeneratorTest.java:258)
	at sun.reflect.NativeMethodAccessorImpl.invoke0(Native Method)
	at sun.reflect.NativeMethodAccessorImpl.invoke(NativeMethodAccessorImpl.java:57)
	at sun.reflect.DelegatingMethodAccessorImpl.invoke(DelegatingMethodAccessorImpl.java:43)
	at java.lang.reflect.Method.invoke(Method.java:606)
	at junit.framework.TestCase.runTest(TestCase.java:176)
	at junit.framework.TestCase.runBare(TestCase.java:141)
	at junit.framework.TestResult$1.protect(TestResult.java:122)
	at junit.framework.TestResult.runProtected(TestResult.java:142)
	at junit.framework.TestResult.run(TestResult.java:125)
	at junit.framework.TestCase.run(TestCase.java:129)
	at junit.framework.TestSuite.runTest(TestSuite.java:255)
	at junit.framework.TestSuite.run(TestSuite.java:250)
	at org.junit.internal.runners.JUnit38ClassRunner.run(JUnit38ClassRunner.java:84)
	at org.apache.maven.surefire.junit4.JUnit4Provider.execute(JUnit4Provider.java:365)
	at org.apache.maven.surefire.junit4.JUnit4Provider.executeWithRerun(JUnit4Provider.java:273)
	at org.apache.maven.surefire.junit4.JUnit4Provider.executeTestSet(JUnit4Provider.java:238)
	at org.apache.maven.surefire.junit4.JUnit4Provider.invoke(JUnit4Provider.java:159)
	at org.apache.maven.surefire.booter.ForkedBooter.invokeProviderInSameClassLoader(ForkedBooter.java:379)
	at org.apache.maven.surefire.booter.ForkedBooter.runSuitesInProcess(ForkedBooter.java:340)
	at org.apache.maven.surefire.booter.ForkedBooter.execute(ForkedBooter.java:125)
	at org.apache.maven.surefire.booter.ForkedBooter.main(ForkedBooter.java:413)


FAILED:  org.apache.maven.archetype.generator.DefaultArchetypeGeneratorTest.windows-jdk7-m3.2.x_build / Build windows-jdk7-m3.2.x_build / testGenerateFileSetArchetype

Error Message:
org/sonatype/aether/util/ConfigUtils

Stack Trace:
java.lang.NoClassDefFoundError: org/sonatype/aether/util/ConfigUtils
	at org.sonatype.aether.connector.file.ParallelRepositoryConnector.initExecutor(ParallelRepositoryConnector.java:50)
	at org.sonatype.aether.connector.file.FileRepositoryConnector.<init>(FileRepositoryConnector.java:59)
	at org.sonatype.aether.connector.file.FileRepositoryConnectorFactory.newInstance(FileRepositoryConnectorFactory.java:94)
	at org.sonatype.aether.impl.internal.DefaultRemoteRepositoryManager.getRepositoryConnector(DefaultRemoteRepositoryManager.java:316)
	at org.sonatype.aether.impl.internal.DefaultArtifactResolver.resolveArtifacts(DefaultArtifactResolver.java:403)
	at org.sonatype.aether.impl.internal.DefaultArtifactResolver.resolveArtifact(DefaultArtifactResolver.java:190)
	at org.apache.maven.repository.internal.DefaultArtifactDescriptorReader.loadPom(DefaultArtifactDescriptorReader.java:259)
	at org.apache.maven.repository.internal.DefaultArtifactDescriptorReader.readArtifactDescriptor(DefaultArtifactDescriptorReader.java:170)
	at org.sonatype.aether.impl.internal.DefaultRepositorySystem.readArtifactDescriptor(DefaultRepositorySystem.java:243)
	at org.apache.maven.shared.transfer.artifact.resolve.internal.Maven30ArtifactResolver.resolveArtifact(Maven30ArtifactResolver.java:104)
	at org.apache.maven.shared.transfer.artifact.resolve.internal.Maven30ArtifactResolver.resolveArtifact(Maven30ArtifactResolver.java:80)
	at org.apache.maven.shared.transfer.artifact.resolve.internal.DefaultArtifactResolver.resolveArtifact(DefaultArtifactResolver.java:75)
	at org.apache.maven.archetype.downloader.DefaultDownloader.download(DefaultDownloader.java:80)
	at org.apache.maven.archetype.common.DefaultArchetypeArtifactManager.exists(DefaultArchetypeArtifactManager.java:247)
	at org.apache.maven.archetype.generator.DefaultArchetypeGenerator.getArchetypeFile(DefaultArchetypeGenerator.java:84)
	at org.apache.maven.archetype.generator.DefaultArchetypeGenerator.generateArchetype(DefaultArchetypeGenerator.java:161)
	at org.apache.maven.archetype.generator.DefaultArchetypeGeneratorTest.generateProjectFromArchetype(DefaultArchetypeGeneratorTest.java:93)
	at org.apache.maven.archetype.generator.DefaultArchetypeGeneratorTest.testGenerateFileSetArchetype(DefaultArchetypeGeneratorTest.java:323)
	at sun.reflect.NativeMethodAccessorImpl.invoke0(Native Method)
	at sun.reflect.NativeMethodAccessorImpl.invoke(NativeMethodAccessorImpl.java:57)
	at sun.reflect.DelegatingMethodAccessorImpl.invoke(DelegatingMethodAccessorImpl.java:43)
	at java.lang.reflect.Method.invoke(Method.java:606)
	at junit.framework.TestCase.runTest(TestCase.java:176)
	at junit.framework.TestCase.runBare(TestCase.java:141)
	at junit.framework.TestResult$1.protect(TestResult.java:122)
	at junit.framework.TestResult.runProtected(TestResult.java:142)
	at junit.framework.TestResult.run(TestResult.java:125)
	at junit.framework.TestCase.run(TestCase.java:129)
	at junit.framework.TestSuite.runTest(TestSuite.java:255)
	at junit.framework.TestSuite.run(TestSuite.java:250)
	at org.junit.internal.runners.JUnit38ClassRunner.run(JUnit38ClassRunner.java:84)
	at org.apache.maven.surefire.junit4.JUnit4Provider.execute(JUnit4Provider.java:365)
	at org.apache.maven.surefire.junit4.JUnit4Provider.executeWithRerun(JUnit4Provider.java:273)
	at org.apache.maven.surefire.junit4.JUnit4Provider.executeTestSet(JUnit4Provider.java:238)
	at org.apache.maven.surefire.junit4.JUnit4Provider.invoke(JUnit4Provider.java:159)
	at org.apache.maven.surefire.booter.ForkedBooter.invokeProviderInSameClassLoader(ForkedBooter.java:379)
	at org.apache.maven.surefire.booter.ForkedBooter.runSuitesInProcess(ForkedBooter.java:340)
	at org.apache.maven.surefire.booter.ForkedBooter.execute(ForkedBooter.java:125)
	at org.apache.maven.surefire.booter.ForkedBooter.main(ForkedBooter.java:413)


FAILED:  org.apache.maven.archetype.generator.DefaultArchetypeGeneratorTest.windows-jdk7-m3.2.x_build / Build windows-jdk7-m3.2.x_build / testGenerateArchetypeWithPostScriptIncluded

Error Message:
org/sonatype/aether/util/ConfigUtils

Stack Trace:
java.lang.NoClassDefFoundError: org/sonatype/aether/util/ConfigUtils
	at org.sonatype.aether.connector.file.ParallelRepositoryConnector.initExecutor(ParallelRepositoryConnector.java:50)
	at org.sonatype.aether.connector.file.FileRepositoryConnector.<init>(FileRepositoryConnector.java:59)
	at org.sonatype.aether.connector.file.FileRepositoryConnectorFactory.newInstance(FileRepositoryConnectorFactory.java:94)
	at org.sonatype.aether.impl.internal.DefaultRemoteRepositoryManager.getRepositoryConnector(DefaultRemoteRepositoryManager.java:316)
	at org.sonatype.aether.impl.internal.DefaultArtifactResolver.resolveArtifacts(DefaultArtifactResolver.java:403)
	at org.sonatype.aether.impl.internal.DefaultArtifactResolver.resolveArtifact(DefaultArtifactResolver.java:190)
	at org.apache.maven.repository.internal.DefaultArtifactDescriptorReader.loadPom(DefaultArtifactDescriptorReader.java:259)
	at org.apache.maven.repository.internal.DefaultArtifactDescriptorReader.readArtifactDescriptor(DefaultArtifactDescriptorReader.java:170)
	at org.sonatype.aether.impl.internal.DefaultRepositorySystem.readArtifactDescriptor(DefaultRepositorySystem.java:243)
	at org.apache.maven.shared.transfer.artifact.resolve.internal.Maven30ArtifactResolver.resolveArtifact(Maven30ArtifactResolver.java:104)
	at org.apache.maven.shared.transfer.artifact.resolve.internal.Maven30ArtifactResolver.resolveArtifact(Maven30ArtifactResolver.java:80)
	at org.apache.maven.shared.transfer.artifact.resolve.internal.DefaultArtifactResolver.resolveArtifact(DefaultArtifactResolver.java:75)
	at org.apache.maven.archetype.downloader.DefaultDownloader.download(DefaultDownloader.java:80)
	at org.apache.maven.archetype.common.DefaultArchetypeArtifactManager.exists(DefaultArchetypeArtifactManager.java:247)
	at org.apache.maven.archetype.generator.DefaultArchetypeGenerator.getArchetypeFile(DefaultArchetypeGenerator.java:84)
	at org.apache.maven.archetype.generator.DefaultArchetypeGenerator.generateArchetype(DefaultArchetypeGenerator.java:161)
	at org.apache.maven.archetype.generator.DefaultArchetypeGeneratorTest.generateProjectFromArchetype(DefaultArchetypeGeneratorTest.java:93)
	at org.apache.maven.archetype.generator.DefaultArchetypeGeneratorTest.testGenerateArchetypeWithPostScriptIncluded(DefaultArchetypeGeneratorTest.java:445)
	at sun.reflect.NativeMethodAccessorImpl.invoke0(Native Method)
	at sun.reflect.NativeMethodAccessorImpl.invoke(NativeMethodAccessorImpl.java:57)
	at sun.reflect.DelegatingMethodAccessorImpl.invoke(DelegatingMethodAccessorImpl.java:43)
	at java.lang.reflect.Method.invoke(Method.java:606)
	at junit.framework.TestCase.runTest(TestCase.java:176)
	at junit.framework.TestCase.runBare(TestCase.java:141)
	at junit.framework.TestResult$1.protect(TestResult.java:122)
	at junit.framework.TestResult.runProtected(TestResult.java:142)
	at junit.framework.TestResult.run(TestResult.java:125)
	at junit.framework.TestCase.run(TestCase.java:129)
	at junit.framework.TestSuite.runTest(TestSuite.java:255)
	at junit.framework.TestSuite.run(TestSuite.java:250)
	at org.junit.internal.runners.JUnit38ClassRunner.run(JUnit38ClassRunner.java:84)
	at org.apache.maven.surefire.junit4.JUnit4Provider.execute(JUnit4Provider.java:365)
	at org.apache.maven.surefire.junit4.JUnit4Provider.executeWithRerun(JUnit4Provider.java:273)
	at org.apache.maven.surefire.junit4.JUnit4Provider.executeTestSet(JUnit4Provider.java:238)
	at org.apache.maven.surefire.junit4.JUnit4Provider.invoke(JUnit4Provider.java:159)
	at org.apache.maven.surefire.booter.ForkedBooter.invokeProviderInSameClassLoader(ForkedBooter.java:379)
	at org.apache.maven.surefire.booter.ForkedBooter.runSuitesInProcess(ForkedBooter.java:340)
	at org.apache.maven.surefire.booter.ForkedBooter.execute(ForkedBooter.java:125)
	at org.apache.maven.surefire.booter.ForkedBooter.main(ForkedBooter.java:413)


FAILED:  org.apache.maven.archetype.generator.DefaultArchetypeGeneratorTest.linux-jdk7-m3.2.x_build / Build linux-jdk7-m3.2.x_build / testGenerateArchetypePartialWithoutPoms

Error Message:
org/sonatype/aether/util/ConfigUtils

Stack Trace:
java.lang.NoClassDefFoundError: org/sonatype/aether/util/ConfigUtils
	at org.sonatype.aether.connector.file.ParallelRepositoryConnector.initExecutor(ParallelRepositoryConnector.java:50)
	at org.sonatype.aether.connector.file.FileRepositoryConnector.<init>(FileRepositoryConnector.java:59)
	at org.sonatype.aether.connector.file.FileRepositoryConnectorFactory.newInstance(FileRepositoryConnectorFactory.java:94)
	at org.sonatype.aether.impl.internal.DefaultRemoteRepositoryManager.getRepositoryConnector(DefaultRemoteRepositoryManager.java:316)
	at org.sonatype.aether.impl.internal.DefaultArtifactResolver.resolveArtifacts(DefaultArtifactResolver.java:403)
	at org.sonatype.aether.impl.internal.DefaultArtifactResolver.resolveArtifact(DefaultArtifactResolver.java:190)
	at org.apache.maven.repository.internal.DefaultArtifactDescriptorReader.loadPom(DefaultArtifactDescriptorReader.java:259)
	at org.apache.maven.repository.internal.DefaultArtifactDescriptorReader.readArtifactDescriptor(DefaultArtifactDescriptorReader.java:170)
	at org.sonatype.aether.impl.internal.DefaultRepositorySystem.readArtifactDescriptor(DefaultRepositorySystem.java:243)
	at org.apache.maven.shared.transfer.artifact.resolve.internal.Maven30ArtifactResolver.resolveArtifact(Maven30ArtifactResolver.java:104)
	at org.apache.maven.shared.transfer.artifact.resolve.internal.Maven30ArtifactResolver.resolveArtifact(Maven30ArtifactResolver.java:80)
	at org.apache.maven.shared.transfer.artifact.resolve.internal.DefaultArtifactResolver.resolveArtifact(DefaultArtifactResolver.java:75)
	at org.apache.maven.archetype.downloader.DefaultDownloader.download(DefaultDownloader.java:80)
	at org.apache.maven.archetype.common.DefaultArchetypeArtifactManager.exists(DefaultArchetypeArtifactManager.java:247)
	at org.apache.maven.archetype.generator.DefaultArchetypeGenerator.getArchetypeFile(DefaultArchetypeGenerator.java:84)
	at org.apache.maven.archetype.generator.DefaultArchetypeGenerator.generateArchetype(DefaultArchetypeGenerator.java:161)
	at org.apache.maven.archetype.generator.DefaultArchetypeGeneratorTest.generateProjectFromArchetype(DefaultArchetypeGeneratorTest.java:93)
	at org.apache.maven.archetype.generator.DefaultArchetypeGeneratorTest.testGenerateArchetypePartialWithoutPoms(DefaultArchetypeGeneratorTest.java:280)
	at sun.reflect.NativeMethodAccessorImpl.invoke0(Native Method)
	at sun.reflect.NativeMethodAccessorImpl.invoke(NativeMethodAccessorImpl.java:57)
	at sun.reflect.DelegatingMethodAccessorImpl.invoke(DelegatingMethodAccessorImpl.java:43)
	at java.lang.reflect.Method.invoke(Method.java:606)
	at junit.framework.TestCase.runTest(TestCase.java:176)
	at junit.framework.TestCase.runBare(TestCase.java:141)
	at junit.framework.TestResult$1.protect(TestResult.java:122)
	at junit.framework.TestResult.runProtected(TestResult.java:142)
	at junit.framework.TestResult.run(TestResult.java:125)
	at junit.framework.TestCase.run(TestCase.java:129)
	at junit.framework.TestSuite.runTest(TestSuite.java:255)
	at junit.framework.TestSuite.run(TestSuite.java:250)
	at org.junit.internal.runners.JUnit38ClassRunner.run(JUnit38ClassRunner.java:84)
	at org.apache.maven.surefire.junit4.JUnit4Provider.execute(JUnit4Provider.java:365)
	at org.apache.maven.surefire.junit4.JUnit4Provider.executeWithRerun(JUnit4Provider.java:273)
	at org.apache.maven.surefire.junit4.JUnit4Provider.executeTestSet(JUnit4Provider.java:238)
	at org.apache.maven.surefire.junit4.JUnit4Provider.invoke(JUnit4Provider.java:159)
	at org.apache.maven.surefire.booter.ForkedBooter.invokeProviderInSameClassLoader(ForkedBooter.java:379)
	at org.apache.maven.surefire.booter.ForkedBooter.runSuitesInProcess(ForkedBooter.java:340)
	at org.apache.maven.surefire.booter.ForkedBooter.execute(ForkedBooter.java:125)
	at org.apache.maven.surefire.booter.ForkedBooter.main(ForkedBooter.java:413)
Caused by: java.lang.ClassNotFoundException: org.sonatype.aether.util.ConfigUtils
	at java.net.URLClassLoader$1.run(URLClassLoader.java:366)
	at java.net.URLClassLoader$1.run(URLClassLoader.java:355)
	at java.security.AccessController.doPrivileged(Native Method)
	at java.net.URLClassLoader.findClass(URLClassLoader.java:354)
	at java.lang.ClassLoader.loadClass(ClassLoader.java:425)
	at sun.misc.Launcher$AppClassLoader.loadClass(Launcher.java:308)
	at java.lang.ClassLoader.loadClass(ClassLoader.java:358)
	... 39 more


FAILED:  org.apache.maven.archetype.generator.DefaultArchetypeGeneratorTest.linux-jdk7-m3.2.x_build / Build linux-jdk7-m3.2.x_build / testGenerateArchetypeCompleteWithParent

Error Message:
org/sonatype/aether/util/ConfigUtils

Stack Trace:
java.lang.NoClassDefFoundError: org/sonatype/aether/util/ConfigUtils
	at org.sonatype.aether.connector.file.ParallelRepositoryConnector.initExecutor(ParallelRepositoryConnector.java:50)
	at org.sonatype.aether.connector.file.FileRepositoryConnector.<init>(FileRepositoryConnector.java:59)
	at org.sonatype.aether.connector.file.FileRepositoryConnectorFactory.newInstance(FileRepositoryConnectorFactory.java:94)
	at org.sonatype.aether.impl.internal.DefaultRemoteRepositoryManager.getRepositoryConnector(DefaultRemoteRepositoryManager.java:316)
	at org.sonatype.aether.impl.internal.DefaultArtifactResolver.resolveArtifacts(DefaultArtifactResolver.java:403)
	at org.sonatype.aether.impl.internal.DefaultArtifactResolver.resolveArtifact(DefaultArtifactResolver.java:190)
	at org.apache.maven.repository.internal.DefaultArtifactDescriptorReader.loadPom(DefaultArtifactDescriptorReader.java:259)
	at org.apache.maven.repository.internal.DefaultArtifactDescriptorReader.readArtifactDescriptor(DefaultArtifactDescriptorReader.java:170)
	at org.sonatype.aether.impl.internal.DefaultRepositorySystem.readArtifactDescriptor(DefaultRepositorySystem.java:243)
	at org.apache.maven.shared.transfer.artifact.resolve.internal.Maven30ArtifactResolver.resolveArtifact(Maven30ArtifactResolver.java:104)
	at org.apache.maven.shared.transfer.artifact.resolve.internal.Maven30ArtifactResolver.resolveArtifact(Maven30ArtifactResolver.java:80)
	at org.apache.maven.shared.transfer.artifact.resolve.internal.DefaultArtifactResolver.resolveArtifact(DefaultArtifactResolver.java:75)
	at org.apache.maven.archetype.downloader.DefaultDownloader.download(DefaultDownloader.java:80)
	at org.apache.maven.archetype.common.DefaultArchetypeArtifactManager.exists(DefaultArchetypeArtifactManager.java:247)
	at org.apache.maven.archetype.generator.DefaultArchetypeGenerator.getArchetypeFile(DefaultArchetypeGenerator.java:84)
	at org.apache.maven.archetype.generator.DefaultArchetypeGenerator.generateArchetype(DefaultArchetypeGenerator.java:161)
	at org.apache.maven.archetype.generator.DefaultArchetypeGeneratorTest.generateProjectFromArchetype(DefaultArchetypeGeneratorTest.java:93)
	at org.apache.maven.archetype.generator.DefaultArchetypeGeneratorTest.testGenerateArchetypeCompleteWithParent(DefaultArchetypeGeneratorTest.java:172)
	at sun.reflect.NativeMethodAccessorImpl.invoke0(Native Method)
	at sun.reflect.NativeMethodAccessorImpl.invoke(NativeMethodAccessorImpl.java:57)
	at sun.reflect.DelegatingMethodAccessorImpl.invoke(DelegatingMethodAccessorImpl.java:43)
	at java.lang.reflect.Method.invoke(Method.java:606)
	at junit.framework.TestCase.runTest(TestCase.java:176)
	at junit.framework.TestCase.runBare(TestCase.java:141)
	at junit.framework.TestResult$1.protect(TestResult.java:122)
	at junit.framework.TestResult.runProtected(TestResult.java:142)
	at junit.framework.TestResult.run(TestResult.java:125)
	at junit.framework.TestCase.run(TestCase.java:129)
	at junit.framework.TestSuite.runTest(TestSuite.java:255)
	at junit.framework.TestSuite.run(TestSuite.java:250)
	at org.junit.internal.runners.JUnit38ClassRunner.run(JUnit38ClassRunner.java:84)
	at org.apache.maven.surefire.junit4.JUnit4Provider.execute(JUnit4Provider.java:365)
	at org.apache.maven.surefire.junit4.JUnit4Provider.executeWithRerun(JUnit4Provider.java:273)
	at org.apache.maven.surefire.junit4.JUnit4Provider.executeTestSet(JUnit4Provider.java:238)
	at org.apache.maven.surefire.junit4.JUnit4Provider.invoke(JUnit4Provider.java:159)
	at org.apache.maven.surefire.booter.ForkedBooter.invokeProviderInSameClassLoader(ForkedBooter.java:379)
	at org.apache.maven.surefire.booter.ForkedBooter.runSuitesInProcess(ForkedBooter.java:340)
	at org.apache.maven.surefire.booter.ForkedBooter.execute(ForkedBooter.java:125)
	at org.apache.maven.surefire.booter.ForkedBooter.main(ForkedBooter.java:413)


FAILED:  org.apache.maven.archetype.generator.DefaultArchetypeGeneratorTest.linux-jdk7-m3.2.x_build / Build linux-jdk7-m3.2.x_build / testGenerateArchetypePartialOnChild

Error Message:
org/sonatype/aether/util/ConfigUtils

Stack Trace:
java.lang.NoClassDefFoundError: org/sonatype/aether/util/ConfigUtils
	at org.sonatype.aether.connector.file.ParallelRepositoryConnector.initExecutor(ParallelRepositoryConnector.java:50)
	at org.sonatype.aether.connector.file.FileRepositoryConnector.<init>(FileRepositoryConnector.java:59)
	at org.sonatype.aether.connector.file.FileRepositoryConnectorFactory.newInstance(FileRepositoryConnectorFactory.java:94)
	at org.sonatype.aether.impl.internal.DefaultRemoteRepositoryManager.getRepositoryConnector(DefaultRemoteRepositoryManager.java:316)
	at org.sonatype.aether.impl.internal.DefaultArtifactResolver.resolveArtifacts(DefaultArtifactResolver.java:403)
	at org.sonatype.aether.impl.internal.DefaultArtifactResolver.resolveArtifact(DefaultArtifactResolver.java:190)
	at org.apache.maven.repository.internal.DefaultArtifactDescriptorReader.loadPom(DefaultArtifactDescriptorReader.java:259)
	at org.apache.maven.repository.internal.DefaultArtifactDescriptorReader.readArtifactDescriptor(DefaultArtifactDescriptorReader.java:170)
	at org.sonatype.aether.impl.internal.DefaultRepositorySystem.readArtifactDescriptor(DefaultRepositorySystem.java:243)
	at org.apache.maven.shared.transfer.artifact.resolve.internal.Maven30ArtifactResolver.resolveArtifact(Maven30ArtifactResolver.java:104)
	at org.apache.maven.shared.transfer.artifact.resolve.internal.Maven30ArtifactResolver.resolveArtifact(Maven30ArtifactResolver.java:80)
	at org.apache.maven.shared.transfer.artifact.resolve.internal.DefaultArtifactResolver.resolveArtifact(DefaultArtifactResolver.java:75)
	at org.apache.maven.archetype.downloader.DefaultDownloader.download(DefaultDownloader.java:80)
	at org.apache.maven.archetype.common.DefaultArchetypeArtifactManager.exists(DefaultArchetypeArtifactManager.java:247)
	at org.apache.maven.archetype.generator.DefaultArchetypeGenerator.getArchetypeFile(DefaultArchetypeGenerator.java:84)
	at org.apache.maven.archetype.generator.DefaultArchetypeGenerator.generateArchetype(DefaultArchetypeGenerator.java:161)
	at org.apache.maven.archetype.generator.DefaultArchetypeGeneratorTest.generateProjectFromArchetype(DefaultArchetypeGeneratorTest.java:93)
	at org.apache.maven.archetype.generator.DefaultArchetypeGeneratorTest.testGenerateArchetypePartialOnChild(DefaultArchetypeGeneratorTest.java:203)
	at sun.reflect.NativeMethodAccessorImpl.invoke0(Native Method)
	at sun.reflect.NativeMethodAccessorImpl.invoke(NativeMethodAccessorImpl.java:57)
	at sun.reflect.DelegatingMethodAccessorImpl.invoke(DelegatingMethodAccessorImpl.java:43)
	at java.lang.reflect.Method.invoke(Method.java:606)
	at junit.framework.TestCase.runTest(TestCase.java:176)
	at junit.framework.TestCase.runBare(TestCase.java:141)
	at junit.framework.TestResult$1.protect(TestResult.java:122)
	at junit.framework.TestResult.runProtected(TestResult.java:142)
	at junit.framework.TestResult.run(TestResult.java:125)
	at junit.framework.TestCase.run(TestCase.java:129)
	at junit.framework.TestSuite.runTest(TestSuite.java:255)
	at junit.framework.TestSuite.run(TestSuite.java:250)
	at org.junit.internal.runners.JUnit38ClassRunner.run(JUnit38ClassRunner.java:84)
	at org.apache.maven.surefire.junit4.JUnit4Provider.execute(JUnit4Provider.java:365)
	at org.apache.maven.surefire.junit4.JUnit4Provider.executeWithRerun(JUnit4Provider.java:273)
	at org.apache.maven.surefire.junit4.JUnit4Provider.executeTestSet(JUnit4Provider.java:238)
	at org.apache.maven.surefire.junit4.JUnit4Provider.invoke(JUnit4Provider.java:159)
	at org.apache.maven.surefire.booter.ForkedBooter.invokeProviderInSameClassLoader(ForkedBooter.java:379)
	at org.apache.maven.surefire.booter.ForkedBooter.runSuitesInProcess(ForkedBooter.java:340)
	at org.apache.maven.surefire.booter.ForkedBooter.execute(ForkedBooter.java:125)
	at org.apache.maven.surefire.booter.ForkedBooter.main(ForkedBooter.java:413)


FAILED:  org.apache.maven.archetype.generator.DefaultArchetypeGeneratorTest.linux-jdk7-m3.2.x_build / Build linux-jdk7-m3.2.x_build / testPropertiesNotDefined

Error Message:
org/sonatype/aether/util/ConfigUtils

Stack Trace:
java.lang.NoClassDefFoundError: org/sonatype/aether/util/ConfigUtils
	at org.sonatype.aether.connector.file.ParallelRepositoryConnector.initExecutor(ParallelRepositoryConnector.java:50)
	at org.sonatype.aether.connector.file.FileRepositoryConnector.<init>(FileRepositoryConnector.java:59)
	at org.sonatype.aether.connector.file.FileRepositoryConnectorFactory.newInstance(FileRepositoryConnectorFactory.java:94)
	at org.sonatype.aether.impl.internal.DefaultRemoteRepositoryManager.getRepositoryConnector(DefaultRemoteRepositoryManager.java:316)
	at org.sonatype.aether.impl.internal.DefaultArtifactResolver.resolveArtifacts(DefaultArtifactResolver.java:403)
	at org.sonatype.aether.impl.internal.DefaultArtifactResolver.resolveArtifact(DefaultArtifactResolver.java:190)
	at org.apache.maven.repository.internal.DefaultArtifactDescriptorReader.loadPom(DefaultArtifactDescriptorReader.java:259)
	at org.apache.maven.repository.internal.DefaultArtifactDescriptorReader.readArtifactDescriptor(DefaultArtifactDescriptorReader.java:170)
	at org.sonatype.aether.impl.internal.DefaultRepositorySystem.readArtifactDescriptor(DefaultRepositorySystem.java:243)
	at org.apache.maven.shared.transfer.artifact.resolve.internal.Maven30ArtifactResolver.resolveArtifact(Maven30ArtifactResolver.java:104)
	at org.apache.maven.shared.transfer.artifact.resolve.internal.Maven30ArtifactResolver.resolveArtifact(Maven30ArtifactResolver.java:80)
	at org.apache.maven.shared.transfer.artifact.resolve.internal.DefaultArtifactResolver.resolveArtifact(DefaultArtifactResolver.java:75)
	at org.apache.maven.archetype.downloader.DefaultDownloader.download(DefaultDownloader.java:80)
	at org.apache.maven.archetype.common.DefaultArchetypeArtifactManager.exists(DefaultArchetypeArtifactManager.java:247)
	at org.apache.maven.archetype.generator.DefaultArchetypeGenerator.getArchetypeFile(DefaultArchetypeGenerator.java:84)
	at org.apache.maven.archetype.generator.DefaultArchetypeGenerator.generateArchetype(DefaultArchetypeGenerator.java:161)
	at org.apache.maven.archetype.generator.DefaultArchetypeGeneratorTest.generateProjectFromArchetypeWithFailure(DefaultArchetypeGeneratorTest.java:106)
	at org.apache.maven.archetype.generator.DefaultArchetypeGeneratorTest.testPropertiesNotDefined(DefaultArchetypeGeneratorTest.java:426)
	at sun.reflect.NativeMethodAccessorImpl.invoke0(Native Method)
	at sun.reflect.NativeMethodAccessorImpl.invoke(NativeMethodAccessorImpl.java:57)
	at sun.reflect.DelegatingMethodAccessorImpl.invoke(DelegatingMethodAccessorImpl.java:43)
	at java.lang.reflect.Method.invoke(Method.java:606)
	at junit.framework.TestCase.runTest(TestCase.java:176)
	at junit.framework.TestCase.runBare(TestCase.java:141)
	at junit.framework.TestResult$1.protect(TestResult.java:122)
	at junit.framework.TestResult.runProtected(TestResult.java:142)
	at junit.framework.TestResult.run(TestResult.java:125)
	at junit.framework.TestCase.run(TestCase.java:129)
	at junit.framework.TestSuite.runTest(TestSuite.java:255)
	at junit.framework.TestSuite.run(TestSuite.java:250)
	at org.junit.internal.runners.JUnit38ClassRunner.run(JUnit38ClassRunner.java:84)
	at org.apache.maven.surefire.junit4.JUnit4Provider.execute(JUnit4Provider.java:365)
	at org.apache.maven.surefire.junit4.JUnit4Provider.executeWithRerun(JUnit4Provider.java:273)
	at org.apache.maven.surefire.junit4.JUnit4Provider.executeTestSet(JUnit4Provider.java:238)
	at org.apache.maven.surefire.junit4.JUnit4Provider.invoke(JUnit4Provider.java:159)
	at org.apache.maven.surefire.booter.ForkedBooter.invokeProviderInSameClassLoader(ForkedBooter.java:379)
	at org.apache.maven.surefire.booter.ForkedBooter.runSuitesInProcess(ForkedBooter.java:340)
	at org.apache.maven.surefire.booter.ForkedBooter.execute(ForkedBooter.java:125)
	at org.apache.maven.surefire.booter.ForkedBooter.main(ForkedBooter.java:413)


FAILED:  org.apache.maven.archetype.generator.DefaultArchetypeGeneratorTest.linux-jdk7-m3.2.x_build / Build linux-jdk7-m3.2.x_build / testGenerateArchetypeSite

Error Message:
org/sonatype/aether/util/ConfigUtils

Stack Trace:
java.lang.NoClassDefFoundError: org/sonatype/aether/util/ConfigUtils
	at org.sonatype.aether.connector.file.ParallelRepositoryConnector.initExecutor(ParallelRepositoryConnector.java:50)
	at org.sonatype.aether.connector.file.FileRepositoryConnector.<init>(FileRepositoryConnector.java:59)
	at org.sonatype.aether.connector.file.FileRepositoryConnectorFactory.newInstance(FileRepositoryConnectorFactory.java:94)
	at org.sonatype.aether.impl.internal.DefaultRemoteRepositoryManager.getRepositoryConnector(DefaultRemoteRepositoryManager.java:316)
	at org.sonatype.aether.impl.internal.DefaultArtifactResolver.resolveArtifacts(DefaultArtifactResolver.java:403)
	at org.sonatype.aether.impl.internal.DefaultArtifactResolver.resolveArtifact(DefaultArtifactResolver.java:190)
	at org.apache.maven.repository.internal.DefaultArtifactDescriptorReader.loadPom(DefaultArtifactDescriptorReader.java:259)
	at org.apache.maven.repository.internal.DefaultArtifactDescriptorReader.readArtifactDescriptor(DefaultArtifactDescriptorReader.java:170)
	at org.sonatype.aether.impl.internal.DefaultRepositorySystem.readArtifactDescriptor(DefaultRepositorySystem.java:243)
	at org.apache.maven.shared.transfer.artifact.resolve.internal.Maven30ArtifactResolver.resolveArtifact(Maven30ArtifactResolver.java:104)
	at org.apache.maven.shared.transfer.artifact.resolve.internal.Maven30ArtifactResolver.resolveArtifact(Maven30ArtifactResolver.java:80)
	at org.apache.maven.shared.transfer.artifact.resolve.internal.DefaultArtifactResolver.resolveArtifact(DefaultArtifactResolver.java:75)
	at org.apache.maven.archetype.downloader.DefaultDownloader.download(DefaultDownloader.java:80)
	at org.apache.maven.archetype.common.DefaultArchetypeArtifactManager.exists(DefaultArchetypeArtifactManager.java:247)
	at org.apache.maven.archetype.generator.DefaultArchetypeGenerator.getArchetypeFile(DefaultArchetypeGenerator.java:84)
	at org.apache.maven.archetype.generator.DefaultArchetypeGenerator.generateArchetype(DefaultArchetypeGenerator.java:161)
	at org.apache.maven.archetype.generator.DefaultArchetypeGeneratorTest.generateProjectFromArchetype(DefaultArchetypeGeneratorTest.java:93)
	at org.apache.maven.archetype.generator.DefaultArchetypeGeneratorTest.testGenerateArchetypeSite(DefaultArchetypeGeneratorTest.java:300)
	at sun.reflect.NativeMethodAccessorImpl.invoke0(Native Method)
	at sun.reflect.NativeMethodAccessorImpl.invoke(NativeMethodAccessorImpl.java:57)
	at sun.reflect.DelegatingMethodAccessorImpl.invoke(DelegatingMethodAccessorImpl.java:43)
	at java.lang.reflect.Method.invoke(Method.java:606)
	at junit.framework.TestCase.runTest(TestCase.java:176)
	at junit.framework.TestCase.runBare(TestCase.java:141)
	at junit.framework.TestResult$1.protect(TestResult.java:122)
	at junit.framework.TestResult.runProtected(TestResult.java:142)
	at junit.framework.TestResult.run(TestResult.java:125)
	at junit.framework.TestCase.run(TestCase.java:129)
	at junit.framework.TestSuite.runTest(TestSuite.java:255)
	at junit.framework.TestSuite.run(TestSuite.java:250)
	at org.junit.internal.runners.JUnit38ClassRunner.run(JUnit38ClassRunner.java:84)
	at org.apache.maven.surefire.junit4.JUnit4Provider.execute(JUnit4Provider.java:365)
	at org.apache.maven.surefire.junit4.JUnit4Provider.executeWithRerun(JUnit4Provider.java:273)
	at org.apache.maven.surefire.junit4.JUnit4Provider.executeTestSet(JUnit4Provider.java:238)
	at org.apache.maven.surefire.junit4.JUnit4Provider.invoke(JUnit4Provider.java:159)
	at org.apache.maven.surefire.booter.ForkedBooter.invokeProviderInSameClassLoader(ForkedBooter.java:379)
	at org.apache.maven.surefire.booter.ForkedBooter.runSuitesInProcess(ForkedBooter.java:340)
	at org.apache.maven.surefire.booter.ForkedBooter.execute(ForkedBooter.java:125)
	at org.apache.maven.surefire.booter.ForkedBooter.main(ForkedBooter.java:413)


FAILED:  org.apache.maven.archetype.generator.DefaultArchetypeGeneratorTest.linux-jdk7-m3.2.x_build / Build linux-jdk7-m3.2.x_build / testGenerateArchetypeCompleteWithoutParent

Error Message:
org/sonatype/aether/util/ConfigUtils

Stack Trace:
java.lang.NoClassDefFoundError: org/sonatype/aether/util/ConfigUtils
	at org.sonatype.aether.connector.file.ParallelRepositoryConnector.initExecutor(ParallelRepositoryConnector.java:50)
	at org.sonatype.aether.connector.file.FileRepositoryConnector.<init>(FileRepositoryConnector.java:59)
	at org.sonatype.aether.connector.file.FileRepositoryConnectorFactory.newInstance(FileRepositoryConnectorFactory.java:94)
	at org.sonatype.aether.impl.internal.DefaultRemoteRepositoryManager.getRepositoryConnector(DefaultRemoteRepositoryManager.java:316)
	at org.sonatype.aether.impl.internal.DefaultArtifactResolver.resolveArtifacts(DefaultArtifactResolver.java:403)
	at org.sonatype.aether.impl.internal.DefaultArtifactResolver.resolveArtifact(DefaultArtifactResolver.java:190)
	at org.apache.maven.repository.internal.DefaultArtifactDescriptorReader.loadPom(DefaultArtifactDescriptorReader.java:259)
	at org.apache.maven.repository.internal.DefaultArtifactDescriptorReader.readArtifactDescriptor(DefaultArtifactDescriptorReader.java:170)
	at org.sonatype.aether.impl.internal.DefaultRepositorySystem.readArtifactDescriptor(DefaultRepositorySystem.java:243)
	at org.apache.maven.shared.transfer.artifact.resolve.internal.Maven30ArtifactResolver.resolveArtifact(Maven30ArtifactResolver.java:104)
	at org.apache.maven.shared.transfer.artifact.resolve.internal.Maven30ArtifactResolver.resolveArtifact(Maven30ArtifactResolver.java:80)
	at org.apache.maven.shared.transfer.artifact.resolve.internal.DefaultArtifactResolver.resolveArtifact(DefaultArtifactResolver.java:75)
	at org.apache.maven.archetype.downloader.DefaultDownloader.download(DefaultDownloader.java:80)
	at org.apache.maven.archetype.common.DefaultArchetypeArtifactManager.exists(DefaultArchetypeArtifactManager.java:247)
	at org.apache.maven.archetype.generator.DefaultArchetypeGenerator.getArchetypeFile(DefaultArchetypeGenerator.java:84)
	at org.apache.maven.archetype.generator.DefaultArchetypeGenerator.generateArchetype(DefaultArchetypeGenerator.java:161)
	at org.apache.maven.archetype.generator.DefaultArchetypeGeneratorTest.generateProjectFromArchetype(DefaultArchetypeGeneratorTest.java:93)
	at org.apache.maven.archetype.generator.DefaultArchetypeGeneratorTest.testGenerateArchetypeCompleteWithoutParent(DefaultArchetypeGeneratorTest.java:139)
	at sun.reflect.NativeMethodAccessorImpl.invoke0(Native Method)
	at sun.reflect.NativeMethodAccessorImpl.invoke(NativeMethodAccessorImpl.java:57)
	at sun.reflect.DelegatingMethodAccessorImpl.invoke(DelegatingMethodAccessorImpl.java:43)
	at java.lang.reflect.Method.invoke(Method.java:606)
	at junit.framework.TestCase.runTest(TestCase.java:176)
	at junit.framework.TestCase.runBare(TestCase.java:141)
	at junit.framework.TestResult$1.protect(TestResult.java:122)
	at junit.framework.TestResult.runProtected(TestResult.java:142)
	at junit.framework.TestResult.run(TestResult.java:125)
	at junit.framework.TestCase.run(TestCase.java:129)
	at junit.framework.TestSuite.runTest(TestSuite.java:255)
	at junit.framework.TestSuite.run(TestSuite.java:250)
	at org.junit.internal.runners.JUnit38ClassRunner.run(JUnit38ClassRunner.java:84)
	at org.apache.maven.surefire.junit4.JUnit4Provider.execute(JUnit4Provider.java:365)
	at org.apache.maven.surefire.junit4.JUnit4Provider.executeWithRerun(JUnit4Provider.java:273)
	at org.apache.maven.surefire.junit4.JUnit4Provider.executeTestSet(JUnit4Provider.java:238)
	at org.apache.maven.surefire.junit4.JUnit4Provider.invoke(JUnit4Provider.java:159)
	at org.apache.maven.surefire.booter.ForkedBooter.invokeProviderInSameClassLoader(ForkedBooter.java:379)
	at org.apache.maven.surefire.booter.ForkedBooter.runSuitesInProcess(ForkedBooter.java:340)
	at org.apache.maven.surefire.booter.ForkedBooter.execute(ForkedBooter.java:125)
	at org.apache.maven.surefire.booter.ForkedBooter.main(ForkedBooter.java:413)


FAILED:  org.apache.maven.archetype.generator.DefaultArchetypeGeneratorTest.linux-jdk7-m3.2.x_build / Build linux-jdk7-m3.2.x_build / testGenerateOldArchetype

Error Message:
org/sonatype/aether/util/ConfigUtils

Stack Trace:
java.lang.NoClassDefFoundError: org/sonatype/aether/util/ConfigUtils
	at org.sonatype.aether.connector.file.ParallelRepositoryConnector.initExecutor(ParallelRepositoryConnector.java:50)
	at org.sonatype.aether.connector.file.FileRepositoryConnector.<init>(FileRepositoryConnector.java:59)
	at org.sonatype.aether.connector.file.FileRepositoryConnectorFactory.newInstance(FileRepositoryConnectorFactory.java:94)
	at org.sonatype.aether.impl.internal.DefaultRemoteRepositoryManager.getRepositoryConnector(DefaultRemoteRepositoryManager.java:316)
	at org.sonatype.aether.impl.internal.DefaultArtifactResolver.resolveArtifacts(DefaultArtifactResolver.java:403)
	at org.sonatype.aether.impl.internal.DefaultArtifactResolver.resolveArtifact(DefaultArtifactResolver.java:190)
	at org.apache.maven.repository.internal.DefaultArtifactDescriptorReader.loadPom(DefaultArtifactDescriptorReader.java:259)
	at org.apache.maven.repository.internal.DefaultArtifactDescriptorReader.readArtifactDescriptor(DefaultArtifactDescriptorReader.java:170)
	at org.sonatype.aether.impl.internal.DefaultRepositorySystem.readArtifactDescriptor(DefaultRepositorySystem.java:243)
	at org.apache.maven.shared.transfer.artifact.resolve.internal.Maven30ArtifactResolver.resolveArtifact(Maven30ArtifactResolver.java:104)
	at org.apache.maven.shared.transfer.artifact.resolve.internal.Maven30ArtifactResolver.resolveArtifact(Maven30ArtifactResolver.java:80)
	at org.apache.maven.shared.transfer.artifact.resolve.internal.DefaultArtifactResolver.resolveArtifact(DefaultArtifactResolver.java:75)
	at org.apache.maven.archetype.downloader.DefaultDownloader.download(DefaultDownloader.java:80)
	at org.apache.maven.archetype.common.DefaultArchetypeArtifactManager.exists(DefaultArchetypeArtifactManager.java:247)
	at org.apache.maven.archetype.generator.DefaultArchetypeGenerator.getArchetypeFile(DefaultArchetypeGenerator.java:84)
	at org.apache.maven.archetype.generator.DefaultArchetypeGenerator.generateArchetype(DefaultArchetypeGenerator.java:161)
	at org.apache.maven.archetype.generator.DefaultArchetypeGeneratorTest.generateProjectFromArchetype(DefaultArchetypeGeneratorTest.java:93)
	at org.apache.maven.archetype.generator.DefaultArchetypeGeneratorTest.testGenerateOldArchetype(DefaultArchetypeGeneratorTest.java:404)
	at sun.reflect.NativeMethodAccessorImpl.invoke0(Native Method)
	at sun.reflect.NativeMethodAccessorImpl.invoke(NativeMethodAccessorImpl.java:57)
	at sun.reflect.DelegatingMethodAccessorImpl.invoke(DelegatingMethodAccessorImpl.java:43)
	at java.lang.reflect.Method.invoke(Method.java:606)
	at junit.framework.TestCase.runTest(TestCase.java:176)
	at junit.framework.TestCase.runBare(TestCase.java:141)
	at junit.framework.TestResult$1.protect(TestResult.java:122)
	at junit.framework.TestResult.runProtected(TestResult.java:142)
	at junit.framework.TestResult.run(TestResult.java:125)
	at junit.framework.TestCase.run(TestCase.java:129)
	at junit.framework.TestSuite.runTest(TestSuite.java:255)
	at junit.framework.TestSuite.run(TestSuite.java:250)
	at org.junit.internal.runners.JUnit38ClassRunner.run(JUnit38ClassRunner.java:84)
	at org.apache.maven.surefire.junit4.JUnit4Provider.execute(JUnit4Provider.java:365)
	at org.apache.maven.surefire.junit4.JUnit4Provider.executeWithRerun(JUnit4Provider.java:273)
	at org.apache.maven.surefire.junit4.JUnit4Provider.executeTestSet(JUnit4Provider.java:238)
	at org.apache.maven.surefire.junit4.JUnit4Provider.invoke(JUnit4Provider.java:159)
	at org.apache.maven.surefire.booter.ForkedBooter.invokeProviderInSameClassLoader(ForkedBooter.java:379)
	at org.apache.maven.surefire.booter.ForkedBooter.runSuitesInProcess(ForkedBooter.java:340)
	at org.apache.maven.surefire.booter.ForkedBooter.execute(ForkedBooter.java:125)
	at org.apache.maven.surefire.booter.ForkedBooter.main(ForkedBooter.java:413)


FAILED:  org.apache.maven.archetype.generator.DefaultArchetypeGeneratorTest.linux-jdk7-m3.2.x_build / Build linux-jdk7-m3.2.x_build / testGenerateArchetypePartialOnChildDontOverride

Error Message:
org/sonatype/aether/util/ConfigUtils

Stack Trace:
java.lang.NoClassDefFoundError: org/sonatype/aether/util/ConfigUtils
	at org.sonatype.aether.connector.file.ParallelRepositoryConnector.initExecutor(ParallelRepositoryConnector.java:50)
	at org.sonatype.aether.connector.file.FileRepositoryConnector.<init>(FileRepositoryConnector.java:59)
	at org.sonatype.aether.connector.file.FileRepositoryConnectorFactory.newInstance(FileRepositoryConnectorFactory.java:94)
	at org.sonatype.aether.impl.internal.DefaultRemoteRepositoryManager.getRepositoryConnector(DefaultRemoteRepositoryManager.java:316)
	at org.sonatype.aether.impl.internal.DefaultArtifactResolver.resolveArtifacts(DefaultArtifactResolver.java:403)
	at org.sonatype.aether.impl.internal.DefaultArtifactResolver.resolveArtifact(DefaultArtifactResolver.java:190)
	at org.apache.maven.repository.internal.DefaultArtifactDescriptorReader.loadPom(DefaultArtifactDescriptorReader.java:259)
	at org.apache.maven.repository.internal.DefaultArtifactDescriptorReader.readArtifactDescriptor(DefaultArtifactDescriptorReader.java:170)
	at org.sonatype.aether.impl.internal.DefaultRepositorySystem.readArtifactDescriptor(DefaultRepositorySystem.java:243)
	at org.apache.maven.shared.transfer.artifact.resolve.internal.Maven30ArtifactResolver.resolveArtifact(Maven30ArtifactResolver.java:104)
	at org.apache.maven.shared.transfer.artifact.resolve.internal.Maven30ArtifactResolver.resolveArtifact(Maven30ArtifactResolver.java:80)
	at org.apache.maven.shared.transfer.artifact.resolve.internal.DefaultArtifactResolver.resolveArtifact(DefaultArtifactResolver.java:75)
	at org.apache.maven.archetype.downloader.DefaultDownloader.download(DefaultDownloader.java:80)
	at org.apache.maven.archetype.common.DefaultArchetypeArtifactManager.exists(DefaultArchetypeArtifactManager.java:247)
	at org.apache.maven.archetype.generator.DefaultArchetypeGenerator.getArchetypeFile(DefaultArchetypeGenerator.java:84)
	at org.apache.maven.archetype.generator.DefaultArchetypeGenerator.generateArchetype(DefaultArchetypeGenerator.java:161)
	at org.apache.maven.archetype.generator.DefaultArchetypeGeneratorTest.generateProjectFromArchetype(DefaultArchetypeGeneratorTest.java:93)
	at org.apache.maven.archetype.generator.DefaultArchetypeGeneratorTest.testGenerateArchetypePartialOnChildDontOverride(DefaultArchetypeGeneratorTest.java:229)
	at sun.reflect.NativeMethodAccessorImpl.invoke0(Native Method)
	at sun.reflect.NativeMethodAccessorImpl.invoke(NativeMethodAccessorImpl.java:57)
	at sun.reflect.DelegatingMethodAccessorImpl.invoke(DelegatingMethodAccessorImpl.java:43)
	at java.lang.reflect.Method.invoke(Method.java:606)
	at junit.framework.TestCase.runTest(TestCase.java:176)
	at junit.framework.TestCase.runBare(TestCase.java:141)
	at junit.framework.TestResult$1.protect(TestResult.java:122)
	at junit.framework.TestResult.runProtected(TestResult.java:142)
	at junit.framework.TestResult.run(TestResult.java:125)
	at junit.framework.TestCase.run(TestCase.java:129)
	at junit.framework.TestSuite.runTest(TestSuite.java:255)
	at junit.framework.TestSuite.run(TestSuite.java:250)
	at org.junit.internal.runners.JUnit38ClassRunner.run(JUnit38ClassRunner.java:84)
	at org.apache.maven.surefire.junit4.JUnit4Provider.execute(JUnit4Provider.java:365)
	at org.apache.maven.surefire.junit4.JUnit4Provider.executeWithRerun(JUnit4Provider.java:273)
	at org.apache.maven.surefire.junit4.JUnit4Provider.executeTestSet(JUnit4Provider.java:238)
	at org.apache.maven.surefire.junit4.JUnit4Provider.invoke(JUnit4Provider.java:159)
	at org.apache.maven.surefire.booter.ForkedBooter.invokeProviderInSameClassLoader(ForkedBooter.java:379)
	at org.apache.maven.surefire.booter.ForkedBooter.runSuitesInProcess(ForkedBooter.java:340)
	at org.apache.maven.surefire.booter.ForkedBooter.execute(ForkedBooter.java:125)
	at org.apache.maven.surefire.booter.ForkedBooter.main(ForkedBooter.java:413)


FAILED:  org.apache.maven.archetype.generator.DefaultArchetypeGeneratorTest.linux-jdk7-m3.2.x_build / Build linux-jdk7-m3.2.x_build / testGenerateArchetypePartialOnParent

Error Message:
org/sonatype/aether/util/ConfigUtils

Stack Trace:
java.lang.NoClassDefFoundError: org/sonatype/aether/util/ConfigUtils
	at org.sonatype.aether.connector.file.ParallelRepositoryConnector.initExecutor(ParallelRepositoryConnector.java:50)
	at org.sonatype.aether.connector.file.FileRepositoryConnector.<init>(FileRepositoryConnector.java:59)
	at org.sonatype.aether.connector.file.FileRepositoryConnectorFactory.newInstance(FileRepositoryConnectorFactory.java:94)
	at org.sonatype.aether.impl.internal.DefaultRemoteRepositoryManager.getRepositoryConnector(DefaultRemoteRepositoryManager.java:316)
	at org.sonatype.aether.impl.internal.DefaultArtifactResolver.resolveArtifacts(DefaultArtifactResolver.java:403)
	at org.sonatype.aether.impl.internal.DefaultArtifactResolver.resolveArtifact(DefaultArtifactResolver.java:190)
	at org.apache.maven.repository.internal.DefaultArtifactDescriptorReader.loadPom(DefaultArtifactDescriptorReader.java:259)
	at org.apache.maven.repository.internal.DefaultArtifactDescriptorReader.readArtifactDescriptor(DefaultArtifactDescriptorReader.java:170)
	at org.sonatype.aether.impl.internal.DefaultRepositorySystem.readArtifactDescriptor(DefaultRepositorySystem.java:243)
	at org.apache.maven.shared.transfer.artifact.resolve.internal.Maven30ArtifactResolver.resolveArtifact(Maven30ArtifactResolver.java:104)
	at org.apache.maven.shared.transfer.artifact.resolve.internal.Maven30ArtifactResolver.resolveArtifact(Maven30ArtifactResolver.java:80)
	at org.apache.maven.shared.transfer.artifact.resolve.internal.DefaultArtifactResolver.resolveArtifact(DefaultArtifactResolver.java:75)
	at org.apache.maven.archetype.downloader.DefaultDownloader.download(DefaultDownloader.java:80)
	at org.apache.maven.archetype.common.DefaultArchetypeArtifactManager.exists(DefaultArchetypeArtifactManager.java:247)
	at org.apache.maven.archetype.generator.DefaultArchetypeGenerator.getArchetypeFile(DefaultArchetypeGenerator.java:84)
	at org.apache.maven.archetype.generator.DefaultArchetypeGenerator.generateArchetype(DefaultArchetypeGenerator.java:161)
	at org.apache.maven.archetype.generator.DefaultArchetypeGeneratorTest.generateProjectFromArchetype(DefaultArchetypeGeneratorTest.java:93)
	at org.apache.maven.archetype.generator.DefaultArchetypeGeneratorTest.testGenerateArchetypePartialOnParent(DefaultArchetypeGeneratorTest.java:258)
	at sun.reflect.NativeMethodAccessorImpl.invoke0(Native Method)
	at sun.reflect.NativeMethodAccessorImpl.invoke(NativeMethodAccessorImpl.java:57)
	at sun.reflect.DelegatingMethodAccessorImpl.invoke(DelegatingMethodAccessorImpl.java:43)
	at java.lang.reflect.Method.invoke(Method.java:606)
	at junit.framework.TestCase.runTest(TestCase.java:176)
	at junit.framework.TestCase.runBare(TestCase.java:141)
	at junit.framework.TestResult$1.protect(TestResult.java:122)
	at junit.framework.TestResult.runProtected(TestResult.java:142)
	at junit.framework.TestResult.run(TestResult.java:125)
	at junit.framework.TestCase.run(TestCase.java:129)
	at junit.framework.TestSuite.runTest(TestSuite.java:255)
	at junit.framework.TestSuite.run(TestSuite.java:250)
	at org.junit.internal.runners.JUnit38ClassRunner.run(JUnit38ClassRunner.java:84)
	at org.apache.maven.surefire.junit4.JUnit4Provider.execute(JUnit4Provider.java:365)
	at org.apache.maven.surefire.junit4.JUnit4Provider.executeWithRerun(JUnit4Provider.java:273)
	at org.apache.maven.surefire.junit4.JUnit4Provider.executeTestSet(JUnit4Provider.java:238)
	at org.apache.maven.surefire.junit4.JUnit4Provider.invoke(JUnit4Provider.java:159)
	at org.apache.maven.surefire.booter.ForkedBooter.invokeProviderInSameClassLoader(ForkedBooter.java:379)
	at org.apache.maven.surefire.booter.ForkedBooter.runSuitesInProcess(ForkedBooter.java:340)
	at org.apache.maven.surefire.booter.ForkedBooter.execute(ForkedBooter.java:125)
	at org.apache.maven.surefire.booter.ForkedBooter.main(ForkedBooter.java:413)


FAILED:  org.apache.maven.archetype.generator.DefaultArchetypeGeneratorTest.linux-jdk7-m3.2.x_build / Build linux-jdk7-m3.2.x_build / testGenerateFileSetArchetype

Error Message:
org/sonatype/aether/util/ConfigUtils

Stack Trace:
java.lang.NoClassDefFoundError: org/sonatype/aether/util/ConfigUtils
	at org.sonatype.aether.connector.file.ParallelRepositoryConnector.initExecutor(ParallelRepositoryConnector.java:50)
	at org.sonatype.aether.connector.file.FileRepositoryConnector.<init>(FileRepositoryConnector.java:59)
	at org.sonatype.aether.connector.file.FileRepositoryConnectorFactory.newInstance(FileRepositoryConnectorFactory.java:94)
	at org.sonatype.aether.impl.internal.DefaultRemoteRepositoryManager.getRepositoryConnector(DefaultRemoteRepositoryManager.java:316)
	at org.sonatype.aether.impl.internal.DefaultArtifactResolver.resolveArtifacts(DefaultArtifactResolver.java:403)
	at org.sonatype.aether.impl.internal.DefaultArtifactResolver.resolveArtifact(DefaultArtifactResolver.java:190)
	at org.apache.maven.repository.internal.DefaultArtifactDescriptorReader.loadPom(DefaultArtifactDescriptorReader.java:259)
	at org.apache.maven.repository.internal.DefaultArtifactDescriptorReader.readArtifactDescriptor(DefaultArtifactDescriptorReader.java:170)
	at org.sonatype.aether.impl.internal.DefaultRepositorySystem.readArtifactDescriptor(DefaultRepositorySystem.java:243)
	at org.apache.maven.shared.transfer.artifact.resolve.internal.Maven30ArtifactResolver.resolveArtifact(Maven30ArtifactResolver.java:104)
	at org.apache.maven.shared.transfer.artifact.resolve.internal.Maven30ArtifactResolver.resolveArtifact(Maven30ArtifactResolver.java:80)
	at org.apache.maven.shared.transfer.artifact.resolve.internal.DefaultArtifactResolver.resolveArtifact(DefaultArtifactResolver.java:75)
	at org.apache.maven.archetype.downloader.DefaultDownloader.download(DefaultDownloader.java:80)
	at org.apache.maven.archetype.common.DefaultArchetypeArtifactManager.exists(DefaultArchetypeArtifactManager.java:247)
	at org.apache.maven.archetype.generator.DefaultArchetypeGenerator.getArchetypeFile(DefaultArchetypeGenerator.java:84)
	at org.apache.maven.archetype.generator.DefaultArchetypeGenerator.generateArchetype(DefaultArchetypeGenerator.java:161)
	at org.apache.maven.archetype.generator.DefaultArchetypeGeneratorTest.generateProjectFromArchetype(DefaultArchetypeGeneratorTest.java:93)
	at org.apache.maven.archetype.generator.DefaultArchetypeGeneratorTest.testGenerateFileSetArchetype(DefaultArchetypeGeneratorTest.java:323)
	at sun.reflect.NativeMethodAccessorImpl.invoke0(Native Method)
	at sun.reflect.NativeMethodAccessorImpl.invoke(NativeMethodAccessorImpl.java:57)
	at sun.reflect.DelegatingMethodAccessorImpl.invoke(DelegatingMethodAccessorImpl.java:43)
	at java.lang.reflect.Method.invoke(Method.java:606)
	at junit.framework.TestCase.runTest(TestCase.java:176)
	at junit.framework.TestCase.runBare(TestCase.java:141)
	at junit.framework.TestResult$1.protect(TestResult.java:122)
	at junit.framework.TestResult.runProtected(TestResult.java:142)
	at junit.framework.TestResult.run(TestResult.java:125)
	at junit.framework.TestCase.run(TestCase.java:129)
	at junit.framework.TestSuite.runTest(TestSuite.java:255)
	at junit.framework.TestSuite.run(TestSuite.java:250)
	at org.junit.internal.runners.JUnit38ClassRunner.run(JUnit38ClassRunner.java:84)
	at org.apache.maven.surefire.junit4.JUnit4Provider.execute(JUnit4Provider.java:365)
	at org.apache.maven.surefire.junit4.JUnit4Provider.executeWithRerun(JUnit4Provider.java:273)
	at org.apache.maven.surefire.junit4.JUnit4Provider.executeTestSet(JUnit4Provider.java:238)
	at org.apache.maven.surefire.junit4.JUnit4Provider.invoke(JUnit4Provider.java:159)
	at org.apache.maven.surefire.booter.ForkedBooter.invokeProviderInSameClassLoader(ForkedBooter.java:379)
	at org.apache.maven.surefire.booter.ForkedBooter.runSuitesInProcess(ForkedBooter.java:340)
	at org.apache.maven.surefire.booter.ForkedBooter.execute(ForkedBooter.java:125)
	at org.apache.maven.surefire.booter.ForkedBooter.main(ForkedBooter.java:413)


FAILED:  org.apache.maven.archetype.generator.DefaultArchetypeGeneratorTest.linux-jdk7-m3.2.x_build / Build linux-jdk7-m3.2.x_build / testGenerateArchetypeWithPostScriptIncluded

Error Message:
org/sonatype/aether/util/ConfigUtils

Stack Trace:
java.lang.NoClassDefFoundError: org/sonatype/aether/util/ConfigUtils
	at org.sonatype.aether.connector.file.ParallelRepositoryConnector.initExecutor(ParallelRepositoryConnector.java:50)
	at org.sonatype.aether.connector.file.FileRepositoryConnector.<init>(FileRepositoryConnector.java:59)
	at org.sonatype.aether.connector.file.FileRepositoryConnectorFactory.newInstance(FileRepositoryConnectorFactory.java:94)
	at org.sonatype.aether.impl.internal.DefaultRemoteRepositoryManager.getRepositoryConnector(DefaultRemoteRepositoryManager.java:316)
	at org.sonatype.aether.impl.internal.DefaultArtifactResolver.resolveArtifacts(DefaultArtifactResolver.java:403)
	at org.sonatype.aether.impl.internal.DefaultArtifactResolver.resolveArtifact(DefaultArtifactResolver.java:190)
	at org.apache.maven.repository.internal.DefaultArtifactDescriptorReader.loadPom(DefaultArtifactDescriptorReader.java:259)
	at org.apache.maven.repository.internal.DefaultArtifactDescriptorReader.readArtifactDescriptor(DefaultArtifactDescriptorReader.java:170)
	at org.sonatype.aether.impl.internal.DefaultRepositorySystem.readArtifactDescriptor(DefaultRepositorySystem.java:243)
	at org.apache.maven.shared.transfer.artifact.resolve.internal.Maven30ArtifactResolver.resolveArtifact(Maven30ArtifactResolver.java:104)
	at org.apache.maven.shared.transfer.artifact.resolve.internal.Maven30ArtifactResolver.resolveArtifact(Maven30ArtifactResolver.java:80)
	at org.apache.maven.shared.transfer.artifact.resolve.internal.DefaultArtifactResolver.resolveArtifact(DefaultArtifactResolver.java:75)
	at org.apache.maven.archetype.downloader.DefaultDownloader.download(DefaultDownloader.java:80)
	at org.apache.maven.archetype.common.DefaultArchetypeArtifactManager.exists(DefaultArchetypeArtifactManager.java:247)
	at org.apache.maven.archetype.generator.DefaultArchetypeGenerator.getArchetypeFile(DefaultArchetypeGenerator.java:84)
	at org.apache.maven.archetype.generator.DefaultArchetypeGenerator.generateArchetype(DefaultArchetypeGenerator.java:161)
	at org.apache.maven.archetype.generator.DefaultArchetypeGeneratorTest.generateProjectFromArchetype(DefaultArchetypeGeneratorTest.java:93)
	at org.apache.maven.archetype.generator.DefaultArchetypeGeneratorTest.testGenerateArchetypeWithPostScriptIncluded(DefaultArchetypeGeneratorTest.java:445)
	at sun.reflect.NativeMethodAccessorImpl.invoke0(Native Method)
	at sun.reflect.NativeMethodAccessorImpl.invoke(NativeMethodAccessorImpl.java:57)
	at sun.reflect.DelegatingMethodAccessorImpl.invoke(DelegatingMethodAccessorImpl.java:43)
	at java.lang.reflect.Method.invoke(Method.java:606)
	at junit.framework.TestCase.runTest(TestCase.java:176)
	at junit.framework.TestCase.runBare(TestCase.java:141)
	at junit.framework.TestResult$1.protect(TestResult.java:122)
	at junit.framework.TestResult.runProtected(TestResult.java:142)
	at junit.framework.TestResult.run(TestResult.java:125)
	at junit.framework.TestCase.run(TestCase.java:129)
	at junit.framework.TestSuite.runTest(TestSuite.java:255)
	at junit.framework.TestSuite.run(TestSuite.java:250)
	at org.junit.internal.runners.JUnit38ClassRunner.run(JUnit38ClassRunner.java:84)
	at org.apache.maven.surefire.junit4.JUnit4Provider.execute(JUnit4Provider.java:365)
	at org.apache.maven.surefire.junit4.JUnit4Provider.executeWithRerun(JUnit4Provider.java:273)
	at org.apache.maven.surefire.junit4.JUnit4Provider.executeTestSet(JUnit4Provider.java:238)
	at org.apache.maven.surefire.junit4.JUnit4Provider.invoke(JUnit4Provider.java:159)
	at org.apache.maven.surefire.booter.ForkedBooter.invokeProviderInSameClassLoader(ForkedBooter.java:379)
	at org.apache.maven.surefire.booter.ForkedBooter.runSuitesInProcess(ForkedBooter.java:340)
	at org.apache.maven.surefire.booter.ForkedBooter.execute(ForkedBooter.java:125)
	at org.apache.maven.surefire.booter.ForkedBooter.main(ForkedBooter.java:413)


FAILED:  org.apache.maven.archetype.old.ArchetypeTest.windows-jdk7-m3.2.x_build / Build windows-jdk7-m3.2.x_build / testArchetype

Error Message:
org/sonatype/aether/util/ConfigUtils

Stack Trace:
java.lang.NoClassDefFoundError: org/sonatype/aether/util/ConfigUtils
	at org.sonatype.aether.connector.file.ParallelRepositoryConnector.initExecutor(ParallelRepositoryConnector.java:50)
	at org.sonatype.aether.connector.file.FileRepositoryConnector.<init>(FileRepositoryConnector.java:59)
	at org.sonatype.aether.connector.file.FileRepositoryConnectorFactory.newInstance(FileRepositoryConnectorFactory.java:94)
	at org.sonatype.aether.impl.internal.DefaultRemoteRepositoryManager.getRepositoryConnector(DefaultRemoteRepositoryManager.java:316)
	at org.sonatype.aether.impl.internal.DefaultMetadataResolver$ResolveTask.run(DefaultMetadataResolver.java:459)
	at org.sonatype.aether.impl.internal.DefaultMetadataResolver$1.execute(DefaultMetadataResolver.java:391)
	at org.sonatype.aether.impl.internal.DefaultMetadataResolver.resolveMetadata(DefaultMetadataResolver.java:258)
	at org.apache.maven.repository.internal.DefaultVersionResolver.resolveVersion(DefaultVersionResolver.java:188)
	at org.apache.maven.repository.internal.DefaultArtifactDescriptorReader.loadPom(DefaultArtifactDescriptorReader.java:225)
	at org.apache.maven.repository.internal.DefaultArtifactDescriptorReader.readArtifactDescriptor(DefaultArtifactDescriptorReader.java:170)
	at org.sonatype.aether.impl.internal.DefaultRepositorySystem.readArtifactDescriptor(DefaultRepositorySystem.java:243)
	at org.apache.maven.shared.transfer.artifact.resolve.internal.Maven30ArtifactResolver.resolveArtifact(Maven30ArtifactResolver.java:104)
	at org.apache.maven.shared.transfer.artifact.resolve.internal.Maven30ArtifactResolver.resolveArtifact(Maven30ArtifactResolver.java:80)
	at org.apache.maven.shared.transfer.artifact.resolve.internal.DefaultArtifactResolver.resolveArtifact(DefaultArtifactResolver.java:75)
	at org.apache.maven.archetype.downloader.DefaultDownloader.download(DefaultDownloader.java:80)
	at org.apache.maven.archetype.common.DefaultArchetypeArtifactManager.getArchetypeFile(DefaultArchetypeArtifactManager.java:81)
	at org.apache.maven.archetype.old.DefaultOldArchetype.createArchetype(DefaultOldArchetype.java:115)
	at org.apache.maven.archetype.old.ArchetypeTest.testArchetype(ArchetypeTest.java:110)
	at sun.reflect.NativeMethodAccessorImpl.invoke0(Native Method)
	at sun.reflect.NativeMethodAccessorImpl.invoke(NativeMethodAccessorImpl.java:57)
	at sun.reflect.DelegatingMethodAccessorImpl.invoke(DelegatingMethodAccessorImpl.java:43)
	at java.lang.reflect.Method.invoke(Method.java:606)
	at junit.framework.TestCase.runTest(TestCase.java:176)
	at junit.framework.TestCase.runBare(TestCase.java:141)
	at junit.framework.TestResult$1.protect(TestResult.java:122)
	at junit.framework.TestResult.runProtected(TestResult.java:142)
	at junit.framework.TestResult.run(TestResult.java:125)
	at junit.framework.TestCase.run(TestCase.java:129)
	at junit.framework.TestSuite.runTest(TestSuite.java:255)
	at junit.framework.TestSuite.run(TestSuite.java:250)
	at org.junit.internal.runners.JUnit38ClassRunner.run(JUnit38ClassRunner.java:84)
	at org.apache.maven.surefire.junit4.JUnit4Provider.execute(JUnit4Provider.java:365)
	at org.apache.maven.surefire.junit4.JUnit4Provider.executeWithRerun(JUnit4Provider.java:273)
	at org.apache.maven.surefire.junit4.JUnit4Provider.executeTestSet(JUnit4Provider.java:238)
	at org.apache.maven.surefire.junit4.JUnit4Provider.invoke(JUnit4Provider.java:159)
	at org.apache.maven.surefire.booter.ForkedBooter.invokeProviderInSameClassLoader(ForkedBooter.java:379)
	at org.apache.maven.surefire.booter.ForkedBooter.runSuitesInProcess(ForkedBooter.java:340)
	at org.apache.maven.surefire.booter.ForkedBooter.execute(ForkedBooter.java:125)
	at org.apache.maven.surefire.booter.ForkedBooter.main(ForkedBooter.java:413)


FAILED:  org.apache.maven.archetype.old.ArchetypeTest.linux-jdk7-m3.2.x_build / Build linux-jdk7-m3.2.x_build / testArchetype

Error Message:
org/sonatype/aether/util/ConfigUtils

Stack Trace:
java.lang.NoClassDefFoundError: org/sonatype/aether/util/ConfigUtils
	at org.sonatype.aether.connector.file.ParallelRepositoryConnector.initExecutor(ParallelRepositoryConnector.java:50)
	at org.sonatype.aether.connector.file.FileRepositoryConnector.<init>(FileRepositoryConnector.java:59)
	at org.sonatype.aether.connector.file.FileRepositoryConnectorFactory.newInstance(FileRepositoryConnectorFactory.java:94)
	at org.sonatype.aether.impl.internal.DefaultRemoteRepositoryManager.getRepositoryConnector(DefaultRemoteRepositoryManager.java:316)
	at org.sonatype.aether.impl.internal.DefaultMetadataResolver$ResolveTask.run(DefaultMetadataResolver.java:459)
	at org.sonatype.aether.impl.internal.DefaultMetadataResolver$1.execute(DefaultMetadataResolver.java:391)
	at org.sonatype.aether.impl.internal.DefaultMetadataResolver.resolveMetadata(DefaultMetadataResolver.java:258)
	at org.apache.maven.repository.internal.DefaultVersionResolver.resolveVersion(DefaultVersionResolver.java:188)
	at org.apache.maven.repository.internal.DefaultArtifactDescriptorReader.loadPom(DefaultArtifactDescriptorReader.java:225)
	at org.apache.maven.repository.internal.DefaultArtifactDescriptorReader.readArtifactDescriptor(DefaultArtifactDescriptorReader.java:170)
	at org.sonatype.aether.impl.internal.DefaultRepositorySystem.readArtifactDescriptor(DefaultRepositorySystem.java:243)
	at org.apache.maven.shared.transfer.artifact.resolve.internal.Maven30ArtifactResolver.resolveArtifact(Maven30ArtifactResolver.java:104)
	at org.apache.maven.shared.transfer.artifact.resolve.internal.Maven30ArtifactResolver.resolveArtifact(Maven30ArtifactResolver.java:80)
	at org.apache.maven.shared.transfer.artifact.resolve.internal.DefaultArtifactResolver.resolveArtifact(DefaultArtifactResolver.java:75)
	at org.apache.maven.archetype.downloader.DefaultDownloader.download(DefaultDownloader.java:80)
	at org.apache.maven.archetype.common.DefaultArchetypeArtifactManager.getArchetypeFile(DefaultArchetypeArtifactManager.java:81)
	at org.apache.maven.archetype.old.DefaultOldArchetype.createArchetype(DefaultOldArchetype.java:115)
	at org.apache.maven.archetype.old.ArchetypeTest.testArchetype(ArchetypeTest.java:110)
	at sun.reflect.NativeMethodAccessorImpl.invoke0(Native Method)
	at sun.reflect.NativeMethodAccessorImpl.invoke(NativeMethodAccessorImpl.java:57)
	at sun.reflect.DelegatingMethodAccessorImpl.invoke(DelegatingMethodAccessorImpl.java:43)
	at java.lang.reflect.Method.invoke(Method.java:606)
	at junit.framework.TestCase.runTest(TestCase.java:176)
	at junit.framework.TestCase.runBare(TestCase.java:141)
	at junit.framework.TestResult$1.protect(TestResult.java:122)
	at junit.framework.TestResult.runProtected(TestResult.java:142)
	at junit.framework.TestResult.run(TestResult.java:125)
	at junit.framework.TestCase.run(TestCase.java:129)
	at junit.framework.TestSuite.runTest(TestSuite.java:255)
	at junit.framework.TestSuite.run(TestSuite.java:250)
	at org.junit.internal.runners.JUnit38ClassRunner.run(JUnit38ClassRunner.java:84)
	at org.apache.maven.surefire.junit4.JUnit4Provider.execute(JUnit4Provider.java:365)
	at org.apache.maven.surefire.junit4.JUnit4Provider.executeWithRerun(JUnit4Provider.java:273)
	at org.apache.maven.surefire.junit4.JUnit4Provider.executeTestSet(JUnit4Provider.java:238)
	at org.apache.maven.surefire.junit4.JUnit4Provider.invoke(JUnit4Provider.java:159)
	at org.apache.maven.surefire.booter.ForkedBooter.invokeProviderInSameClassLoader(ForkedBooter.java:379)
	at org.apache.maven.surefire.booter.ForkedBooter.runSuitesInProcess(ForkedBooter.java:340)
	at org.apache.maven.surefire.booter.ForkedBooter.execute(ForkedBooter.java:125)
	at org.apache.maven.surefire.booter.ForkedBooter.main(ForkedBooter.java:413)


FAILED:  org.apache.maven.archetype.test.InternalCatalogArchetypesVerificationTest.windows-jdk7-m3.2.x_build / Build windows-jdk7-m3.2.x_build / testInternalCatalog

Error Message:
org/sonatype/aether/util/ConfigUtils

Stack Trace:
java.lang.NoClassDefFoundError: org/sonatype/aether/util/ConfigUtils
	at org.sonatype.aether.connector.wagon.WagonRepositoryConnector.getPermissions(WagonRepositoryConnector.java:210)
	at org.sonatype.aether.connector.wagon.WagonRepositoryConnector.<init>(WagonRepositoryConnector.java:144)
	at org.sonatype.aether.connector.wagon.WagonRepositoryConnectorFactory.newInstance(WagonRepositoryConnectorFactory.java:142)
	at org.sonatype.aether.impl.internal.DefaultRemoteRepositoryManager.getRepositoryConnector(DefaultRemoteRepositoryManager.java:316)
	at org.sonatype.aether.impl.internal.DefaultArtifactResolver.resolveArtifacts(DefaultArtifactResolver.java:403)
	at org.sonatype.aether.impl.internal.DefaultArtifactResolver.resolveArtifact(DefaultArtifactResolver.java:190)
	at org.apache.maven.repository.internal.DefaultArtifactDescriptorReader.loadPom(DefaultArtifactDescriptorReader.java:259)
	at org.apache.maven.repository.internal.DefaultArtifactDescriptorReader.readArtifactDescriptor(DefaultArtifactDescriptorReader.java:170)
	at org.sonatype.aether.impl.internal.DefaultRepositorySystem.readArtifactDescriptor(DefaultRepositorySystem.java:243)
	at org.apache.maven.shared.transfer.artifact.resolve.internal.Maven30ArtifactResolver.resolveArtifact(Maven30ArtifactResolver.java:104)
	at org.apache.maven.shared.transfer.artifact.resolve.internal.Maven30ArtifactResolver.resolveArtifact(Maven30ArtifactResolver.java:80)
	at org.apache.maven.shared.transfer.artifact.resolve.internal.DefaultArtifactResolver.resolveArtifact(DefaultArtifactResolver.java:75)
	at org.apache.maven.archetype.downloader.DefaultDownloader.download(DefaultDownloader.java:80)
	at org.apache.maven.archetype.common.DefaultArchetypeArtifactManager.exists(DefaultArchetypeArtifactManager.java:247)
	at org.apache.maven.archetype.generator.DefaultArchetypeGenerator.getArchetypeFile(DefaultArchetypeGenerator.java:84)
	at org.apache.maven.archetype.generator.DefaultArchetypeGenerator.generateArchetype(DefaultArchetypeGenerator.java:161)
	at org.apache.maven.archetype.DefaultArchetypeManager.generateProjectFromArchetype(DefaultArchetypeManager.java:75)
	at org.apache.maven.archetype.test.InternalCatalogArchetypesVerificationTest.testInternalCatalog(InternalCatalogArchetypesVerificationTest.java:95)
	at sun.reflect.NativeMethodAccessorImpl.invoke0(Native Method)
	at sun.reflect.NativeMethodAccessorImpl.invoke(NativeMethodAccessorImpl.java:57)
	at sun.reflect.DelegatingMethodAccessorImpl.invoke(DelegatingMethodAccessorImpl.java:43)
	at java.lang.reflect.Method.invoke(Method.java:606)
	at junit.framework.TestCase.runTest(TestCase.java:176)
	at junit.framework.TestCase.runBare(TestCase.java:141)
	at junit.framework.TestResult$1.protect(TestResult.java:122)
	at junit.framework.TestResult.runProtected(TestResult.java:142)
	at junit.framework.TestResult.run(TestResult.java:125)
	at junit.framework.TestCase.run(TestCase.java:129)
	at junit.framework.TestSuite.runTest(TestSuite.java:255)
	at junit.framework.TestSuite.run(TestSuite.java:250)
	at org.junit.internal.runners.JUnit38ClassRunner.run(JUnit38ClassRunner.java:84)
	at org.apache.maven.surefire.junit4.JUnit4Provider.execute(JUnit4Provider.java:365)
	at org.apache.maven.surefire.junit4.JUnit4Provider.executeWithRerun(JUnit4Provider.java:273)
	at org.apache.maven.surefire.junit4.JUnit4Provider.executeTestSet(JUnit4Provider.java:238)
	at org.apache.maven.surefire.junit4.JUnit4Provider.invoke(JUnit4Provider.java:159)
	at org.apache.maven.surefire.booter.ForkedBooter.invokeProviderInSameClassLoader(ForkedBooter.java:379)
	at org.apache.maven.surefire.booter.ForkedBooter.runSuitesInProcess(ForkedBooter.java:340)
	at org.apache.maven.surefire.booter.ForkedBooter.execute(ForkedBooter.java:125)
	at org.apache.maven.surefire.booter.ForkedBooter.main(ForkedBooter.java:413)
Caused by: java.lang.ClassNotFoundException: org.sonatype.aether.util.ConfigUtils
	at java.net.URLClassLoader$1.run(URLClassLoader.java:366)
	at java.net.URLClassLoader$1.run(URLClassLoader.java:355)
	at java.security.AccessController.doPrivileged(Native Method)
	at java.net.URLClassLoader.findClass(URLClassLoader.java:354)
	at java.lang.ClassLoader.loadClass(ClassLoader.java:425)
	at sun.misc.Launcher$AppClassLoader.loadClass(Launcher.java:308)
	at java.lang.ClassLoader.loadClass(ClassLoader.java:358)
	... 39 more


FAILED:  org.apache.maven.archetype.test.InternalCatalogArchetypesVerificationTest.linux-jdk7-m3.2.x_build / Build linux-jdk7-m3.2.x_build / testInternalCatalog

Error Message:
org/sonatype/aether/util/ConfigUtils

Stack Trace:
java.lang.NoClassDefFoundError: org/sonatype/aether/util/ConfigUtils
	at org.sonatype.aether.connector.wagon.WagonRepositoryConnector.getPermissions(WagonRepositoryConnector.java:210)
	at org.sonatype.aether.connector.wagon.WagonRepositoryConnector.<init>(WagonRepositoryConnector.java:144)
	at org.sonatype.aether.connector.wagon.WagonRepositoryConnectorFactory.newInstance(WagonRepositoryConnectorFactory.java:142)
	at org.sonatype.aether.impl.internal.DefaultRemoteRepositoryManager.getRepositoryConnector(DefaultRemoteRepositoryManager.java:316)
	at org.sonatype.aether.impl.internal.DefaultArtifactResolver.resolveArtifacts(DefaultArtifactResolver.java:403)
	at org.sonatype.aether.impl.internal.DefaultArtifactResolver.resolveArtifact(DefaultArtifactResolver.java:190)
	at org.apache.maven.repository.internal.DefaultArtifactDescriptorReader.loadPom(DefaultArtifactDescriptorReader.java:259)
	at org.apache.maven.repository.internal.DefaultArtifactDescriptorReader.readArtifactDescriptor(DefaultArtifactDescriptorReader.java:170)
	at org.sonatype.aether.impl.internal.DefaultRepositorySystem.readArtifactDescriptor(DefaultRepositorySystem.java:243)
	at org.apache.maven.shared.transfer.artifact.resolve.internal.Maven30ArtifactResolver.resolveArtifact(Maven30ArtifactResolver.java:104)
	at org.apache.maven.shared.transfer.artifact.resolve.internal.Maven30ArtifactResolver.resolveArtifact(Maven30ArtifactResolver.java:80)
	at org.apache.maven.shared.transfer.artifact.resolve.internal.DefaultArtifactResolver.resolveArtifact(DefaultArtifactResolver.java:75)
	at org.apache.maven.archetype.downloader.DefaultDownloader.download(DefaultDownloader.java:80)
	at org.apache.maven.archetype.common.DefaultArchetypeArtifactManager.exists(DefaultArchetypeArtifactManager.java:247)
	at org.apache.maven.archetype.generator.DefaultArchetypeGenerator.getArchetypeFile(DefaultArchetypeGenerator.java:84)
	at org.apache.maven.archetype.generator.DefaultArchetypeGenerator.generateArchetype(DefaultArchetypeGenerator.java:161)
	at org.apache.maven.archetype.DefaultArchetypeManager.generateProjectFromArchetype(DefaultArchetypeManager.java:75)
	at org.apache.maven.archetype.test.InternalCatalogArchetypesVerificationTest.testInternalCatalog(InternalCatalogArchetypesVerificationTest.java:95)
	at sun.reflect.NativeMethodAccessorImpl.invoke0(Native Method)
	at sun.reflect.NativeMethodAccessorImpl.invoke(NativeMethodAccessorImpl.java:57)
	at sun.reflect.DelegatingMethodAccessorImpl.invoke(DelegatingMethodAccessorImpl.java:43)
	at java.lang.reflect.Method.invoke(Method.java:606)
	at junit.framework.TestCase.runTest(TestCase.java:176)
	at junit.framework.TestCase.runBare(TestCase.java:141)
	at junit.framework.TestResult$1.protect(TestResult.java:122)
	at junit.framework.TestResult.runProtected(TestResult.java:142)
	at junit.framework.TestResult.run(TestResult.java:125)
	at junit.framework.TestCase.run(TestCase.java:129)
	at junit.framework.TestSuite.runTest(TestSuite.java:255)
	at junit.framework.TestSuite.run(TestSuite.java:250)
	at org.junit.internal.runners.JUnit38ClassRunner.run(JUnit38ClassRunner.java:84)
	at org.apache.maven.surefire.junit4.JUnit4Provider.execute(JUnit4Provider.java:365)
	at org.apache.maven.surefire.junit4.JUnit4Provider.executeWithRerun(JUnit4Provider.java:273)
	at org.apache.maven.surefire.junit4.JUnit4Provider.executeTestSet(JUnit4Provider.java:238)
	at org.apache.maven.surefire.junit4.JUnit4Provider.invoke(JUnit4Provider.java:159)
	at org.apache.maven.surefire.booter.ForkedBooter.invokeProviderInSameClassLoader(ForkedBooter.java:379)
	at org.apache.maven.surefire.booter.ForkedBooter.runSuitesInProcess(ForkedBooter.java:340)
	at org.apache.maven.surefire.booter.ForkedBooter.execute(ForkedBooter.java:125)
	at org.apache.maven.surefire.booter.ForkedBooter.main(ForkedBooter.java:413)
Caused by: java.lang.ClassNotFoundException: org.sonatype.aether.util.ConfigUtils
	at java.net.URLClassLoader$1.run(URLClassLoader.java:366)
	at java.net.URLClassLoader$1.run(URLClassLoader.java:355)
	at java.security.AccessController.doPrivileged(Native Method)
	at java.net.URLClassLoader.findClass(URLClassLoader.java:354)
	at java.lang.ClassLoader.loadClass(ClassLoader.java:425)
	at sun.misc.Launcher$AppClassLoader.loadClass(Launcher.java:308)
	at java.lang.ClassLoader.loadClass(ClassLoader.java:358)
	... 39 more




Build log:
[...truncated 3142 lines...]
[ERROR] *  include-file-with-no-extension\pom.xml
[ERROR] *  included-system-properties\pom.xml
[ERROR] *  property-setting-cli\pom.xml
[ERROR] *  roundtrip-1-project
[ERROR] *  roundtrip-multi\pom.xml
[INFO] -------------------------------------------------
[INFO] ------------------------------------------------------------------------
[INFO] Reactor Summary:
[INFO] 
[INFO] Maven Archetype .................................... SUCCESS [  4.563 s]
[INFO] Maven Archetype Models ............................. SUCCESS [  0.538 s]
[INFO] Maven Archetype Catalog Model ...................... SUCCESS [  2.763 s]
[INFO] Maven Archetype Descriptor Model ................... SUCCESS [  1.748 s]
[INFO] Maven Archetype Common ............................. SUCCESS [ 21.105 s]
[INFO] Maven Archetype Packaging .......................... SUCCESS [  0.547 s]
[INFO] Maven Archetype Plugin ............................. FAILURE [03:06 min]
[INFO] ------------------------------------------------------------------------
[INFO] BUILD FAILURE
[INFO] ------------------------------------------------------------------------
[INFO] Total time: 03:38 min
[INFO] Finished at: 2019-08-12T14:48:57-07:00
[INFO] Final Memory: 63M/1027M
[INFO] ------------------------------------------------------------------------
[INFO] [jenkins-event-spy] Generated F:\short\jenkins-maven-box-maven-archetype-buildfix-35@tmp\withMavenb2e3b070\maven-spy-20190812-144518-194191639360152183623.log
[ERROR] Failed to execute goal org.apache.maven.plugins:maven-invoker-plugin:3.2.0:verify (invoker-verify) on project maven-archetype-plugin: 21 builds failed. See console output above for details. -> [Help 1]
org.apache.maven.lifecycle.LifecycleExecutionException: Failed to execute goal org.apache.maven.plugins:maven-invoker-plugin:3.2.0:verify (invoker-verify) on project maven-archetype-plugin: 21 builds failed. See console output above for details.
	at org.apache.maven.lifecycle.internal.MojoExecutor.execute(MojoExecutor.java:212)
	at org.apache.maven.lifecycle.internal.MojoExecutor.execute(MojoExecutor.java:153)
	at org.apache.maven.lifecycle.internal.MojoExecutor.execute(MojoExecutor.java:145)
	at org.apache.maven.lifecycle.internal.LifecycleModuleBuilder.buildProject(LifecycleModuleBuilder.java:116)
	at org.apache.maven.lifecycle.internal.LifecycleModuleBuilder.buildProject(LifecycleModuleBuilder.java:80)
	at org.apache.maven.lifecycle.internal.builder.singlethreaded.SingleThreadedBuilder.build(SingleThreadedBuilder.java:51)
	at org.apache.maven.lifecycle.internal.LifecycleStarter.execute(LifecycleStarter.java:120)
	at org.apache.maven.DefaultMaven.doExecute(DefaultMaven.java:355)
	at org.apache.maven.DefaultMaven.execute(DefaultMaven.java:155)
	at org.apache.maven.cli.MavenCli.execute(MavenCli.java:584)
	at org.apache.maven.cli.MavenCli.doMain(MavenCli.java:216)
	at org.apache.maven.cli.MavenCli.main(MavenCli.java:160)
	at sun.reflect.NativeMethodAccessorImpl.invoke0(Native Method)
	at sun.reflect.NativeMethodAccessorImpl.invoke(NativeMethodAccessorImpl.java:57)
	at sun.reflect.DelegatingMethodAccessorImpl.invoke(DelegatingMethodAccessorImpl.java:43)
	at java.lang.reflect.Method.invoke(Method.java:606)
	at org.codehaus.plexus.classworlds.launcher.Launcher.launchEnhanced(Launcher.java:289)
	at org.codehaus.plexus.classworlds.launcher.Launcher.launch(Launcher.java:229)
	at org.codehaus.plexus.classworlds.launcher.Launcher.mainWithExitCode(Launcher.java:415)
	at org.codehaus.plexus.classworlds.launcher.Launcher.main(Launcher.java:356)
Caused by: org.apache.maven.plugin.MojoFailureException: 21 builds failed. See console output above for details.
	at org.apache.maven.plugins.invoker.InvokerSession.handleFailures(InvokerSession.java:260)
	at org.apache.maven.plugins.invoker.VerifyMojo.execute(VerifyMojo.java:140)
	at org.apache.maven.plugin.DefaultBuildPluginManager.executeMojo(DefaultBuildPluginManager.java:132)
	at org.apache.maven.lifecycle.internal.MojoExecutor.execute(MojoExecutor.java:208)
	... 19 more
[ERROR] 
[ERROR] Re-run Maven using the -X switch to enable full debug logging.
[ERROR] 
[ERROR] For more information about the errors and possible solutions, please read the following articles:
[ERROR] [Help 1] http://cwiki.apache.org/confluence/display/MAVEN/MojoFailureException
[ERROR] 
[ERROR] After correcting the problems, you can resume the build with the command
[ERROR]   mvn <goals> -rf :maven-archetype-plugin
Picked up JAVA_TOOL_OPTIONS: -Dmaven.ext.class.path="F:\short\jenkins-maven-box-maven-archetype-buildfix-35@tmp\withMavenb2e3b070\pipeline-maven-spy.jar" -Dorg.jenkinsci.plugins.pipeline.maven.reportsFolder="F:\short\jenkins-maven-box-maven-archetype-buildfix-35@tmp\withMavenb2e3b070" 
[Pipeline] }
[Pipeline] // dir
[Pipeline] }
[withMaven] artifactsPublisher - Archive artifact j7m3.2.xb\pom.xml under org\apache\maven\archetype\maven-archetype\3.1.2-SNAPSHOT\maven-archetype-3.1.2-SNAPSHOT.pom
[withMaven] artifactsPublisher - Archive artifact j7m3.2.xb\target\maven-archetype-3.1.2-SNAPSHOT-site.xml under org\apache\maven\archetype\maven-archetype\3.1.2-SNAPSHOT\maven-archetype-3.1.2-SNAPSHOT-site.xml
[withMaven] artifactsPublisher - Archive artifact j7m3.2.xb\archetype-models\pom.xml under org\apache\maven\archetype\archetype-models\3.1.2-SNAPSHOT\archetype-models-3.1.2-SNAPSHOT.pom
[withMaven] artifactsPublisher - Archive artifact j7m3.2.xb\archetype-models\target\archetype-models-3.1.2-SNAPSHOT-site.xml under org\apache\maven\archetype\archetype-models\3.1.2-SNAPSHOT\archetype-models-3.1.2-SNAPSHOT-site.xml
[withMaven] artifactsPublisher - Archive artifact j7m3.2.xb\archetype-models\archetype-catalog\pom.xml under org\apache\maven\archetype\archetype-catalog\3.1.2-SNAPSHOT\archetype-catalog-3.1.2-SNAPSHOT.pom
[withMaven] artifactsPublisher - Archive artifact j7m3.2.xb\archetype-models\archetype-catalog\target\archetype-catalog-3.1.2-SNAPSHOT.jar under org\apache\maven\archetype\archetype-catalog\3.1.2-SNAPSHOT\archetype-catalog-3.1.2-SNAPSHOT.jar
[withMaven] artifactsPublisher - Archive artifact j7m3.2.xb\archetype-models\archetype-descriptor\pom.xml under org\apache\maven\archetype\archetype-descriptor\3.1.2-SNAPSHOT\archetype-descriptor-3.1.2-SNAPSHOT.pom
[withMaven] artifactsPublisher - Archive artifact j7m3.2.xb\archetype-models\archetype-descriptor\target\archetype-descriptor-3.1.2-SNAPSHOT.jar under org\apache\maven\archetype\archetype-descriptor\3.1.2-SNAPSHOT\archetype-descriptor-3.1.2-SNAPSHOT.jar
[withMaven] artifactsPublisher - Archive artifact j7m3.2.xb\archetype-common\pom.xml under org\apache\maven\archetype\archetype-common\3.1.2-SNAPSHOT\archetype-common-3.1.2-SNAPSHOT.pom
[withMaven] artifactsPublisher - Archive artifact j7m3.2.xb\archetype-common\target\archetype-common-3.1.2-SNAPSHOT.jar under org\apache\maven\archetype\archetype-common\3.1.2-SNAPSHOT\archetype-common-3.1.2-SNAPSHOT.jar
[withMaven] artifactsPublisher - Archive artifact j7m3.2.xb\archetype-packaging\pom.xml under org\apache\maven\archetype\archetype-packaging\3.1.2-SNAPSHOT\archetype-packaging-3.1.2-SNAPSHOT.pom
[withMaven] artifactsPublisher - Archive artifact j7m3.2.xb\archetype-packaging\target\archetype-packaging-3.1.2-SNAPSHOT.jar under org\apache\maven\archetype\archetype-packaging\3.1.2-SNAPSHOT\archetype-packaging-3.1.2-SNAPSHOT.jar
[withMaven] junitPublisher - Archive test results for Maven artifact org.apache.maven.archetype:archetype-catalog:jar:3.1.2-SNAPSHOT generated by maven-surefire-plugin:test (default-test): j7m3.2.xb\archetype-models\archetype-catalog\target\surefire-reports\*.xml
[withMaven] junitPublisher - Archive test results for Maven artifact org.apache.maven.archetype:archetype-descriptor:jar:3.1.2-SNAPSHOT generated by maven-surefire-plugin:test (default-test): j7m3.2.xb\archetype-models\archetype-descriptor\target\surefire-reports\*.xml
[withMaven] junitPublisher - Archive test results for Maven artifact org.apache.maven.archetype:archetype-common:jar:3.1.2-SNAPSHOT generated by maven-surefire-plugin:test (default-test): j7m3.2.xb\archetype-common\target\surefire-reports\*.xml
[withMaven] junitPublisher - Archive test results for Maven artifact org.apache.maven.archetype:archetype-packaging:jar:3.1.2-SNAPSHOT generated by maven-surefire-plugin:test (default-test): j7m3.2.xb\archetype-packaging\target\surefire-reports\*.xml
[withMaven] junitPublisher - Archive test results for Maven artifact org.apache.maven.plugins:maven-archetype-plugin:maven-plugin:3.1.2-SNAPSHOT generated by maven-surefire-plugin:test (default-test): j7m3.2.xb\maven-archetype-plugin\target\surefire-reports\*.xml
Recording test results
[withMaven] openTasksPublisher - Scan Tasks for Maven artifact org.apache.maven.archetype:archetype-common:jar:3.1.2-SNAPSHOT in source directory j7m3.2.xb\archetype-common\src\main\java
[withMaven] openTasksPublisher - Scan Tasks for Maven artifact org.apache.maven.plugins:maven-archetype-plugin:maven-plugin:3.1.2-SNAPSHOT in source directory j7m3.2.xb\maven-archetype-plugin\src\main\java
[TASKS] Scanning folder 'F:\short\jenkins-maven-box-maven-archetype-buildfix-35' for files matching the pattern 'j7m3.2.xb\archetype-common\src\main\java\**\*,j7m3.2.xb\maven-archetype-plugin\src\main\java\**\*' - excludes: null
[TASKS] Found 89 files to scan for tasks
[TASKS] Found 26 open tasks.
Skipping warnings blame since pipelines do not have an SCM link.%n
[TASKS] Computing warning deltas based on reference build #29
[withMaven] invokerPublisher - Archive invoker results for Maven artifact MavenArtifact{org.apache.maven.plugins:maven-archetype-plugin:maven-plugin:3.1.2-SNAPSHOT(version: 3.1.2-SNAPSHOT, snapshot:false) } generated by PluginInvocation{org.apache.maven.plugins:maven-invoker-plugin:3.2.0@integration-test  invoker-it}: j7m3.2.xb\maven-archetype-plugin\target\invoker-reports\*.xml
[INFO] run post-build script verify.groovy
[INFO]           ARCHETYPE-536_groovy-grape/pom.xml ............... SUCCESS (10.3 s)
[INFO] Building: build-ignore-eol/pom.xml
[INFO] run pre-build script setup.bsh
[withMaven] Publishers: Generated Artifacts Publisher: 292 ms, Junit Publisher: 347 ms, Open Task Scanner Publisher: 334 ms, Dependencies Fingerprint Publisher: 66 ms, Invoker Publisher: 10392 ms, Pipeline Graph Publisher: 10 ms
[Pipeline] // withMaven
[Pipeline] dir
Running in F:\short\jenkins-maven-box-maven-archetype-buildfix-35\j7m3.2.xb
[Pipeline] {
[Pipeline] zip
Writing zip file of F:\short\jenkins-maven-box-maven-archetype-buildfix-35\j7m3.2.xb\maven-archetype-plugin\target\it\projects to F:\short\jenkins-maven-box-maven-archetype-buildfix-35\j7m3.2.xb\archetype-plugin-its-j7m3.2.xb.zip
Zipped 483 entries.
Archiving F:\short\jenkins-maven-box-maven-archetype-buildfix-35\j7m3.2.xb\archetype-plugin-its-j7m3.2.xb.zip
[Pipeline] zip
Writing zip file of F:\short\jenkins-maven-box-maven-archetype-buildfix-35\j7m3.2.xb\maven-archetype-plugin\target\local-repo to F:\short\jenkins-maven-box-maven-archetype-buildfix-35\j7m3.2.xb\local-repo-j7m3.2.xb.zip
Zipped 297 entries.
Archiving F:\short\jenkins-maven-box-maven-archetype-buildfix-35\j7m3.2.xb\local-repo-j7m3.2.xb.zip
[Pipeline] zip
Writing zip file of F:\short\jenkins-maven-box-maven-archetype-buildfix-35\j7m3.2.xb\maven-archetype-plugin\target\mock-repo to F:\short\jenkins-maven-box-maven-archetype-buildfix-35\j7m3.2.xb\mock-repo-j7m3.2.xb.zip
Zipped 5 entries.
Archiving F:\short\jenkins-maven-box-maven-archetype-buildfix-35\j7m3.2.xb\mock-repo-j7m3.2.xb.zip
[Pipeline] zip
Writing zip file of F:\short\jenkins-maven-box-maven-archetype-buildfix-35\j7m3.2.xb\maven-archetype-plugin\target\archetype-repo to F:\short\jenkins-maven-box-maven-archetype-buildfix-35\j7m3.2.xb\archetype-repo-j7m3.2.xb.zip
Zipped 5 entries.
Archiving F:\short\jenkins-maven-box-maven-archetype-buildfix-35\j7m3.2.xb\archetype-repo-j7m3.2.xb.zip
[Pipeline] }
[Pipeline] // dir
[Pipeline] cleanWs
[WS-CLEANUP] Deleting project workspace...
[WS-CLEANUP] Deferred wipeout is used...
[WS-CLEANUP] done
[Pipeline] cleanWs
[WS-CLEANUP] Deleting project workspace...
[WS-CLEANUP] Deferred wipeout is used...
[WS-CLEANUP] done
[Pipeline] }
[Pipeline] // stage
[Pipeline] }
[Pipeline] // ws
[Pipeline] }
[Pipeline] // node
[Pipeline] }
Failed in branch windows-jdk7-m3.2.x_build
[INFO] run post-build script verify.bsh
[INFO]           build-ignore-eol/pom.xml ......................... SUCCESS (21.4 s)
[INFO] Building: create-1/pom.xml
[INFO] run post-build script verify.groovy
[INFO]           create-1/pom.xml ................................. SUCCESS (8.8 s)
[INFO] Building: ARCHETYPE-241_filter-directory/pom.xml
[INFO] run post-build script verify.groovy
[INFO]           ARCHETYPE-241_filter-directory/pom.xml ........... SUCCESS (9.6 s)
[INFO] Building: create-4/pom.xml
[INFO] run post-build script verify.groovy
[INFO]           create-4/pom.xml ................................. SUCCESS (8.5 s)
[INFO] Building: exclude-patterns/pom.xml
[INFO] run post-build script verify.groovy
[INFO]           exclude-patterns/pom.xml ......................... SUCCESS (8.6 s)
[INFO] Building: generate-basic
[INFO] run post-build script verify.bsh
[INFO]           generate-basic ................................... SUCCESS (4.2 s)
[INFO] Building: create-3/pom.xml
[INFO] run post-build script verify.groovy
[INFO]           create-3/pom.xml ................................. SUCCESS (9.4 s)
[INFO] Building: roundtrip-multi/pom.xml
[INFO] run post-build script verify.groovy
[INFO]           roundtrip-multi/pom.xml .......................... SUCCESS (18.6 s)
[INFO] 
[INFO] --- mrm-maven-plugin:1.2.0:stop (mirror) @ maven-archetype-plugin ---
[INFO] Stopping Mock Repository Manager on http://localhost:40460
[INFO] Stopped SocketConnector@0.0.0.0:40460
[INFO] Mock Repository Manager http://localhost:40460 is stopped.
[INFO] 
[INFO] --- mrm-maven-plugin:1.2.0:stop (archetype-repository) @ maven-archetype-plugin ---
[INFO] Stopping Mock Repository Manager on http://localhost:35048
[INFO] Stopped SocketConnector@0.0.0.0:35048
[INFO] Mock Repository Manager http://localhost:35048 is stopped.
[INFO] 
[INFO] --- maven-checkstyle-plugin:3.0.0:check (checkstyle-check) @ maven-archetype-plugin ---
[INFO] There are 46 errors reported by Checkstyle 6.18 with config/maven_checks.xml ruleset.
[INFO] Ignored 46 errors, 0 violation remaining.
[INFO] 
[INFO] --- maven-invoker-plugin:3.2.0:verify (invoker-verify) @ maven-archetype-plugin ---
[INFO] -------------------------------------------------
[INFO] Build Summary:
[INFO]   Passed: 25, Failed: 0, Errors: 0, Skipped: 0
[INFO] -------------------------------------------------
[INFO] ------------------------------------------------------------------------
[INFO] Reactor Summary:
[INFO] 
[INFO] Maven Archetype .................................... SUCCESS [  6.031 s]
[INFO] Maven Archetype Models ............................. SUCCESS [  0.823 s]
[INFO] Maven Archetype Catalog Model ...................... SUCCESS [  3.396 s]
[INFO] Maven Archetype Descriptor Model ................... SUCCESS [  1.111 s]
[INFO] Maven Archetype Common ............................. SUCCESS [ 17.050 s]
[INFO] Maven Archetype Packaging .......................... SUCCESS [  0.532 s]
[INFO] Maven Archetype Plugin ............................. SUCCESS [04:45 min]
[INFO] ------------------------------------------------------------------------
[INFO] BUILD SUCCESS
[INFO] ------------------------------------------------------------------------
[INFO] Total time: 05:15 min
[INFO] Finished at: 2019-08-12T21:50:36+00:00
[INFO] Final Memory: 83M/3483M
[INFO] ------------------------------------------------------------------------
[INFO] [jenkins-event-spy] Generated /home/jenkins/jenkins-slave/workspace/ven-box_maven-archetype_buildfix@2@tmp/withMaven1d0e14d8/maven-spy-20190812-214521-2537919977696927536133.log
[Pipeline] }
[Pipeline] // dir
[Pipeline] }
[withMaven] artifactsPublisher - Archive artifact linux-jdk7-m3.2.x_build/pom.xml under org/apache/maven/archetype/maven-archetype/3.1.2-SNAPSHOT/maven-archetype-3.1.2-SNAPSHOT.pom
[withMaven] artifactsPublisher - Archive artifact linux-jdk7-m3.2.x_build/target/maven-archetype-3.1.2-SNAPSHOT-site.xml under org/apache/maven/archetype/maven-archetype/3.1.2-SNAPSHOT/maven-archetype-3.1.2-SNAPSHOT-site.xml
[withMaven] artifactsPublisher - Archive artifact linux-jdk7-m3.2.x_build/archetype-models/pom.xml under org/apache/maven/archetype/archetype-models/3.1.2-SNAPSHOT/archetype-models-3.1.2-SNAPSHOT.pom
[withMaven] artifactsPublisher - Archive artifact linux-jdk7-m3.2.x_build/archetype-models/target/archetype-models-3.1.2-SNAPSHOT-site.xml under org/apache/maven/archetype/archetype-models/3.1.2-SNAPSHOT/archetype-models-3.1.2-SNAPSHOT-site.xml
[withMaven] artifactsPublisher - Archive artifact linux-jdk7-m3.2.x_build/archetype-models/archetype-catalog/pom.xml under org/apache/maven/archetype/archetype-catalog/3.1.2-SNAPSHOT/archetype-catalog-3.1.2-SNAPSHOT.pom
[withMaven] artifactsPublisher - Archive artifact linux-jdk7-m3.2.x_build/archetype-models/archetype-catalog/target/archetype-catalog-3.1.2-SNAPSHOT.jar under org/apache/maven/archetype/archetype-catalog/3.1.2-SNAPSHOT/archetype-catalog-3.1.2-SNAPSHOT.jar
[withMaven] artifactsPublisher - Archive artifact linux-jdk7-m3.2.x_build/archetype-models/archetype-descriptor/pom.xml under org/apache/maven/archetype/archetype-descriptor/3.1.2-SNAPSHOT/archetype-descriptor-3.1.2-SNAPSHOT.pom
[withMaven] artifactsPublisher - Archive artifact linux-jdk7-m3.2.x_build/archetype-models/archetype-descriptor/target/archetype-descriptor-3.1.2-SNAPSHOT.jar under org/apache/maven/archetype/archetype-descriptor/3.1.2-SNAPSHOT/archetype-descriptor-3.1.2-SNAPSHOT.jar
[withMaven] artifactsPublisher - Archive artifact linux-jdk7-m3.2.x_build/archetype-common/pom.xml under org/apache/maven/archetype/archetype-common/3.1.2-SNAPSHOT/archetype-common-3.1.2-SNAPSHOT.pom
[withMaven] artifactsPublisher - Archive artifact linux-jdk7-m3.2.x_build/archetype-common/target/archetype-common-3.1.2-SNAPSHOT.jar under org/apache/maven/archetype/archetype-common/3.1.2-SNAPSHOT/archetype-common-3.1.2-SNAPSHOT.jar
[withMaven] artifactsPublisher - Archive artifact linux-jdk7-m3.2.x_build/archetype-packaging/pom.xml under org/apache/maven/archetype/archetype-packaging/3.1.2-SNAPSHOT/archetype-packaging-3.1.2-SNAPSHOT.pom
[withMaven] artifactsPublisher - Archive artifact linux-jdk7-m3.2.x_build/archetype-packaging/target/archetype-packaging-3.1.2-SNAPSHOT.jar under org/apache/maven/archetype/archetype-packaging/3.1.2-SNAPSHOT/archetype-packaging-3.1.2-SNAPSHOT.jar
[withMaven] artifactsPublisher - Archive artifact linux-jdk7-m3.2.x_build/maven-archetype-plugin/pom.xml under org/apache/maven/plugins/maven-archetype-plugin/3.1.2-SNAPSHOT/maven-archetype-plugin-3.1.2-SNAPSHOT.pom
[withMaven] artifactsPublisher - Archive artifact linux-jdk7-m3.2.x_build/maven-archetype-plugin/target/maven-archetype-plugin-3.1.2-SNAPSHOT.jar under org/apache/maven/plugins/maven-archetype-plugin/3.1.2-SNAPSHOT/maven-archetype-plugin-3.1.2-SNAPSHOT.jar
[withMaven] junitPublisher - Archive test results for Maven artifact org.apache.maven.archetype:archetype-catalog:jar:3.1.2-SNAPSHOT generated by maven-surefire-plugin:test (default-test): linux-jdk7-m3.2.x_build/archetype-models/archetype-catalog/target/surefire-reports/*.xml
[withMaven] junitPublisher - Archive test results for Maven artifact org.apache.maven.archetype:archetype-descriptor:jar:3.1.2-SNAPSHOT generated by maven-surefire-plugin:test (default-test): linux-jdk7-m3.2.x_build/archetype-models/archetype-descriptor/target/surefire-reports/*.xml
[withMaven] junitPublisher - Archive test results for Maven artifact org.apache.maven.archetype:archetype-common:jar:3.1.2-SNAPSHOT generated by maven-surefire-plugin:test (default-test): linux-jdk7-m3.2.x_build/archetype-common/target/surefire-reports/*.xml
[withMaven] junitPublisher - Archive test results for Maven artifact org.apache.maven.archetype:archetype-packaging:jar:3.1.2-SNAPSHOT generated by maven-surefire-plugin:test (default-test): linux-jdk7-m3.2.x_build/archetype-packaging/target/surefire-reports/*.xml
[withMaven] junitPublisher - Archive test results for Maven artifact org.apache.maven.plugins:maven-archetype-plugin:maven-plugin:3.1.2-SNAPSHOT generated by maven-surefire-plugin:test (default-test): linux-jdk7-m3.2.x_build/maven-archetype-plugin/target/surefire-reports/*.xml
Recording test results
[withMaven] openTasksPublisher - Scan Tasks for Maven artifact org.apache.maven.archetype:archetype-common:jar:3.1.2-SNAPSHOT in source directory linux-jdk7-m3.2.x_build/archetype-common/src/main/java
[withMaven] openTasksPublisher - Scan Tasks for Maven artifact org.apache.maven.plugins:maven-archetype-plugin:maven-plugin:3.1.2-SNAPSHOT in source directory linux-jdk7-m3.2.x_build/maven-archetype-plugin/src/main/java
[TASKS] Scanning folder '/home/jenkins/jenkins-slave/workspace/ven-box_maven-archetype_buildfix@2' for files matching the pattern 'linux-jdk7-m3.2.x_build/archetype-common/src/main/java/**/*,linux-jdk7-m3.2.x_build/maven-archetype-plugin/src/main/java/**/*' - excludes: null
[TASKS] Found 89 files to scan for tasks
[TASKS] Found 26 open tasks.
Skipping warnings blame since pipelines do not have an SCM link.%n
[TASKS] Computing warning deltas based on reference build #29
[withMaven] invokerPublisher - Archive invoker results for Maven artifact MavenArtifact{org.apache.maven.plugins:maven-archetype-plugin:maven-plugin:3.1.2-SNAPSHOT(version: 3.1.2-SNAPSHOT, snapshot:false) } generated by PluginInvocation{org.apache.maven.plugins:maven-invoker-plugin:3.2.0@integration-test  invoker-it}: linux-jdk7-m3.2.x_build/maven-archetype-plugin/target/invoker-reports/*.xml
[withMaven] Publishers: Generated Artifacts Publisher: 5809 ms, Junit Publisher: 7906 ms, Open Task Scanner Publisher: 3544 ms, Dependencies Fingerprint Publisher: 1520 ms, Invoker Publisher: 23855 ms, Pipeline Graph Publisher: 6 ms
[Pipeline] // withMaven
[Pipeline] cleanWs
[WS-CLEANUP] Deleting project workspace...
[WS-CLEANUP] Deferred wipeout is used...
[WS-CLEANUP] done
[Pipeline] }
[Pipeline] // stage
[Pipeline] }
[Pipeline] // ws
[Pipeline] }
[Pipeline] // node
[Pipeline] }
[Pipeline] // parallel
[Pipeline] stage
[Pipeline] { (Notifications)
[Pipeline] echo
Build result: FAILURE
[Pipeline] jiraIssueSelector
[Pipeline] echo
The authors of changes [tibordigana].
[Pipeline] echo
Sending email ...
[Pipeline] emailext
Mime
  • Unnamed multipart/mixed (inline, None, 0 bytes)
View raw message